{"text_format":"1","workbook":"xlsx","n_sheets":7,"sheets":["1. Searching Hubs","2. Search results","2. Main sheet","3. Geographical scope","4. Resource types","5. Decisions","6. Sector"],"not_rendered":{"charts":0,"images":16,"macros":1,"external_links":2,"defined_names":5,"comments":0,"pivot_tables":0},"unopened":[],"bounds":{"document_bytes":16777216,"sheet_cells":100000,"rows_first":2000,"rows_last":500,"rows_between":2000,"halvings":0,"cell_chars":16384,"cell_head_chars":4096},"cells_cut":0,"cells_raw":0,"read":"whole","date_system":"1900"}

{"sheet":"1. Searching Hubs","index":0,"n_rows":349,"n_cols":51,"rows_kept":349,"cut":false,"hidden":false,"merged":[[5,3,6,9],[5,11,7,12],[8,7,9,7],[9,3,9,4],[2,3,2,12],[30,3,30,6],[31,4,31,9],[13,4,13,9],[20,6,22,6],[20,7,22,7],[20,8,22,8],[20,9,22,9],[24,4,24,5],[16,3,16,4],[16,9,16,10],[17,6,18,6],[17,7,18,7],[17,8,18,8],[17,9,18,9],[17,10,18,10]]}
[1,2,3,4,5,6,7,8,9,10,11,12,13,14,15,16,17,18,19,20,21,22,23,24,25,26,27,28,29,30,31,32,33,34,35,36,37,38,39,40,41,42,43,44,45,46,47,48,49,50]
[]
[null,null,null,"Living Hub of COVID-19 Knowledge Hubs"]
[]
[null,null,null,"WELCOME!",null,null,null,null,null,null,null,"Contribute"]
[null,null,null,"This database provides a living hub of existing COVID-19 knowledge repositories",null,null,null,null,null,null,null,"If you are aware of a hub that you feel that is missing please contact us covid-end@mcmaster.ca"]
[]
[null,null,null,null,null,null,{"$f":"COUNTIF('2. Main sheet'!$V:$V,\"Include\")","v":214}]
[null,null,null,null,null,null,"hubs included"]
[null,null,null,"Last updated:"]
{"$rows_left_out":340}
{"sheet":"2. Search results","index":1,"n_rows":88,"n_cols":10,"rows_kept":88,"cut":false,"hidden":false,"merged":[[1,10,87,16],[4,3,5,9],[9,5,9,6],[13,5,13,6],[14,5,14,6],[70,5,70,9],[83,5,83,6],[43,3,45,3],[26,4,26,6],[27,4,27,6],[85,4,85,6],[1,3,1,9],[1,0,87,1],[40,3,40,6],[41,3,41,6],[42,3,42,6],[43,4,43,6],[44,4,44,6],[35,4,35,6],[36,4,36,6],[37,4,37,6],[38,3,38,6],[39,3,39,6],[28,4,28,6],[32,4,32,6],[33,4,33,6],[31,4,31,6],[29,4,29,6],[34,4,34,6],[26,3,27,3],[45,4,45,6],[30,4,30,6],[33,3,37,3],[28,3,32,3]]}
["Johns Hopkins University and Medicine Coronavirus Resource Center",{"$f":"VLOOKUP(A1,'2. Main sheet'!E:F,2,0)","v":"https://coronavirus.jhu.edu/"}]
[null,null,null,{"$f":"HYPERLINK(B1,A1)","v":"Johns Hopkins University and Medicine Coronavirus Resource Center"}]
[]
[null,null,null,"DESCRIPTION"]
[null,null,null,{"$f":"VLOOKUP(A1,'2. Main sheet'!E:G,3,0)","v":"Johns Hopkins experts in global public health, infectious disease, and emergency preparedness have been at the forefront of the international response to COVID-19.\nThis website is a resource to help advance the understanding of the virus, inform the public, and brief policymakers in order to guide a response, improve care, and save lives."}]
[]
[null,null,null,"This is a",{"$f":"VLOOKUP(A1,'2. Main sheet'!E:Z,22,0)","v":"Public"},"institution governed as a",{"$f":"VLOOKUP(A1,'2. Main sheet'!E:X,20,0)","v":"Academic institution"},"with a",{"$f":"VLOOKUP(A1,'2. Main sheet'!E:H,4,0)","v":"Global "},"scope"]
[]
[null,null,null,"CONTACT WITH POLICYMAKERS"]
[null,null,null,"This Hub",{"$f":"+IF(VLOOKUP(A1,'2. Main sheet'!E:T,16,0)=\"Yes\",\"answers\",\"does not answer\")","v":"answers"},"questions from policymakers"]
{"$rows_left_out":79}
{"sheet":"2. Main sheet","index":2,"n_rows":216,"n_cols":85,"rows_kept":216,"cut":false,"hidden":true,"merged":[[0,8,0,13],[0,14,0,17],[0,73,0,79],[0,53,0,61],[0,50,0,52]]}
[null,null,null,null,1.1000000000000001,1.2,1.3,1.4,"1.5 Geographical classification",null,null,null,null,null,"1.6 Income classification",null,null,null,2.1,2.2000000000000002,2.2999999999999998,2.4,2.5,3.1,"3.1.1.",3.2,"4.1.1","4.1.2","4.2.1","4.2.2","4.2.3","4.2.4","4.2.5","4.3.1","4.3.2","4.3.3","4.3.4","4.3.5","4. Resources available: Recommendations or guidance , evidence synthesis and single studies",4.4000000000000004,4.5,4.5999999999999996,4.7,4.8,4.9000000000000004,4.0999999999999996,4.1100000000000003,4.12,6.1,6.2,"6.3 Measuring the likely impact of the pandemic",null,null,"6.4 Options to manage the spread of the pandemic",null,null,null,null,null,null,null,null,7.1,7.2,7.3,7.4,7.5,7.6,7.7,7.8,7.9,7.1,7.11,"7.12 Format in which the resources are presented",null,null,null,null,null,null,7.13,7.14,7.15,7.16]
[null,"Person extracting",null,null,"Name of hub","Hub URL","Short description of the Hub","Geographical scope of the Hub","AFRO","EMRO","EURO","PAHO","SEARO","WPRO","Low-income","Lower-middle-income","Upper-middle-income","High-income","COVID-19 Knowledge Hub?","Scope (public policymaking?)","Category","Include/Exclude","Reason for exclude","Governance","Other specify","Type","Recommendations or guidance that used evidence syntheses","Recommendations or guidance not reporting using evidence syntheses","Systematic reviews","Evidence maps","Rapid reviews","Evidence syntheses building on systematic reviews","Protocols of systematic reviews that are underway","Clinical trials","Searchable databases of single studies and often systematic reviews as well","Other primary research studies","Pre-print services","Protocols of single studies that are underway",null,"Analyses of primary data","Expert opinions","Training resources and events","Government responses","Funding opportunities","Research methods","Books or handbooks","Research projects _ output not clear at the moment","Other (specify)","Measuring the evolvement and spread of the pandemic","General characteristics of the virus","Health outcomes","Social outcomes","Economic outcomes","Vaccine development","Social distancing","Social isolation and lockdowns\n","Travel advice","Closure of non-essential businesses","Individual measures (e.g., hygiene, wearing face-masks)","Tracking cases and contacts","Early diagnosis and testing","Clinical management","Search function","Filters","Geographic filters","Last update","Date checked","Total number of resources available","Language(s) of the website","Language of the resources available","Sectors","Non-health sector","Response mechanism for policymakers","Text (html)","Text (document)","Video","Audio (podcast)","Visualisation","External links","Other(speficy)","Open access","Newsletter/bulletins available","Time stamp","Quality","Time taken"]
["28/05/2020","Andile",{"$f":"IFERROR(RANK(D3,D:D,1),\"\")","v":""},{"$f":"IFERROR(FINDB('1. Searching Hubs'!$E$14, E3)+ROW()/100000,\"\")","v":""},"(USA) White House Call to Action to the Tech Community on New Machine Readable COVID-19 Dataset","https://www.coronavirus.gov/","The United States of America`s information portal and news updates for coronavirus diseas related issues.","National","No","No","No","Yes","No","No","No","No","No","Yes","Yes","Yes","First category (at least one: having documents, epi info, or government responses)","Include","N/A","Governments and public institutions","N/A","Public","No","Yes",0,0,0,0,0,0,0,0,0,0,0,"No","No","No","Yes","No","No","No",0,"N/A","No","No","No","No","No",0,0,0,0,0,0,0,0,0,"No","No","No","Unclear","28/05/2020","Unclear","English","English",0,"No","No","No","Yes","Yes","No","No","External links_Other hubs","N/A","Yes","No","Last update of the document","No"]
[null,"Nkuli","",{"$f":"IFERROR(SEARCH('1. Searching Hubs'!$E$14, E4)+ROW()/100000,\"\")","v":""},"Africa Evidence Network Hub","https://www.africaevidencenetwork.org/en/eidm-during-covid-19","As champions in advocating for the use of evidence in decision-making, the COVID-19 pandemic presents each AEN member with an opportunity to advocate for evidence-use during these trying times. The AEN has therefore created a special page to support this cause.\n \n The AEN will curate new evidence, examples of evidence-use, and experiences of evidence-use on the African continent during COVID-19 to share with our and your networks throughout the region.\n \n Examples of the kind of content we imagine hosting, among other types, include:\n \n Rapid reviews for best-practices relevant to certain sectors;\n Participating in multisectoral task forces to address a key concern;\n Responding to demand-led syntheses of best available information to advise decision-making;\n Providing creative ways to address critical challenges in EIDM at this time; and\n Guidelines that have considered as far as possible the best available evidence\n News media highlights on EIDM during COVID in various African countries\n Blogs by AEN members on key \"EIDM during COVID\" topics","Regional","Yes","No","No","No","No","No","Yes","Yes","Yes","No","Yes","Yes","First category (at least one: having documents, epi info, or government responses)","Include","N/A","NGO","N/A","Public","Yes","Yes","Yes","No","Yes","Yes","No","No","No","No","No","No",0,"No","Yes","No","Yes","No","No","No",0,"N/A","No","No","Yes","Yes","Yes","No","Yes","Yes","Yes","No","Yes","No","No","No","No","No","No","Unclear","26/05/2020","13: 4 rapid responses, 2 media briefing, 1 poster, 5 guides, 1 report","English, French","English","Economic development and growth","Yes","No","No","Yes","Yes","No","No","External links_Resource","N/A","Yes","No","Date of publication","No"]
["2020-09-06","Nkuli","",{"$f":"IFERROR(SEARCH('1. Searching Hubs'!$E$14, E5)+ROW()/100000,\"\")","v":""},"African Policy Monitor","https://covid19africawatch.org/african-policy-monitor/","COVID-19 Africa Watch is tracking a variety of policy developments across Africa. The hub extensively tracks country-specific fiscla and monetary responses, emergency declarations, social distang and school closure policies.","Regional","Yes","No","No","No","No","No","Yes","Yes","Yes","No","Yes","Yes","First category (at least one: having documents, epi info, or government responses)","Include","N/A","NGO","N/A","Public",0,0,0,0,0,0,0,0,0,0,0,0,0,"No","No","No","Yes","No","No","No","No","N/A","No","No","Yes","Yes","Yes",0,0,0,0,0,0,0,0,0,"N/A","Yes","N/A","14/05/2020","2020-09-06","Unclear","English","English",0,"Yes","No","No","Yes","No","No","No","External links_Resource","N/A","Yes","No","None of them","No","50 mins"]
["2020-08-06","Irvine","",{"$f":"IFERROR(SEARCH('1. Searching Hubs'!$E$14, E6)+ROW()/100000,\"\")","v":""},"Africaxiv","https://info.africarxiv.org/covid-19/ ","Resources, ideas, and guidelines around the COVID-19 pandemic in Africa Thousands of individuals and hundreds of grassroots and international organisations, CBOs, NPOs, governmental and industrial are working hard to mitigate the effects of the pandemic on the African continent. We are not trying to replicate other organisations’ efforts, instead:\n\n","Regional","Yes","Yes","Yes","Yes","Yes","Yes","Yes","Yes","Yes","Yes","Yes","Yes","Second category (at least two: having expert opinions or others)","Include","N/A","International Organization","N/A","Public",0,0,0,0,0,0,0,0,0,0,0,0,0,"Yes","Yes","Yes","Yes","No","Yes","Yes","No","N/A","Yes","Yes","Yes","Yes","Yes",0,0,0,0,0,0,0,0,0,"Yes","Yes","Yes","Unclear","2020-08-06","Unclear","English","English",0,"No","No","Yes","Yes","Yes","Yes","Yes","External links_Resource","N/A","Yes","No","Last update of the document","No"]
["2020-03-06","Irvine","",{"$f":"IFERROR(SEARCH('1. Searching Hubs'!$E$14, E7)+ROW()/100000,\"\")","v":""},"American Chemistry Society","https://pubs.acs.org/page/vi/chemistry_coronavirus_research#","n light of the current outbreak of a novel coronavirus (2019–nCoV), ACS Publications would like to share this Virtual Issue that features a collection of articles on coronavirus research. Chemistry has a key role to play in understanding everything from viral structure to pathogenesis, isolation of vaccines and therapies, as well as in the development of materials and techniques used by basic researchers, virologists and clinicians. This Virtual Issue aims to provide a brief overview of the important contributions of chemistry to understanding and controlling the spread of coronaviruses and includes articles from ACS Publications and the preprint server ChemRxiv. We hope the research contained in this Virtual Issue will provide you with","No geographical scope","N/A","N/A","N/A","N/A","N/A","N/A","N/A","N/A","N/A","N/A","Yes","Yes","First category (at least one: having documents, epi info, or government responses)","Include","N/A","NGO","Journal","Public",0,0,0,0,0,0,0,0,0,0,0,0,0,"Yes","Yes","No","No","No","No","Yes",0,"N/A","No","Yes","Yes","No","No",0,0,0,0,0,0,0,0,0,"Yes","N/A","N/A","Unclear","2020-03-06","Unclear","English","English",0,"No","No","Yes","Yes","No","No","No","External links_Resource","N/A","Yes","No","Date of publication","No"]
["2020-03-06","Irvine","",{"$f":"IFERROR(SEARCH('1. Searching Hubs'!$E$14, E8)+ROW()/100000,\"\")","v":""},"American College of Cardiology","https://www.acc.org/latest-in-cardiology/features/accs-coronavirus-disease-2019-covid-19-hub#sort=%40fcommonsortdate90022%20descending","The ACC is working to provide COVID-19 clinical guidance for the global cardiovascular care team. The content in this Hub has been reviewed and approved by ACC's Science and Quality Committee. Learn more about the hub and article methodology.","Global ","Yes","Yes","Yes","Yes","Yes","No","Yes","Yes","Yes","Yes","Yes","Yes","First category (at least one: having documents, epi info, or government responses)","Include","N/A","NGO","N/A","Public",0,0,0,0,0,0,0,0,0,0,0,0,0,"Yes","Yes","No","Yes","No","No","Yes","No","N/A","Yes","Yes","Yes","Yes","Yes",0,0,0,0,0,0,0,0,0,"Yes","Yes","No","Unclear","2020-03-06","Unclear","English","English",0,"No","No","Yes","Yes","Yes","Yes","Yes","External links_Resource","N/A","Yes","No","Date of publication","Yes"]
["2020-04-06","Andile","",{"$f":"IFERROR(SEARCH('1. Searching Hubs'!$E$14, E9)+ROW()/100000,\"\")","v":""},"American Psychological Association: Education","https://www.apa.org/topics/covid-19","Information hub on telepsychology, telework, distance learning, self-care, parenting and caregiving, isolation, trauma, and stress related to the COVID-19 pandemic","National","No","No","No","Yes","No","No","No","No","No","Yes","Yes","Yes","First category (at least one: having documents, epi info, or government responses)","Include","N/A","Other","Scientific and proffessional organisation","Private not for profit",0,0,0,0,0,0,0,0,0,0,0,0,0,"No","No","Yes","No","No","No","No","No","N/A","No","No","Yes","No","No",0,0,0,0,0,0,0,0,0,"No","No","No","Unclear","2020-04-06","Unclear","English","English",0,"No","No","Yes","Yes","Yes","Yes","No","External links_Other hubs","N/A","Yes","No","Date of publication","No"]
[null,"Irvine","",{"$f":"IFERROR(SEARCH('1. Searching Hubs'!$E$14, E10)+ROW()/100000,\"\")","v":""},"American Society of Microbiology","https://asm.org/Press-Releases/2020/COVID-19-Resources","This registry includes top-ranked, COVID-19 research articles curated by experts and serves as a resource for scientists working to accelerate scientific research on SARS-CoV-2.","No geographical scope","N/A","N/A","N/A","N/A","N/A","N/A","N/A","N/A","N/A","N/A","Yes","Yes","Second category (at least two: having expert opinions or others)","Include","N/A","NGO","N/A","Private not for profit",0,0,0,0,0,0,0,0,0,0,0,0,0,"Yes","Yes","Yes","No","Yes","Yes","Yes","No","N/A","Yes","Yes","Yes","No","No",0,0,0,0,0,0,0,0,0,"Yes","Yes","No","Unclear","2020-04-06","Unclear","English","English",0,"No","No","Yes","Yes","Yes","Yes","Yes","External links_Other hubs","N/A","Yes","Yes","Date of publication","No"]
{"$rows_left_out":207}
{"sheet":"3. Geographical scope","index":3,"n_rows":691,"n_cols":6,"rows_kept":691,"cut":false,"hidden":true,"merged":[]}
["Name of hub","WHO Region","Geographical scope of the Hub",null,"Key"]
["International Monetary Fund (IMF)","AFRO","Global ",{"$f":"COUNTIF($B$1:B2,B2)","v":1},{"$f":"B2&D2","v":"AFRO1"},{"$f":"A2","v":"International Monetary Fund (IMF)"}]
["World Bank Data","AFRO","Global ",{"$f":"COUNTIF($B$1:B3,B3)","v":2},{"$f":"B3&D3","v":"AFRO2"},{"$f":"A3","v":"World Bank Data"}]
["Covidbase","AFRO","Global ",{"$f":"COUNTIF($B$1:B4,B4)","v":3},"AFRO3","Covidbase"]
["Africa Evidence Network Hub","AFRO","Regional",{"$f":"COUNTIF($B$1:B5,B5)","v":4},"AFRO4","Africa Evidence Network Hub"]
["Oxford Government response tracker","AFRO","Global ",{"$f":"COUNTIF($B$1:B6,B6)","v":5},"AFRO5","Oxford Government response tracker"]
["Yale School of Management's Program COVID-19 Financial Response Tracker (CFRT)","AFRO","Global ",{"$f":"COUNTIF($B$1:B7,B7)","v":6},"AFRO6","Yale School of Management's Program COVID-19 Financial Response Tracker (CFRT)"]
["UNDP COVID 19 Dashboard","AFRO","Global ",{"$f":"COUNTIF($B$1:B8,B8)","v":7},"AFRO7","UNDP COVID 19 Dashboard"]
["UNICEF","AFRO","Global ",{"$f":"COUNTIF($B$1:B9,B9)","v":8},"AFRO8","UNICEF"]
["UNEP","AFRO","Global ",{"$f":"COUNTIF($B$1:B10,B10)","v":9},"AFRO9","UNEP"]
{"$rows_left_out":682}
{"sheet":"4. Resource types","index":4,"n_rows":678,"n_cols":11,"rows_kept":678,"cut":false,"hidden":true,"merged":[]}
["Person extracting ","Name of Hub","Resources available","Details","4.3 \nSingle studies","4.1.1 \nRecommendations or guidance that used evidence syntheses","4.1.2 \nRecommendations or guidance not reporting using evidence syntheses",null,"Key"]
["Nkuli","AEN Hub","Evidence Synthesis","Systematic reviews","Non of the above","Yes","Yes",{"$f":"COUNTIF($D$1:D2,D1)","v":1},{"$f":"C2&H2","v":"Evidence Synthesis1"},{"$f":"B2","v":"AEN Hub"},{"$f":"B2&C2&D2","v":"AEN HubEvidence SynthesisSystematic reviews"}]
[null,"AEN Hub","Evidence Synthesis","Rapid reviews",null,"Yes","Yes",{"$f":"COUNTIF($D$1:D3,D2)","v":1},{"$f":"C3&H3","v":"Evidence Synthesis1"},{"$f":"B3","v":"AEN Hub"},{"$f":"B3&C3&D3","v":"AEN HubEvidence SynthesisRapid reviews"}]
[null,"AEN Hub","Evidence Synthesis","Evidence syntheses building on systematic reviews",null,"Yes","Yes",{"$f":"COUNTIF($D$1:D4,D3)","v":1},"Evidence Synthesis1","AEN Hub","AEN HubEvidence SynthesisEvidence syntheses building on systematic reviews"]
[null,"AEN Hub","Recommendations","Recommendations or guidance that used evidence syntheses",null,null,null,{"$f":"COUNTIF($D$1:D5,D4)","v":1},"Recommendations1","AEN Hub","AEN HubRecommendationsRecommendations or guidance that used evidence syntheses"]
[null,"AEN Hub","Recommendations","Recommendations or guidance not reporting using evidence syntheses",null,null,null,{"$f":"COUNTIF($D$1:D6,D5)","v":1},"Recommendations1","AEN Hub","AEN HubRecommendationsRecommendations or guidance not reporting using evidence syntheses"]
[null,"AEN Hub","Expert opinions","N/A",null,null,null,{"$f":"COUNTIF($D$1:D7,D6)","v":1},"Expert opinions1","AEN Hub","AEN HubExpert opinionsN/A"]
["Irvine","Covidbase","Evidence Synthesis","Rapid reviews","Other primary research studies","Yes","Yes",{"$f":"COUNTIF($D$1:D8,D7)","v":1},"Evidence Synthesis1","Covidbase","CovidbaseEvidence SynthesisRapid reviews"]
[null,"Covidbase","Evidence Synthesis","Systematic reviews",null,null,null,{"$f":"COUNTIF($D$1:D9,D8)","v":2},"Evidence Synthesis2","Covidbase","CovidbaseEvidence SynthesisSystematic reviews"]
[null,"Covidbase","Single studies","Other primary research studies",null,null,null,{"$f":"COUNTIF($D$1:D10,D9)","v":2},"Single studies2","Covidbase","CovidbaseSingle studiesOther primary research studies"]
{"$rows_left_out":669}
{"sheet":"5. Decisions","index":5,"n_rows":494,"n_cols":4,"rows_kept":494,"cut":false,"hidden":true,"merged":[]}
["Person extracting","Name of Hub","Broad category"]
[null,"(USA) White House Call to Action to the Tech Community on New Machine Readable COVID-19 Dataset","Public-health measures",{"$f":"B2&C2","v":"(USA) White House Call to Action to the Tech Community on New Machine Readable COVID-19 DatasetPublic-health measures"}]
["Andile","(USA) White House Call to Action to the Tech Community on New Machine Readable COVID-19 Dataset","Clinical management",{"$f":"B3&C3","v":"(USA) White House Call to Action to the Tech Community on New Machine Readable COVID-19 DatasetClinical management"}]
["Nkuli","AEN Hub","Public-health measures","AEN HubPublic-health measures"]
[null,"African Policy Monitor","Public-health measures","African Policy MonitorPublic-health measures"]
[null,"Africaxiv","Public-health measures","AfricaxivPublic-health measures"]
[null,"Africaxiv","Clinical management","AfricaxivClinical management"]
[null,"American Chemistry Society","Clinical management","American Chemistry SocietyClinical management"]
["Irvine","American Chemistry Society","Public-health measures","American Chemistry SocietyPublic-health measures"]
[null,"American Psychological Association: Education","Public-health measures","American Psychological Association: EducationPublic-health measures"]
{"$rows_left_out":485}
{"sheet":"6. Sector","index":6,"n_rows":365,"n_cols":7,"rows_kept":365,"cut":false,"hidden":true,"merged":[]}
["Person extracting","Name of Hub","Sectors",null,"Key"]
["Andile","World Bank","Economic development and growth",{"$f":"COUNTIF($C$1:C2,C2)","v":1},{"$f":"C2&D2","v":"Economic development and growth1"},{"$f":"B2","v":"World Bank"},{"$f":"B2&C2","v":"World BankEconomic development and growth"}]
[null,"World Bank","Education",{"$f":"COUNTIF($C$1:C3,C3)","v":1},{"$f":"C3&D3","v":"Education1"},{"$f":"B3","v":"World Bank"},{"$f":"B3&C3","v":"World BankEducation"}]
[null,"World Bank","Food safety and security",{"$f":"COUNTIF($C$1:C4,C4)","v":1},"Food safety and security1","World Bank","World BankFood safety and security"]
[null,"World Bank","Financial protection",{"$f":"COUNTIF($C$1:C5,C5)","v":1},"Financial protection1","World Bank","World BankFinancial protection"]
["Nkuli","AEN Hub","Economic development and growth",{"$f":"COUNTIF($C$1:C6,C6)","v":2},"Economic development and growth2","AEN Hub","AEN HubEconomic development and growth"]
[null,"AEN Hub","Health",{"$f":"COUNTIF($C$1:C7,C7)","v":1},"Health1","AEN Hub","AEN HubHealth"]
[null,"AEN Hub","Community and social services",{"$f":"COUNTIF($C$1:C8,C8)","v":1},"Community and social services1","AEN Hub","AEN HubCommunity and social services"]
[null,"AEN Hub","Government services",{"$f":"COUNTIF($C$1:C9,C9)","v":1},"Government services1","AEN Hub","AEN HubGovernment services"]
["Irvine","Covidbase","Economic development and growth",{"$f":"COUNTIF($C$1:C10,C10)","v":3},"Economic development and growth3","Covidbase","CovidbaseEconomic development and growth"]
{"$rows_left_out":355}