{"text_format":"1","workbook":"xlsx","n_sheets":7,"sheets":["1. Searching Hubs","2. Search results","2. Main sheet","3. Geographical scope","4. Resource types","5. Decisions","6. Sector"],"not_rendered":{"charts":0,"images":16,"macros":1,"external_links":2,"defined_names":5,"comments":0,"pivot_tables":0},"unopened":[],"bounds":{"document_bytes":16777216,"sheet_cells":100000,"rows_first":2000,"rows_last":500,"rows_between":2000,"halvings":0,"cell_chars":16384,"cell_head_chars":4096},"cells_cut":0,"cells_raw":0,"read":"whole","date_system":"1900"}

{"sheet":"1. Searching Hubs","index":0,"n_rows":349,"n_cols":51,"rows_kept":349,"cut":false,"hidden":false,"merged":[[5,3,6,9],[5,11,7,12],[8,7,9,7],[9,3,9,4],[2,3,2,12],[30,3,30,6],[31,4,31,9],[13,4,13,9],[20,6,22,6],[20,7,22,7],[20,8,22,8],[20,9,22,9],[24,4,24,5],[16,3,16,4],[16,9,16,10],[17,6,18,6],[17,7,18,7],[17,8,18,8],[17,9,18,9],[17,10,18,10]]}
[1,2,3,4,5,6,7,8,9,10,11,12,13,14,15,16,17,18,19,20,21,22,23,24,25,26,27,28,29,30,31,32,33,34,35,36,37,38,39,40,41,42,43,44,45,46,47,48,49,50]
[]
[null,null,null,"Living Hub of COVID-19 Knowledge Hubs"]
[]
[null,null,null,"WELCOME!",null,null,null,null,null,null,null,"Contribute"]
[null,null,null,"This database provides a living hub of existing COVID-19 knowledge repositories",null,null,null,null,null,null,null,"If you are aware of a hub that you feel that is missing please contact us covid-end@mcmaster.ca"]
[]
[null,null,null,null,null,null,{"$f":"COUNTIF('2. Main sheet'!$V:$V,\"Include\")","v":214}]
[null,null,null,null,null,null,"hubs included"]
[null,null,null,"Last updated:"]
[null,null,null,"2020-06-29"]
[null,null,null,null,null,null,null,null,null,null,null,null,null,null,null,null,null,null,"Others","Others"]
[null,null,null,null,null,null,null,null,null,null,null,null,null,null,null,null,null,null,{"$f":"#REF!","v":{"$error":"#REF!"}},{"$f":"#REF!","v":{"$error":"#REF!"}}]
[null,null,null,"Search Hubs here:","search here",null,null,null,null,null,null,null,null,null,null,null,null,null,{"$f":"#REF!","v":{"$error":"#REF!"}},{"$f":"#REF!","v":{"$error":"#REF!"}}]
[null,null,null,null,null,null,null,null,null,null,null,null,null,null,null,null,null,null,{"$f":"#REF!","v":{"$error":"#REF!"}},{"$f":"#REF!","v":{"$error":"#REF!"}}]
[null,null,null,null,null,null,null,null,null,null,null,null,null,null,null,null,null,null,{"$f":"#REF!","v":{"$error":"#REF!"}},{"$f":"#REF!","v":{"$error":"#REF!"}}]
[null,null,null,null,null,null,null,null,null,null,null,null,null,null,null,null,null,null,{"$f":"#REF!","v":{"$error":"#REF!"}},{"$f":"#REF!","v":{"$error":"#REF!"}}]
[null,null,null,"Explore by sector:",null,null,null,null,null,null,null,"Health",null,null,null,null,null,null,{"$f":"#REF!","v":{"$error":"#REF!"}},{"$f":"#REF!","v":{"$error":"#REF!"}}]
[null,null,null,null,null,null,null,null,null,null,null,null,null,null,null,null,null,null,{"$f":"#REF!","v":{"$error":"#REF!"}},{"$f":"#REF!","v":{"$error":"#REF!"}}]
[null,null,null,null,null,null,null,null,null,null,null,null,null,null,null,null,null,null,{"$f":"#REF!","v":{"$error":"#REF!"}},{"$f":"#REF!","v":{"$error":"#REF!"}}]
[null,null,null,"Explore by WHO region:",null,null,null,null,null,null,"AFRO",null,null,null,null,null,null,null,{"$f":"#REF!","v":{"$error":"#REF!"}},{"$f":"#REF!","v":{"$error":"#REF!"}}]
[null,null,null,null,null,null,null,null,null,null,null,null,null,null,null,null,null,null,{"$f":"#REF!","v":{"$error":"#REF!"}},{"$f":"#REF!","v":{"$error":"#REF!"}}]
[null,null,null,null,null,null,null,null,null,null,null,null,null,null,null,null,null,null,{"$f":"#REF!","v":{"$error":"#REF!"}},{"$f":"#REF!","v":{"$error":"#REF!"}}]
[null,null,null,"Explore by resources type:",null,null,null,null,null,null,"Recommendations",null,null,null,null,null,null,null,{"$f":"#REF!","v":{"$error":"#REF!"}}]
[null,null,null,null,null,null,null,null,null,null,null,null,null,null,null,null,null,null,{"$f":"#REF!","v":{"$error":"#REF!"}}]
[null,null,null,null,null,null,null,null,null,null,null,null,null,null,null,null,null,null,{"$f":"#REF!","v":{"$error":"#REF!"}}]
[null,null,null,null,null,null,null,null,null,null,null,null,null,null,null,null,null,null,{"$f":"#REF!","v":{"$error":"#REF!"}}]
[null,null,null,null,null,"OR TAKE A LOOK AT THE FULL LIST OF HUBS IN A SEPARATE SPREADSHEET",null,null,null,null,null,null,null,null,null,null,null,null,{"$f":"#REF!","v":{"$error":"#REF!"}}]
[null,null,null,null,null,null,null,null,null,null,null,null,null,null,null,null,null,null,{"$f":"#REF!","v":{"$error":"#REF!"}}]
[null,null,null,null,null,null,null,null,null,null,null,null,null,null,null,null,null,null,{"$f":"'[1]7. Data validation'!X16","v":"Housing"}]
[]
[]
[]
[]
[]
[]
[]
[null,null,null,null,null,null,null,null,null,null,null,null,null,null,null,null,null,null,null,null,null,null,null,null,null,null,null,null,null,"Search results"]
[null,null,null,null,"Hubs containing COVID-19 resources covering",null,null,null,null,null,null,null,null,null,null,null,"Hubs containing COVID-19 resources covering",null,null,null,null,null,null,null,null,null,null,null,null,null,null,null,null,null,null,null,null,null,null,null,null,null,null,null,null,null,null,null,null,"Hubs containing COVID-19 resources including"]
[null,null,null,null,null,{"$f":"L18","v":"Health"},null,null,null,null,null,null,null,null,null,null,null,{"$f":"K21","v":"AFRO"},"region",null,null,null,null,null,null,null,null,{"$f":"IFERROR(RANK(AC40,$AC$40:$AC$259,1),\"\")","v":1},1,{"$f":"IFERROR(VLOOKUP(AC40,'2. Main sheet'!$C:$E,3,0),\"\")","v":""},null,null,null,null,null,null,null,null,null,null,null,null,null,null,null,null,null,null,null,null,{"$f":"K24","v":"Recommendations"}]
[null,null,null,null,null,null,null,null,null,null,null,null,null,null,null,null,null,null,null,null,null,null,null,null,null,null,null,{"$f":"IFERROR(RANK(AC41,$AC$40:$AC$259,1),\"\")","v":2},2,{"$f":"IFERROR(VLOOKUP(AC41,'2. Main sheet'!$C:$E,3,0),\"\")","v":""}]
[null,null,null,null,1,{"$f":"IFERROR(VLOOKUP($L$18&E42,'6. Sector'!$E:$F,2,0),\"\")","v":"AEN Hub"},null,null,null,null,null,null,null,null,null,null,1,{"$f":"IFERROR(VLOOKUP($R$40&Q42,'3. Geographical scope'!$E:$F,2,0),\"\")","v":"International Monetary Fund (IMF)"},null,null,null,null,null,null,null,null,null,3,3,{"$f":"IFERROR(VLOOKUP(AC42,'2. Main sheet'!$C:$E,3,0),\"\")","v":""},null,null,null,null,null,null,null,null,null,null,null,null,null,null,null,null,null,null,null,1,{"$f":"IFERROR(VLOOKUP($AY$40&AX42,'4. Resource types'!I:J,2,0),\"\")","v":"AEN Hub"}]
[null,null,null,null,2,{"$f":"IFERROR(VLOOKUP($L$18&E43,'6. Sector'!$E:$F,2,0),\"\")","v":"Covidbase"},null,null,null,null,null,null,null,null,null,null,2,{"$f":"IFERROR(VLOOKUP($R$40&Q43,'3. Geographical scope'!$E:$F,2,0),\"\")","v":"World Bank Data"},null,null,null,null,null,null,null,null,null,4,4,{"$f":"IFERROR(VLOOKUP(AC43,'2. Main sheet'!$C:$E,3,0),\"\")","v":""},null,null,null,null,null,null,null,null,null,null,null,null,null,null,null,null,null,null,null,2,{"$f":"IFERROR(VLOOKUP($AY$40&AX43,'4. Resource types'!I:J,2,0),\"\")","v":"Covidbase"}]
[null,null,null,null,3,{"$f":"IFERROR(VLOOKUP($L$18&E44,'6. Sector'!$E:$F,2,0),\"\")","v":"Johns Hopkins University and Medicine Coronavirus Resource Center"},null,null,null,null,null,null,null,null,null,null,3,{"$f":"IFERROR(VLOOKUP($R$40&Q44,'3. Geographical scope'!$E:$F,2,0),\"\")","v":"Covidbase"},null,null,null,null,null,null,null,null,null,5,5,{"$f":"IFERROR(VLOOKUP(AC44,'2. Main sheet'!$C:$E,3,0),\"\")","v":""},null,null,null,null,null,null,null,null,null,null,null,null,null,null,null,null,null,null,null,3,{"$f":"IFERROR(VLOOKUP($AY$40&AX44,'4. Resource types'!I:J,2,0),\"\")","v":"Johns Hopkins University and Medicine Coronavirus Resource Center"}]
[null,null,null,null,4,{"$f":"IFERROR(VLOOKUP($L$18&E45,'6. Sector'!$E:$F,2,0),\"\")","v":"International Monetory Fund"},null,null,null,null,null,null,null,null,null,null,4,{"$f":"IFERROR(VLOOKUP($R$40&Q45,'3. Geographical scope'!$E:$F,2,0),\"\")","v":"Africa Evidence Network Hub"},null,null,null,null,null,null,null,null,null,6,6,{"$f":"IFERROR(VLOOKUP(AC45,'2. Main sheet'!$C:$E,3,0),\"\")","v":""},null,null,null,null,null,null,null,null,null,null,null,null,null,null,null,null,null,null,null,4,{"$f":"IFERROR(VLOOKUP($AY$40&AX45,'4. Resource types'!I:J,2,0),\"\")","v":"Covidbase"}]
[null,null,null,null,5,{"$f":"IFERROR(VLOOKUP($L$18&E46,'6. Sector'!$E:$F,2,0),\"\")","v":"Inter-American Development Bank"},null,null,null,null,null,null,null,null,null,null,5,{"$f":"IFERROR(VLOOKUP($R$40&Q46,'3. Geographical scope'!$E:$F,2,0),\"\")","v":"Oxford Government response tracker"},null,null,null,null,null,null,null,null,null,7,7,{"$f":"IFERROR(VLOOKUP(AC46,'2. Main sheet'!$C:$E,3,0),\"\")","v":""},null,null,null,null,null,null,null,null,null,null,null,null,null,null,null,null,null,null,null,5,{"$f":"IFERROR(VLOOKUP($AY$40&AX46,'4. Resource types'!I:J,2,0),\"\")","v":"Centers for Disease Control and Prevention"}]
[null,null,null,null,6,{"$f":"IFERROR(VLOOKUP($L$18&E47,'6. Sector'!$E:$F,2,0),\"\")","v":"Cochrane library"},null,null,null,null,null,null,null,null,null,null,6,{"$f":"IFERROR(VLOOKUP($R$40&Q47,'3. Geographical scope'!$E:$F,2,0),\"\")","v":"Yale School of Management's Program COVID-19 Financial Response Tracker (CFRT)"},null,null,null,null,null,null,null,null,null,8,8,{"$f":"IFERROR(VLOOKUP(AC47,'2. Main sheet'!$C:$E,3,0),\"\")","v":""},null,null,null,null,null,null,null,null,null,null,null,null,null,null,null,null,null,null,null,6,{"$f":"IFERROR(VLOOKUP($AY$40&AX47,'4. Resource types'!I:J,2,0),\"\")","v":"Centers for Disease Control and Prevention"}]
[null,null,null,null,7,{"$f":"IFERROR(VLOOKUP($L$18&E48,'6. Sector'!$E:$F,2,0),\"\")","v":"Oxford Government response tracker"},null,null,null,null,null,null,null,null,null,null,7,{"$f":"IFERROR(VLOOKUP($R$40&Q48,'3. Geographical scope'!$E:$F,2,0),\"\")","v":"UNDP COVID 19 Dashboard"},null,null,null,null,null,null,null,null,null,9,9,{"$f":"IFERROR(VLOOKUP(AC48,'2. Main sheet'!$C:$E,3,0),\"\")","v":""},null,null,null,null,null,null,null,null,null,null,null,null,null,null,null,null,null,null,null,7,{"$f":"IFERROR(VLOOKUP($AY$40&AX48,'4. Resource types'!I:J,2,0),\"\")","v":"UN International Labour Organisation(ILO)"}]
[null,null,null,null,8,{"$f":"IFERROR(VLOOKUP($L$18&E49,'6. Sector'!$E:$F,2,0),\"\")","v":"National Institute for Health and Care Excellence"},null,null,null,null,null,null,null,null,null,null,8,{"$f":"IFERROR(VLOOKUP($R$40&Q49,'3. Geographical scope'!$E:$F,2,0),\"\")","v":"UNICEF"},null,null,null,null,null,null,null,null,null,10,10,{"$f":"IFERROR(VLOOKUP(AC49,'2. Main sheet'!$C:$E,3,0),\"\")","v":""},null,null,null,null,null,null,null,null,null,null,null,null,null,null,null,null,null,null,null,8,{"$f":"IFERROR(VLOOKUP($AY$40&AX49,'4. Resource types'!I:J,2,0),\"\")","v":"UNDP COVID 19 Dashboard"}]
[null,null,null,null,9,{"$f":"IFERROR(VLOOKUP($L$18&E50,'6. Sector'!$E:$F,2,0),\"\")","v":"Norwegian Institute of Public Health"},null,null,null,null,null,null,null,null,null,null,9,{"$f":"IFERROR(VLOOKUP($R$40&Q50,'3. Geographical scope'!$E:$F,2,0),\"\")","v":"UNEP"},null,null,null,null,null,null,null,null,null,11,11,{"$f":"IFERROR(VLOOKUP(AC50,'2. Main sheet'!$C:$E,3,0),\"\")","v":""},null,null,null,null,null,null,null,null,null,null,null,null,null,null,null,null,null,null,null,9,{"$f":"IFERROR(VLOOKUP($AY$40&AX50,'4. Resource types'!I:J,2,0),\"\")","v":"U.S. National Institutes of Health"}]
[null,null,null,null,10,{"$f":"IFERROR(VLOOKUP($L$18&E51,'6. Sector'!$E:$F,2,0),\"\")","v":"OECD Country Policy Tracker"},null,null,null,null,null,null,null,null,null,null,10,{"$f":"IFERROR(VLOOKUP($R$40&Q51,'3. Geographical scope'!$E:$F,2,0),\"\")","v":"OECD Tax policy responses by country"},null,null,null,null,null,null,null,null,null,12,12,{"$f":"IFERROR(VLOOKUP(AC51,'2. Main sheet'!$C:$E,3,0),\"\")","v":""},null,null,null,null,null,null,null,null,null,null,null,null,null,null,null,null,null,null,null,10,{"$f":"IFERROR(VLOOKUP($AY$40&AX51,'4. Resource types'!I:J,2,0),\"\")","v":"Communication Initiative"}]
[null,null,null,null,11,{"$f":"IFERROR(VLOOKUP($L$18&E52,'6. Sector'!$E:$F,2,0),\"\")","v":"OECD Health System Response Tracker"},null,null,null,null,null,null,null,null,null,null,11,{"$f":"IFERROR(VLOOKUP($R$40&Q52,'3. Geographical scope'!$E:$F,2,0),\"\")","v":"COVID-19 Research Project Tracker by UKCDR & GloPID-R"},null,null,null,null,null,null,null,null,null,13,13,{"$f":"IFERROR(VLOOKUP(AC52,'2. Main sheet'!$C:$E,3,0),\"\")","v":""},null,null,null,null,null,null,null,null,null,null,null,null,null,null,null,null,null,null,null,11,{"$f":"IFERROR(VLOOKUP($AY$40&AX52,'4. Resource types'!I:J,2,0),\"\")","v":""}]
[null,null,null,null,12,{"$f":"IFERROR(VLOOKUP($L$18&E53,'6. Sector'!$E:$F,2,0),\"\")","v":"Cochrane Clinical Answers"},null,null,null,null,null,null,null,null,null,null,12,{"$f":"IFERROR(VLOOKUP($R$40&Q53,'3. Geographical scope'!$E:$F,2,0),\"\")","v":"UNESCO COVID-19"},null,null,null,null,null,null,null,null,null,14,14,{"$f":"IFERROR(VLOOKUP(AC53,'2. Main sheet'!$C:$E,3,0),\"\")","v":""},null,null,null,null,null,null,null,null,null,null,null,null,null,null,null,null,null,null,null,12,{"$f":"IFERROR(VLOOKUP($AY$40&AX53,'4. Resource types'!I:J,2,0),\"\")","v":"VHL Regional Portal"}]
[null,null,null,null,13,{"$f":"IFERROR(VLOOKUP($L$18&E54,'6. Sector'!$E:$F,2,0),\"\")","v":"Centers for Disease Control and Prevention"},null,null,null,null,null,null,null,null,null,null,13,{"$f":"IFERROR(VLOOKUP($R$40&Q54,'3. Geographical scope'!$E:$F,2,0),\"\")","v":"Johns Hopkins University and Medicine Coronavirus Resource Center"},null,null,null,null,null,null,null,null,null,15,15,{"$f":"IFERROR(VLOOKUP(AC54,'2. Main sheet'!$C:$E,3,0),\"\")","v":""},null,null,null,null,null,null,null,null,null,null,null,null,null,null,null,null,null,null,null,13,{"$f":"IFERROR(VLOOKUP($AY$40&AX54,'4. Resource types'!I:J,2,0),\"\")","v":"Pan American Health Organization"}]
[null,null,null,null,14,{"$f":"IFERROR(VLOOKUP($L$18&E55,'6. Sector'!$E:$F,2,0),\"\")","v":"Evidence aid"},null,null,null,null,null,null,null,null,null,null,14,{"$f":"IFERROR(VLOOKUP($R$40&Q55,'3. Geographical scope'!$E:$F,2,0),\"\")","v":"McMaster COVID-19 evidence"},null,null,null,null,null,null,null,null,null,16,16,{"$f":"IFERROR(VLOOKUP(AC55,'2. Main sheet'!$C:$E,3,0),\"\")","v":""},null,null,null,null,null,null,null,null,null,null,null,null,null,null,null,null,null,null,null,14,{"$f":"IFERROR(VLOOKUP($AY$40&AX55,'4. Resource types'!I:J,2,0),\"\")","v":"Inter-American Development Bank"}]
[null,null,null,null,15,{"$f":"IFERROR(VLOOKUP($L$18&E56,'6. Sector'!$E:$F,2,0),\"\")","v":"Cochrane Effective Practise and Organisation of Care: Task Shifting"},null,null,null,null,null,null,null,null,null,null,15,{"$f":"IFERROR(VLOOKUP($R$40&Q56,'3. Geographical scope'!$E:$F,2,0),\"\")","v":"Economics for Inclusive Prosperity (Econflip)"},null,null,null,null,null,null,null,null,null,17,17,{"$f":"IFERROR(VLOOKUP(AC56,'2. Main sheet'!$C:$E,3,0),\"\")","v":""},null,null,null,null,null,null,null,null,null,null,null,null,null,null,null,null,null,null,null,15,{"$f":"IFERROR(VLOOKUP($AY$40&AX56,'4. Resource types'!I:J,2,0),\"\")","v":"McMaster COVID-19 evidence"}]
[null,null,null,null,16,{"$f":"IFERROR(VLOOKUP($L$18&E57,'6. Sector'!$E:$F,2,0),\"\")","v":"COVID-19 Research Project Tracker by UKCDR & GloPID-R"},null,null,null,null,null,null,null,null,null,null,16,{"$f":"IFERROR(VLOOKUP($R$40&Q57,'3. Geographical scope'!$E:$F,2,0),\"\")","v":"Our World in Data Coronavirus Disease (COVID-19)"},null,null,null,null,null,null,null,null,null,18,18,{"$f":"IFERROR(VLOOKUP(AC57,'2. Main sheet'!$C:$E,3,0),\"\")","v":""},null,null,null,null,null,null,null,null,null,null,null,null,null,null,null,null,null,null,null,16,{"$f":"IFERROR(VLOOKUP($AY$40&AX57,'4. Resource types'!I:J,2,0),\"\")","v":"COVID-19 and Citizen Science"}]
[null,null,null,null,17,{"$f":"IFERROR(VLOOKUP($L$18&E58,'6. Sector'!$E:$F,2,0),\"\")","v":"Cochrane COVID Rapid Reviews"},null,null,null,null,null,null,null,null,null,null,17,{"$f":"IFERROR(VLOOKUP($R$40&Q58,'3. Geographical scope'!$E:$F,2,0),\"\")","v":"COVID-19 CoronaVirus South African Resource Portal"},null,null,null,null,null,null,null,null,null,19,19,{"$f":"IFERROR(VLOOKUP(AC58,'2. Main sheet'!$C:$E,3,0),\"\")","v":""},null,null,null,null,null,null,null,null,null,null,null,null,null,null,null,null,null,null,null,17,{"$f":"IFERROR(VLOOKUP($AY$40&AX58,'4. Resource types'!I:J,2,0),\"\")","v":"SPOR Evidence Alliance"}]
[null,null,null,null,18,{"$f":"IFERROR(VLOOKUP($L$18&E59,'6. Sector'!$E:$F,2,0),\"\")","v":"UK Government (Previously put as DFID)"},null,null,null,null,null,null,null,null,null,null,18,{"$f":"IFERROR(VLOOKUP($R$40&Q59,'3. Geographical scope'!$E:$F,2,0),\"\")","v":"China National Knowledge Infrastructure (CNKI)"},null,null,null,null,null,null,null,null,null,20,20,{"$f":"IFERROR(VLOOKUP(AC59,'2. Main sheet'!$C:$E,3,0),\"\")","v":""},null,null,null,null,null,null,null,null,null,null,null,null,null,null,null,null,null,null,null,18,{"$f":"IFERROR(VLOOKUP($AY$40&AX59,'4. Resource types'!I:J,2,0),\"\")","v":"Elrha"}]
[null,null,null,null,19,{"$f":"IFERROR(VLOOKUP($L$18&E60,'6. Sector'!$E:$F,2,0),\"\")","v":"Kentucky’s response to COVID-23"},null,null,null,null,null,null,null,null,null,null,19,{"$f":"IFERROR(VLOOKUP($R$40&Q60,'3. Geographical scope'!$E:$F,2,0),\"\")","v":"Elrha"},null,null,null,null,null,null,null,null,null,21,21,{"$f":"IFERROR(VLOOKUP(AC60,'2. Main sheet'!$C:$E,3,0),\"\")","v":""},null,null,null,null,null,null,null,null,null,null,null,null,null,null,null,null,null,null,null,19,{"$f":"IFERROR(VLOOKUP($AY$40&AX60,'4. Resource types'!I:J,2,0),\"\")","v":"MCMaster National Collaborating Centre for Methods and Tools : Canada"}]
[null,null,null,null,20,{"$f":"IFERROR(VLOOKUP($L$18&E61,'6. Sector'!$E:$F,2,0),\"\")","v":"Johns Hopkins University and Medicine Coronavirus Resource Center"},null,null,null,null,null,null,null,null,null,null,20,{"$f":"IFERROR(VLOOKUP($R$40&Q61,'3. Geographical scope'!$E:$F,2,0),\"\")","v":"COVID-19 Open Research Dataset"},null,null,null,null,null,null,null,null,null,22,22,{"$f":"IFERROR(VLOOKUP(AC61,'2. Main sheet'!$C:$E,3,0),\"\")","v":""},null,null,null,null,null,null,null,null,null,null,null,null,null,null,null,null,null,null,null,20,{"$f":"IFERROR(VLOOKUP($AY$40&AX61,'4. Resource types'!I:J,2,0),\"\")","v":"Social Science in Humanitarian Action"}]
[null,null,null,null,21,{"$f":"IFERROR(VLOOKUP($L$18&E62,'6. Sector'!$E:$F,2,0),\"\")","v":"Johns Hopkins Medicine POC-IT Guide"},null,null,null,null,null,null,null,null,null,null,21,{"$f":"IFERROR(VLOOKUP($R$40&Q62,'3. Geographical scope'!$E:$F,2,0),\"\")","v":"COVID 19 ZA Dashboard"},null,null,null,null,null,null,null,null,null,23,23,{"$f":"IFERROR(VLOOKUP(AC62,'2. Main sheet'!$C:$E,3,0),\"\")","v":""},null,null,null,null,null,null,null,null,null,null,null,null,null,null,null,null,null,null,null,21,{"$f":"IFERROR(VLOOKUP($AY$40&AX62,'4. Resource types'!I:J,2,0),\"\")","v":""}]
[null,null,null,null,22,{"$f":"IFERROR(VLOOKUP($L$18&E63,'6. Sector'!$E:$F,2,0),\"\")","v":"VHL Regional Portal"},null,null,null,null,null,null,null,null,null,null,22,{"$f":"IFERROR(VLOOKUP($R$40&Q63,'3. Geographical scope'!$E:$F,2,0),\"\")","v":"LitCovid"},null,null,null,null,null,null,null,null,null,24,24,{"$f":"IFERROR(VLOOKUP(AC63,'2. Main sheet'!$C:$E,3,0),\"\")","v":""},null,null,null,null,null,null,null,null,null,null,null,null,null,null,null,null,null,null,null,22,{"$f":"IFERROR(VLOOKUP($AY$40&AX63,'4. Resource types'!I:J,2,0),\"\")","v":""}]
[null,null,null,null,23,{"$f":"IFERROR(VLOOKUP($L$18&E64,'6. Sector'!$E:$F,2,0),\"\")","v":"Pan American Health Organization"},null,null,null,null,null,null,null,null,null,null,23,{"$f":"IFERROR(VLOOKUP($R$40&Q64,'3. Geographical scope'!$E:$F,2,0),\"\")","v":"TEPHINET Coronavirus Knowledge Hub"},null,null,null,null,null,null,null,null,null,25,25,{"$f":"IFERROR(VLOOKUP(AC64,'2. Main sheet'!$C:$E,3,0),\"\")","v":""},null,null,null,null,null,null,null,null,null,null,null,null,null,null,null,null,null,null,null,23,{"$f":"IFERROR(VLOOKUP($AY$40&AX64,'4. Resource types'!I:J,2,0),\"\")","v":"OECD Country Policy Tracker"}]
[null,null,null,null,24,{"$f":"IFERROR(VLOOKUP($L$18&E65,'6. Sector'!$E:$F,2,0),\"\")","v":"AU"},null,null,null,null,null,null,null,null,null,null,24,{"$f":"IFERROR(VLOOKUP($R$40&Q65,'3. Geographical scope'!$E:$F,2,0),\"\")","v":"Wits Hub"},null,null,null,null,null,null,null,null,null,26,26,{"$f":"IFERROR(VLOOKUP(AC65,'2. Main sheet'!$C:$E,3,0),\"\")","v":""},null,null,null,null,null,null,null,null,null,null,null,null,null,null,null,null,null,null,null,24,{"$f":"IFERROR(VLOOKUP($AY$40&AX65,'4. Resource types'!I:J,2,0),\"\")","v":"OECD Health System Response Tracker"}]
[null,null,null,null,25,{"$f":"IFERROR(VLOOKUP($L$18&E66,'6. Sector'!$E:$F,2,0),\"\")","v":"NMA"},null,null,null,null,null,null,null,null,null,null,25,{"$f":"IFERROR(VLOOKUP($R$40&Q66,'3. Geographical scope'!$E:$F,2,0),\"\")","v":"DynaMed"},null,null,null,null,null,null,null,null,null,27,27,{"$f":"IFERROR(VLOOKUP(AC66,'2. Main sheet'!$C:$E,3,0),\"\")","v":""},null,null,null,null,null,null,null,null,null,null,null,null,null,null,null,null,null,null,null,25,{"$f":"IFERROR(VLOOKUP($AY$40&AX66,'4. Resource types'!I:J,2,0),\"\")","v":"Ontario Hospital Association"}]
[null,null,null,null,26,{"$f":"IFERROR(VLOOKUP($L$18&E67,'6. Sector'!$E:$F,2,0),\"\")","v":"McMaster COVID-19 evidence"},null,null,null,null,null,null,null,null,null,null,26,{"$f":"IFERROR(VLOOKUP($R$40&Q67,'3. Geographical scope'!$E:$F,2,0),\"\")","v":"Open government partnership"},null,null,null,null,null,null,null,null,null,28,28,{"$f":"IFERROR(VLOOKUP(AC67,'2. Main sheet'!$C:$E,3,0),\"\")","v":""},null,null,null,null,null,null,null,null,null,null,null,null,null,null,null,null,null,null,null,26,{"$f":"IFERROR(VLOOKUP($AY$40&AX67,'4. Resource types'!I:J,2,0),\"\")","v":"OECD Employment & Social policy responses by country"}]
[null,null,null,null,27,{"$f":"IFERROR(VLOOKUP($L$18&E68,'6. Sector'!$E:$F,2,0),\"\")","v":"EPI-WIN (WHO Information for Network for Epidemics)"},null,null,null,null,null,null,null,null,null,null,27,{"$f":"IFERROR(VLOOKUP($R$40&Q68,'3. Geographical scope'!$E:$F,2,0),\"\")","v":"SocArxi Corona Net"},null,null,null,null,null,null,null,null,null,29,29,{"$f":"IFERROR(VLOOKUP(AC68,'2. Main sheet'!$C:$E,3,0),\"\")","v":""},null,null,null,null,null,null,null,null,null,null,null,null,null,null,null,null,null,null,null,27,{"$f":"IFERROR(VLOOKUP($AY$40&AX68,'4. Resource types'!I:J,2,0),\"\")","v":"Irish Longitudinal Study on Ageing"}]
[null,null,null,null,28,{"$f":"IFERROR(VLOOKUP($L$18&E69,'6. Sector'!$E:$F,2,0),\"\")","v":"Ontario Ministry of Health"},null,null,null,null,null,null,null,null,null,null,28,{"$f":"IFERROR(VLOOKUP($R$40&Q69,'3. Geographical scope'!$E:$F,2,0),\"\")","v":"Communication Initiative"},null,null,null,null,null,null,null,null,null,30,30,{"$f":"IFERROR(VLOOKUP(AC69,'2. Main sheet'!$C:$E,3,0),\"\")","v":""},null,null,null,null,null,null,null,null,null,null,null,null,null,null,null,null,null,null,null,28,{"$f":"IFERROR(VLOOKUP($AY$40&AX69,'4. Resource types'!I:J,2,0),\"\")","v":"International Long Term Care Policy Network"}]
[null,null,null,null,29,{"$f":"IFERROR(VLOOKUP($L$18&E70,'6. Sector'!$E:$F,2,0),\"\")","v":"EPPI Mega evidence map"},null,null,null,null,null,null,null,null,null,null,29,{"$f":"IFERROR(VLOOKUP($R$40&Q70,'3. Geographical scope'!$E:$F,2,0),\"\")","v":"Guidelines Network International"},null,null,null,null,null,null,null,null,null,31,31,{"$f":"IFERROR(VLOOKUP(AC70,'2. Main sheet'!$C:$E,3,0),\"\")","v":""},null,null,null,null,null,null,null,null,null,null,null,null,null,null,null,null,null,null,null,29,{"$f":"IFERROR(VLOOKUP($AY$40&AX70,'4. Resource types'!I:J,2,0),\"\")","v":"MAGICapp"}]
[null,null,null,null,30,{"$f":"IFERROR(VLOOKUP($L$18&E71,'6. Sector'!$E:$F,2,0),\"\")","v":"Economics for Inclusive Prosperity (Econflip)"},null,null,null,null,null,null,null,null,null,null,30,{"$f":"IFERROR(VLOOKUP($R$40&Q71,'3. Geographical scope'!$E:$F,2,0),\"\")","v":"ECRI Guidelines Trust COVID-19 Resource Center"},null,null,null,null,null,null,null,null,null,32,32,{"$f":"IFERROR(VLOOKUP(AC71,'2. Main sheet'!$C:$E,3,0),\"\")","v":""},null,null,null,null,null,null,null,null,null,null,null,null,null,null,null,null,null,null,null,30,{"$f":"IFERROR(VLOOKUP($AY$40&AX71,'4. Resource types'!I:J,2,0),\"\")","v":"Canadian Centre on Substance Use and Addiction"}]
[null,null,null,null,31,{"$f":"IFERROR(VLOOKUP($L$18&E72,'6. Sector'!$E:$F,2,0),\"\")","v":"Our World in Data Coronavirus Disease (COVID-19)"},null,null,null,null,null,null,null,null,null,null,31,{"$f":"IFERROR(VLOOKUP($R$40&Q72,'3. Geographical scope'!$E:$F,2,0),\"\")","v":"George Institute"},null,null,null,null,null,null,null,null,null,33,33,{"$f":"IFERROR(VLOOKUP(AC72,'2. Main sheet'!$C:$E,3,0),\"\")","v":""},null,null,null,null,null,null,null,null,null,null,null,null,null,null,null,null,null,null,null,31,{"$f":"IFERROR(VLOOKUP($AY$40&AX72,'4. Resource types'!I:J,2,0),\"\")","v":"National COVID-19 Living Evidence Task Force"}]
[null,null,null,null,32,{"$f":"IFERROR(VLOOKUP($L$18&E73,'6. Sector'!$E:$F,2,0),\"\")","v":"COVID-19 CoronaVirus South African Resource Portal"},null,null,null,null,null,null,null,null,null,null,32,{"$f":"IFERROR(VLOOKUP($R$40&Q73,'3. Geographical scope'!$E:$F,2,0),\"\")","v":"European Respiratory Society"},null,null,null,null,null,null,null,null,null,34,34,{"$f":"IFERROR(VLOOKUP(AC73,'2. Main sheet'!$C:$E,3,0),\"\")","v":""},null,null,null,null,null,null,null,null,null,null,null,null,null,null,null,null,null,null,null,32,{"$f":"IFERROR(VLOOKUP($AY$40&AX73,'4. Resource types'!I:J,2,0),\"\")","v":""}]
[null,null,null,null,33,{"$f":"IFERROR(VLOOKUP($L$18&E74,'6. Sector'!$E:$F,2,0),\"\")","v":"China National Knowledge Infrastructure (CNKI)"},null,null,null,null,null,null,null,null,null,null,33,{"$f":"IFERROR(VLOOKUP($R$40&Q74,'3. Geographical scope'!$E:$F,2,0),\"\")","v":"Weekly Social Protection Links"},null,null,null,null,null,null,null,null,null,35,35,{"$f":"IFERROR(VLOOKUP(AC74,'2. Main sheet'!$C:$E,3,0),\"\")","v":""},null,null,null,null,null,null,null,null,null,null,null,null,null,null,null,null,null,null,null,33,{"$f":"IFERROR(VLOOKUP($AY$40&AX74,'4. Resource types'!I:J,2,0),\"\")","v":""}]
[null,null,null,null,34,{"$f":"IFERROR(VLOOKUP($L$18&E75,'6. Sector'!$E:$F,2,0),\"\")","v":"Elrha"},null,null,null,null,null,null,null,null,null,null,34,{"$f":"IFERROR(VLOOKUP($R$40&Q75,'3. Geographical scope'!$E:$F,2,0),\"\")","v":"International Network for Government Science Advice (INGSA)"},null,null,null,null,null,null,null,null,null,36,36,{"$f":"IFERROR(VLOOKUP(AC75,'2. Main sheet'!$C:$E,3,0),\"\")","v":""},null,null,null,null,null,null,null,null,null,null,null,null,null,null,null,null,null,null,null,34,{"$f":"IFERROR(VLOOKUP($AY$40&AX75,'4. Resource types'!I:J,2,0),\"\")","v":"WHO R & D"}]
[null,null,null,null,35,{"$f":"IFERROR(VLOOKUP($L$18&E76,'6. Sector'!$E:$F,2,0),\"\")","v":"Public Health Ontario"},null,null,null,null,null,null,null,null,null,null,35,{"$f":"IFERROR(VLOOKUP($R$40&Q76,'3. Geographical scope'!$E:$F,2,0),\"\")","v":"Gulag Echoes project"},null,null,null,null,null,null,null,null,null,37,37,{"$f":"IFERROR(VLOOKUP(AC76,'2. Main sheet'!$C:$E,3,0),\"\")","v":""},null,null,null,null,null,null,null,null,null,null,null,null,null,null,null,null,null,null,null,35,{"$f":"IFERROR(VLOOKUP($AY$40&AX76,'4. Resource types'!I:J,2,0),\"\")","v":"American Psychological Association: Education"}]
[null,null,null,null,36,{"$f":"IFERROR(VLOOKUP($L$18&E77,'6. Sector'!$E:$F,2,0),\"\")","v":"(USA) White House Call to Action to the Tech Community on New Machine Readable COVID-19 Dataset"},null,null,null,null,null,null,null,null,null,null,36,{"$f":"IFERROR(VLOOKUP($R$40&Q77,'3. Geographical scope'!$E:$F,2,0),\"\")","v":"ILO Social Protection Monitor"},null,null,null,null,null,null,null,null,null,38,38,{"$f":"IFERROR(VLOOKUP(AC77,'2. Main sheet'!$C:$E,3,0),\"\")","v":""},null,null,null,null,null,null,null,null,null,null,null,null,null,null,null,null,null,null,null,36,{"$f":"IFERROR(VLOOKUP($AY$40&AX77,'4. Resource types'!I:J,2,0),\"\")","v":"eCancer"}]
[null,null,null,null,37,{"$f":"IFERROR(VLOOKUP($L$18&E78,'6. Sector'!$E:$F,2,0),\"\")","v":"European Research Area (ERA) Corona Platform"},null,null,null,null,null,null,null,null,null,null,37,{"$f":"IFERROR(VLOOKUP($R$40&Q78,'3. Geographical scope'!$E:$F,2,0),\"\")","v":"Malcolm Wiener Centre for Social Policy Monitoring the Covid-19 Employment Response: Policy Approaches Across Countries"},null,null,null,null,null,null,null,null,null,39,39,{"$f":"IFERROR(VLOOKUP(AC78,'2. Main sheet'!$C:$E,3,0),\"\")","v":""},null,null,null,null,null,null,null,null,null,null,null,null,null,null,null,null,null,null,null,37,{"$f":"IFERROR(VLOOKUP($AY$40&AX78,'4. Resource types'!I:J,2,0),\"\")","v":"Guidelines Network International"}]
[null,null,null,null,38,{"$f":"IFERROR(VLOOKUP($L$18&E79,'6. Sector'!$E:$F,2,0),\"\")","v":"Ghana government"},null,null,null,null,null,null,null,null,null,null,38,{"$f":"IFERROR(VLOOKUP($R$40&Q79,'3. Geographical scope'!$E:$F,2,0),\"\")","v":"Global Health 5050 COVID-19 sex-disaggregated data tracker"},null,null,null,null,null,null,null,null,null,40,40,{"$f":"IFERROR(VLOOKUP(AC79,'2. Main sheet'!$C:$E,3,0),\"\")","v":""},null,null,null,null,null,null,null,null,null,null,null,null,null,null,null,null,null,null,null,38,{"$f":"IFERROR(VLOOKUP($AY$40&AX79,'4. Resource types'!I:J,2,0),\"\")","v":""}]
[null,null,null,null,39,{"$f":"IFERROR(VLOOKUP($L$18&E80,'6. Sector'!$E:$F,2,0),\"\")","v":"COVID-19 Open Research Dataset"},null,null,null,null,null,null,null,null,null,null,39,{"$f":"IFERROR(VLOOKUP($R$40&Q80,'3. Geographical scope'!$E:$F,2,0),\"\")","v":"Dimensions COVID-19"},null,null,null,null,null,null,null,null,null,41,41,{"$f":"IFERROR(VLOOKUP(AC80,'2. Main sheet'!$C:$E,3,0),\"\")","v":""},null,null,null,null,null,null,null,null,null,null,null,null,null,null,null,null,null,null,null,39,{"$f":"IFERROR(VLOOKUP($AY$40&AX80,'4. Resource types'!I:J,2,0),\"\")","v":"Turning Research Into Practice (TRIP)"}]
[null,null,null,null,40,{"$f":"IFERROR(VLOOKUP($L$18&E81,'6. Sector'!$E:$F,2,0),\"\")","v":"iHealthFacts"},null,null,null,null,null,null,null,null,null,null,40,{"$f":"IFERROR(VLOOKUP($R$40&Q81,'3. Geographical scope'!$E:$F,2,0),\"\")","v":"OECD SME Policy Responses"},null,null,null,null,null,null,null,null,null,42,42,{"$f":"IFERROR(VLOOKUP(AC81,'2. Main sheet'!$C:$E,3,0),\"\")","v":""},null,null,null,null,null,null,null,null,null,null,null,null,null,null,null,null,null,null,null,40,{"$f":"IFERROR(VLOOKUP($AY$40&AX81,'4. Resource types'!I:J,2,0),\"\")","v":""}]
[null,null,null,null,41,{"$f":"IFERROR(VLOOKUP($L$18&E82,'6. Sector'!$E:$F,2,0),\"\")","v":"Mental Health Commission of Canada"},null,null,null,null,null,null,null,null,null,null,41,{"$f":"IFERROR(VLOOKUP($R$40&Q82,'3. Geographical scope'!$E:$F,2,0),\"\")","v":"Global overview of COVID-19: Impact on elections"},null,null,null,null,null,null,null,null,null,43,43,{"$f":"IFERROR(VLOOKUP(AC82,'2. Main sheet'!$C:$E,3,0),\"\")","v":""},null,null,null,null,null,null,null,null,null,null,null,null,null,null,null,null,null,null,null,41,{"$f":"IFERROR(VLOOKUP($AY$40&AX82,'4. Resource types'!I:J,2,0),\"\")","v":"Johanna Briggs Institute"}]
[null,null,null,null,42,{"$f":"IFERROR(VLOOKUP($L$18&E83,'6. Sector'!$E:$F,2,0),\"\")","v":"Canadian Centre on Substance Use and Addiction"},null,null,null,null,null,null,null,null,null,null,42,{"$f":"IFERROR(VLOOKUP($R$40&Q83,'3. Geographical scope'!$E:$F,2,0),\"\")","v":"Conflict and Covid-19 Resource Hub"},null,null,null,null,null,null,null,null,null,44,44,{"$f":"IFERROR(VLOOKUP(AC83,'2. Main sheet'!$C:$E,3,0),\"\")","v":""},null,null,null,null,null,null,null,null,null,null,null,null,null,null,null,null,null,null,null,42,{"$f":"IFERROR(VLOOKUP($AY$40&AX83,'4. Resource types'!I:J,2,0),\"\")","v":""}]
[null,null,null,null,43,{"$f":"IFERROR(VLOOKUP($L$18&E84,'6. Sector'!$E:$F,2,0),\"\")","v":"COVID 19 ZA Dashboard"},null,null,null,null,null,null,null,null,null,null,43,{"$f":"IFERROR(VLOOKUP($R$40&Q84,'3. Geographical scope'!$E:$F,2,0),\"\")","v":"Coronavirus: prison fever"},null,null,null,null,null,null,null,null,null,45,45,{"$f":"IFERROR(VLOOKUP(AC84,'2. Main sheet'!$C:$E,3,0),\"\")","v":""},null,null,null,null,null,null,null,null,null,null,null,null,null,null,null,null,null,null,null,43,{"$f":"IFERROR(VLOOKUP($AY$40&AX84,'4. Resource types'!I:J,2,0),\"\")","v":""}]
[null,null,null,null,44,{"$f":"IFERROR(VLOOKUP($L$18&E85,'6. Sector'!$E:$F,2,0),\"\")","v":"Covid-19 Innovations"},null,null,null,null,null,null,null,null,null,null,44,{"$f":"IFERROR(VLOOKUP($R$40&Q85,'3. Geographical scope'!$E:$F,2,0),\"\")","v":"Candid Philanthropic Funding Data"},null,null,null,null,null,null,null,null,null,46,46,{"$f":"IFERROR(VLOOKUP(AC85,'2. Main sheet'!$C:$E,3,0),\"\")","v":""},null,null,null,null,null,null,null,null,null,null,null,null,null,null,null,null,null,null,null,44,{"$f":"IFERROR(VLOOKUP($AY$40&AX85,'4. Resource types'!I:J,2,0),\"\")","v":""}]
[null,null,null,null,45,{"$f":"IFERROR(VLOOKUP($L$18&E86,'6. Sector'!$E:$F,2,0),\"\")","v":"LitCovid"},null,null,null,null,null,null,null,null,null,null,45,{"$f":"IFERROR(VLOOKUP($R$40&Q86,'3. Geographical scope'!$E:$F,2,0),\"\")","v":"Coronavirus Research Repository"},null,null,null,null,null,null,null,null,null,47,47,{"$f":"IFERROR(VLOOKUP(AC86,'2. Main sheet'!$C:$E,3,0),\"\")","v":""},null,null,null,null,null,null,null,null,null,null,null,null,null,null,null,null,null,null,null,45,{"$f":"IFERROR(VLOOKUP($AY$40&AX86,'4. Resource types'!I:J,2,0),\"\")","v":""}]
[null,null,null,null,46,{"$f":"IFERROR(VLOOKUP($L$18&E87,'6. Sector'!$E:$F,2,0),\"\")","v":"Health Economics, Policy and Law blog series on country responses"},null,null,null,null,null,null,null,null,null,null,46,{"$f":"IFERROR(VLOOKUP($R$40&Q87,'3. Geographical scope'!$E:$F,2,0),\"\")","v":"UN Habitat"},null,null,null,null,null,null,null,null,null,48,48,{"$f":"IFERROR(VLOOKUP(AC87,'2. Main sheet'!$C:$E,3,0),\"\")","v":""},null,null,null,null,null,null,null,null,null,null,null,null,null,null,null,null,null,null,null,46,{"$f":"IFERROR(VLOOKUP($AY$40&AX87,'4. Resource types'!I:J,2,0),\"\")","v":"UK Government (Previously put as DFID)"}]
[null,null,null,null,47,{"$f":"IFERROR(VLOOKUP($L$18&E88,'6. Sector'!$E:$F,2,0),\"\")","v":"SPOR Evidence Alliance"},null,null,null,null,null,null,null,null,null,null,47,{"$f":"IFERROR(VLOOKUP($R$40&Q88,'3. Geographical scope'!$E:$F,2,0),\"\")","v":"UN Food and Agriculture Organisation(FAO)"},null,null,null,null,null,null,null,null,null,49,49,{"$f":"IFERROR(VLOOKUP(AC88,'2. Main sheet'!$C:$E,3,0),\"\")","v":""},null,null,null,null,null,null,null,null,null,null,null,null,null,null,null,null,null,null,null,47,{"$f":"IFERROR(VLOOKUP($AY$40&AX88,'4. Resource types'!I:J,2,0),\"\")","v":""}]
[null,null,null,null,48,{"$f":"IFERROR(VLOOKUP($L$18&E89,'6. Sector'!$E:$F,2,0),\"\")","v":"U.S. National Institutes of Health"},null,null,null,null,null,null,null,null,null,null,48,{"$f":"IFERROR(VLOOKUP($R$40&Q89,'3. Geographical scope'!$E:$F,2,0),\"\")","v":"Centers for Disease Control and Prevention"},null,null,null,null,null,null,null,null,null,50,50,{"$f":"IFERROR(VLOOKUP(AC89,'2. Main sheet'!$C:$E,3,0),\"\")","v":""},null,null,null,null,null,null,null,null,null,null,null,null,null,null,null,null,null,null,null,48,{"$f":"IFERROR(VLOOKUP($AY$40&AX89,'4. Resource types'!I:J,2,0),\"\")","v":"Education Endowment Foundation"}]
[null,null,null,null,49,{"$f":"IFERROR(VLOOKUP($L$18&E90,'6. Sector'!$E:$F,2,0),\"\")","v":"Ontario Ministry of Health ,Ministry of Long-Term Care"},null,null,null,null,null,null,null,null,null,null,49,{"$f":"IFERROR(VLOOKUP($R$40&Q90,'3. Geographical scope'!$E:$F,2,0),\"\")","v":"OECD Country Policy Tracker"},null,null,null,null,null,null,null,null,null,51,51,{"$f":"IFERROR(VLOOKUP(AC90,'2. Main sheet'!$C:$E,3,0),\"\")","v":""},null,null,null,null,null,null,null,null,null,null,null,null,null,null,null,null,null,null,null,49,{"$f":"IFERROR(VLOOKUP($AY$40&AX90,'4. Resource types'!I:J,2,0),\"\")","v":""}]
[null,null,null,null,50,{"$f":"IFERROR(VLOOKUP($L$18&E91,'6. Sector'!$E:$F,2,0),\"\")","v":"CHAIN"},null,null,null,null,null,null,null,null,null,null,50,{"$f":"IFERROR(VLOOKUP($R$40&Q91,'3. Geographical scope'!$E:$F,2,0),\"\")","v":"OECD Health System Response Tracker"},null,null,null,null,null,null,null,null,null,52,52,{"$f":"IFERROR(VLOOKUP(AC91,'2. Main sheet'!$C:$E,3,0),\"\")","v":""},null,null,null,null,null,null,null,null,null,null,null,null,null,null,null,null,null,null,null,50,{"$f":"IFERROR(VLOOKUP($AY$40&AX91,'4. Resource types'!I:J,2,0),\"\")","v":""}]
[null,null,null,null,51,{"$f":"IFERROR(VLOOKUP($L$18&E92,'6. Sector'!$E:$F,2,0),\"\")","v":"eCancer"},null,null,null,null,null,null,null,null,null,null,51,{"$f":"IFERROR(VLOOKUP($R$40&Q92,'3. Geographical scope'!$E:$F,2,0),\"\")","v":"OECD Employment & Social policy responses by country"},null,null,null,null,null,null,null,null,null,53,53,{"$f":"IFERROR(VLOOKUP(AC92,'2. Main sheet'!$C:$E,3,0),\"\")","v":""},null,null,null,null,null,null,null,null,null,null,null,null,null,null,null,null,null,null,null,51,{"$f":"IFERROR(VLOOKUP($AY$40&AX92,'4. Resource types'!I:J,2,0),\"\")","v":"Kentucky’s response to COVID-19"}]
[null,null,null,null,52,{"$f":"IFERROR(VLOOKUP($L$18&E93,'6. Sector'!$E:$F,2,0),\"\")","v":"Government of Canada"},null,null,null,null,null,null,null,null,null,null,52,{"$f":"IFERROR(VLOOKUP($R$40&Q93,'3. Geographical scope'!$E:$F,2,0),\"\")","v":"UN International Labour Organisation(ILO)"},null,null,null,null,null,null,null,null,null,54,54,{"$f":"IFERROR(VLOOKUP(AC93,'2. Main sheet'!$C:$E,3,0),\"\")","v":""},null,null,null,null,null,null,null,null,null,null,null,null,null,null,null,null,null,null,null,52,{"$f":"IFERROR(VLOOKUP($AY$40&AX93,'4. Resource types'!I:J,2,0),\"\")","v":"Open COVID-19 policy dataset"}]
[null,null,null,null,53,{"$f":"IFERROR(VLOOKUP($L$18&E94,'6. Sector'!$E:$F,2,0),\"\")","v":"Nigerian government"},null,null,null,null,null,null,null,null,null,null,53,{"$f":"IFERROR(VLOOKUP($R$40&Q94,'3. Geographical scope'!$E:$F,2,0),\"\")","v":"Institute for Health Metrics and Evaluation (IHME)"},null,null,null,null,null,null,null,null,null,55,55,{"$f":"IFERROR(VLOOKUP(AC94,'2. Main sheet'!$C:$E,3,0),\"\")","v":""},null,null,null,null,null,null,null,null,null,null,null,null,null,null,null,null,null,null,null,53,{"$f":"IFERROR(VLOOKUP($AY$40&AX94,'4. Resource types'!I:J,2,0),\"\")","v":"Kaggle"}]
[null,null,null,null,54,{"$f":"IFERROR(VLOOKUP($L$18&E95,'6. Sector'!$E:$F,2,0),\"\")","v":"Cochrane Oral Health"},null,null,null,null,null,null,null,null,null,null,54,{"$f":"IFERROR(VLOOKUP($R$40&Q95,'3. Geographical scope'!$E:$F,2,0),\"\")","v":"OECD Knowledge Hub"},null,null,null,null,null,null,null,null,null,56,56,{"$f":"IFERROR(VLOOKUP(AC95,'2. Main sheet'!$C:$E,3,0),\"\")","v":""},null,null,null,null,null,null,null,null,null,null,null,null,null,null,null,null,null,null,null,54,{"$f":"IFERROR(VLOOKUP($AY$40&AX95,'4. Resource types'!I:J,2,0),\"\")","v":"IDS K4D Covid resource"}]
[null,null,null,null,55,{"$f":"IFERROR(VLOOKUP($L$18&E96,'6. Sector'!$E:$F,2,0),\"\")","v":"Cell Press Coronavirus Resource Hub"},null,null,null,null,null,null,null,null,null,null,55,{"$f":"IFERROR(VLOOKUP($R$40&Q96,'3. Geographical scope'!$E:$F,2,0),\"\")","v":"AU"},null,null,null,null,null,null,null,null,null,57,57,{"$f":"IFERROR(VLOOKUP(AC96,'2. Main sheet'!$C:$E,3,0),\"\")","v":""},null,null,null,null,null,null,null,null,null,null,null,null,null,null,null,null,null,null,null,55,{"$f":"IFERROR(VLOOKUP($AY$40&AX96,'4. Resource types'!I:J,2,0),\"\")","v":"International Long Term Care Policy Network"}]
[null,null,null,null,56,{"$f":"IFERROR(VLOOKUP($L$18&E97,'6. Sector'!$E:$F,2,0),\"\")","v":"Public Health England"},null,null,null,null,null,null,null,null,null,null,56,{"$f":"IFERROR(VLOOKUP($R$40&Q97,'3. Geographical scope'!$E:$F,2,0),\"\")","v":"COVID-19 and Citizen Science"},null,null,null,null,null,null,null,null,null,58,58,{"$f":"IFERROR(VLOOKUP(AC97,'2. Main sheet'!$C:$E,3,0),\"\")","v":""},null,null,null,null,null,null,null,null,null,null,null,null,null,null,null,null,null,null,null,56,{"$f":"IFERROR(VLOOKUP($AY$40&AX97,'4. Resource types'!I:J,2,0),\"\")","v":""}]
[null,null,null,null,57,{"$f":"IFERROR(VLOOKUP($L$18&E98,'6. Sector'!$E:$F,2,0),\"\")","v":"Ontario Hospital Association"},null,null,null,null,null,null,null,null,null,null,57,{"$f":"IFERROR(VLOOKUP($R$40&Q98,'3. Geographical scope'!$E:$F,2,0),\"\")","v":"COVID 19 Africa Data Research"},null,null,null,null,null,null,null,null,null,59,59,{"$f":"IFERROR(VLOOKUP(AC98,'2. Main sheet'!$C:$E,3,0),\"\")","v":""},null,null,null,null,null,null,null,null,null,null,null,null,null,null,null,null,null,null,null,57,{"$f":"IFERROR(VLOOKUP($AY$40&AX98,'4. Resource types'!I:J,2,0),\"\")","v":"Impact Peace Resources on Covid"}]
[null,null,null,null,58,{"$f":"IFERROR(VLOOKUP($L$18&E99,'6. Sector'!$E:$F,2,0),\"\")","v":"SYREAF"},null,null,null,null,null,null,null,null,null,null,58,{"$f":"IFERROR(VLOOKUP($R$40&Q99,'3. Geographical scope'!$E:$F,2,0),\"\")","v":"NMA"},null,null,null,null,null,null,null,null,null,60,60,{"$f":"IFERROR(VLOOKUP(AC99,'2. Main sheet'!$C:$E,3,0),\"\")","v":""},null,null,null,null,null,null,null,null,null,null,null,null,null,null,null,null,null,null,null,58,{"$f":"IFERROR(VLOOKUP($AY$40&AX99,'4. Resource types'!I:J,2,0),\"\")","v":""}]
[null,null,null,null,59,{"$f":"IFERROR(VLOOKUP($L$18&E100,'6. Sector'!$E:$F,2,0),\"\")","v":"SAGE"},null,null,null,null,null,null,null,null,null,null,59,{"$f":"IFERROR(VLOOKUP($R$40&Q100,'3. Geographical scope'!$E:$F,2,0),\"\")","v":"Social Science in Humanitarian Action"},null,null,null,null,null,null,null,null,null,61,61,{"$f":"IFERROR(VLOOKUP(AC100,'2. Main sheet'!$C:$E,3,0),\"\")","v":""},null,null,null,null,null,null,null,null,null,null,null,null,null,null,null,null,null,null,null,59,{"$f":"IFERROR(VLOOKUP($AY$40&AX100,'4. Resource types'!I:J,2,0),\"\")","v":""}]
[null,null,null,null,60,{"$f":"IFERROR(VLOOKUP($L$18&E101,'6. Sector'!$E:$F,2,0),\"\")","v":"NEJM's Coronavirus (Covid-19)"},null,null,null,null,null,null,null,null,null,null,60,{"$f":"IFERROR(VLOOKUP($R$40&Q101,'3. Geographical scope'!$E:$F,2,0),\"\")","v":"EPI-WIN (WHO Information for Network for Epidemics)"},null,null,null,null,null,null,null,null,null,62,62,{"$f":"IFERROR(VLOOKUP(AC101,'2. Main sheet'!$C:$E,3,0),\"\")","v":""},null,null,null,null,null,null,null,null,null,null,null,null,null,null,null,null,null,null,null,60,{"$f":"IFERROR(VLOOKUP($AY$40&AX101,'4. Resource types'!I:J,2,0),\"\")","v":""}]
[null,null,null,null,61,{"$f":"IFERROR(VLOOKUP($L$18&E102,'6. Sector'!$E:$F,2,0),\"\")","v":"EUI Covid Knowledge Hub"},null,null,null,null,null,null,null,null,null,null,61,{"$f":"IFERROR(VLOOKUP($R$40&Q102,'3. Geographical scope'!$E:$F,2,0),\"\")","v":"Hewlett Foundation"},null,null,null,null,null,null,null,null,null,63,63,{"$f":"IFERROR(VLOOKUP(AC102,'2. Main sheet'!$C:$E,3,0),\"\")","v":""},null,null,null,null,null,null,null,null,null,null,null,null,null,null,null,null,null,null,null,61,{"$f":"IFERROR(VLOOKUP($AY$40&AX102,'4. Resource types'!I:J,2,0),\"\")","v":""}]
[null,null,null,null,62,{"$f":"IFERROR(VLOOKUP($L$18&E103,'6. Sector'!$E:$F,2,0),\"\")","v":"Journal of the American College of Cardiology"},null,null,null,null,null,null,null,null,null,null,62,{"$f":"IFERROR(VLOOKUP($R$40&Q103,'3. Geographical scope'!$E:$F,2,0),\"\")","v":"Development aid"},null,null,null,null,null,null,null,null,null,64,64,{"$f":"IFERROR(VLOOKUP(AC103,'2. Main sheet'!$C:$E,3,0),\"\")","v":""},null,null,null,null,null,null,null,null,null,null,null,null,null,null,null,null,null,null,null,62,{"$f":"IFERROR(VLOOKUP($AY$40&AX103,'4. Resource types'!I:J,2,0),\"\")","v":""}]
[null,null,null,null,63,{"$f":"IFERROR(VLOOKUP($L$18&E104,'6. Sector'!$E:$F,2,0),\"\")","v":"RCVS Knowledge"},null,null,null,null,null,null,null,null,null,null,63,{"$f":"IFERROR(VLOOKUP($R$40&Q104,'3. Geographical scope'!$E:$F,2,0),\"\")","v":"NICD"},null,null,null,null,null,null,null,null,null,65,65,{"$f":"IFERROR(VLOOKUP(AC104,'2. Main sheet'!$C:$E,3,0),\"\")","v":""},null,null,null,null,null,null,null,null,null,null,null,null,null,null,null,null,null,null,null,63,{"$f":"IFERROR(VLOOKUP($AY$40&AX104,'4. Resource types'!I:J,2,0),\"\")","v":""}]
[null,null,null,null,64,{"$f":"IFERROR(VLOOKUP($L$18&E105,'6. Sector'!$E:$F,2,0),\"\")","v":"New England Journal of Medicine"},null,null,null,null,null,null,null,null,null,null,64,{"$f":"IFERROR(VLOOKUP($R$40&Q105,'3. Geographical scope'!$E:$F,2,0),\"\")","v":"Kenyan government"},null,null,null,null,null,null,null,null,null,{"$f":"IFERROR(RANK(AC105,$AC$40:$AC$259,1),\"\")","v":66},66,{"$f":"IFERROR(VLOOKUP(AC105,'2. Main sheet'!$C:$E,3,0),\"\")","v":""},null,null,null,null,null,null,null,null,null,null,null,null,null,null,null,null,null,null,null,64,{"$f":"IFERROR(VLOOKUP($AY$40&AX105,'4. Resource types'!I:J,2,0),\"\")","v":""}]
[null,null,null,null,65,{"$f":"IFERROR(VLOOKUP($L$18&E106,'6. Sector'!$E:$F,2,0),\"\")","v":"Health Information and Quality Authority"},null,null,null,null,null,null,null,null,null,null,65,{"$f":"IFERROR(VLOOKUP($R$40&Q106,'3. Geographical scope'!$E:$F,2,0),\"\")","v":"Ghana government"},null,null,null,null,null,null,null,null,null,67,67,{"$f":"IFERROR(VLOOKUP(AC106,'2. Main sheet'!$C:$E,3,0),\"\")","v":""},null,null,null,null,null,null,null,null,null,null,null,null,null,null,null,null,null,null,null,65,{"$f":"IFERROR(VLOOKUP($AY$40&AX106,'4. Resource types'!I:J,2,0),\"\")","v":""}]
[null,null,null,null,66,{"$f":"IFERROR(VLOOKUP($L$18&E107,'6. Sector'!$E:$F,2,0),\"\")","v":"American Chemistry Society"},null,null,null,null,null,null,null,null,null,null,66,{"$f":"IFERROR(VLOOKUP($R$40&Q107,'3. Geographical scope'!$E:$F,2,0),\"\")","v":"Coronavirus Tech Handbook"},null,null,null,null,null,null,null,null,null,68,68,{"$f":"IFERROR(VLOOKUP(AC107,'2. Main sheet'!$C:$E,3,0),\"\")","v":""},null,null,null,null,null,null,null,null,null,null,null,null,null,null,null,null,null,null,null,66,{"$f":"IFERROR(VLOOKUP($AY$40&AX107,'4. Resource types'!I:J,2,0),\"\")","v":"Social Science in Humanitarian Action"}]
[null,null,null,null,67,{"$f":"IFERROR(VLOOKUP($L$18&E108,'6. Sector'!$E:$F,2,0),\"\")","v":"LANCET COVID-19 Resource Centre"},null,null,null,null,null,null,null,null,null,null,67,{"$f":"IFERROR(VLOOKUP($R$40&Q108,'3. Geographical scope'!$E:$F,2,0),\"\")","v":"Covid-19 Innovations"},null,null,null,null,null,null,null,null,null,69,69,{"$f":"IFERROR(VLOOKUP(AC108,'2. Main sheet'!$C:$E,3,0),\"\")","v":""},null,null,null,null,null,null,null,null,null,null,null,null,null,null,null,null,null,null,null,67,{"$f":"IFERROR(VLOOKUP($AY$40&AX108,'4. Resource types'!I:J,2,0),\"\")","v":""}]
[null,null,null,null,68,{"$f":"IFERROR(VLOOKUP($L$18&E109,'6. Sector'!$E:$F,2,0),\"\")","v":"TEPHINET Coronavirus Knowledge Hub"},null,null,null,null,null,null,null,null,null,null,68,{"$f":"IFERROR(VLOOKUP($R$40&Q109,'3. Geographical scope'!$E:$F,2,0),\"\")","v":"SYREAF"},null,null,null,null,null,null,null,null,null,70,70,{"$f":"IFERROR(VLOOKUP(AC109,'2. Main sheet'!$C:$E,3,0),\"\")","v":""},null,null,null,null,null,null,null,null,null,null,null,null,null,null,null,null,null,null,null,68,{"$f":"IFERROR(VLOOKUP($AY$40&AX109,'4. Resource types'!I:J,2,0),\"\")","v":""}]
[null,null,null,null,69,{"$f":"IFERROR(VLOOKUP($L$18&E110,'6. Sector'!$E:$F,2,0),\"\")","v":"Makerere University"},null,null,null,null,null,null,null,null,null,null,69,{"$f":"IFERROR(VLOOKUP($R$40&Q110,'3. Geographical scope'!$E:$F,2,0),\"\")","v":"OECD Science and innovation policy responses by country"},null,null,null,null,null,null,null,null,null,71,71,{"$f":"IFERROR(VLOOKUP(AC110,'2. Main sheet'!$C:$E,3,0),\"\")","v":""},null,null,null,null,null,null,null,null,null,null,null,null,null,null,null,null,null,null,null,69,{"$f":"IFERROR(VLOOKUP($AY$40&AX110,'4. Resource types'!I:J,2,0),\"\")","v":""}]
[null,null,null,null,70,{"$f":"IFERROR(VLOOKUP($L$18&E111,'6. Sector'!$E:$F,2,0),\"\")","v":"McMasterer Plus"},null,null,null,null,null,null,null,null,null,null,70,{"$f":"IFERROR(VLOOKUP($R$40&Q111,'3. Geographical scope'!$E:$F,2,0),\"\")","v":"CHAIN"},null,null,null,null,null,null,null,null,null,72,72,{"$f":"IFERROR(VLOOKUP(AC111,'2. Main sheet'!$C:$E,3,0),\"\")","v":""},null,null,null,null,null,null,null,null,null,null,null,null,null,null,null,null,null,null,null,70,{"$f":"IFERROR(VLOOKUP($AY$40&AX111,'4. Resource types'!I:J,2,0),\"\")","v":""}]
[null,null,null,null,71,{"$f":"IFERROR(VLOOKUP($L$18&E112,'6. Sector'!$E:$F,2,0),\"\")","v":"Canadian Agency for Drugs and Technologies in Health"},null,null,null,null,null,null,null,null,null,null,71,{"$f":"IFERROR(VLOOKUP($R$40&Q112,'3. Geographical scope'!$E:$F,2,0),\"\")","v":"Oxford Evidence Service"},null,null,null,null,null,null,null,null,null,73,73,{"$f":"IFERROR(VLOOKUP(AC112,'2. Main sheet'!$C:$E,3,0),\"\")","v":""},null,null,null,null,null,null,null,null,null,null,null,null,null,null,null,null,null,null,null,71,{"$f":"IFERROR(VLOOKUP($AY$40&AX112,'4. Resource types'!I:J,2,0),\"\")","v":""}]
[null,null,null,null,72,{"$f":"IFERROR(VLOOKUP($L$18&E113,'6. Sector'!$E:$F,2,0),\"\")","v":"Wits Hub"},null,null,null,null,null,null,null,null,null,null,72,{"$f":"IFERROR(VLOOKUP($R$40&Q113,'3. Geographical scope'!$E:$F,2,0),\"\")","v":"COVID-19 Economic Stimulus Index"},null,null,null,null,null,null,null,null,null,74,74,{"$f":"IFERROR(VLOOKUP(AC113,'2. Main sheet'!$C:$E,3,0),\"\")","v":""},null,null,null,null,null,null,null,null,null,null,null,null,null,null,null,null,null,null,null,72,{"$f":"IFERROR(VLOOKUP($AY$40&AX113,'4. Resource types'!I:J,2,0),\"\")","v":"World Health Organization (WHO) technical guidelines"}]
[null,null,null,null,73,{"$f":"IFERROR(VLOOKUP($L$18&E114,'6. Sector'!$E:$F,2,0),\"\")","v":"Cochrane ENT, Hearing & Balance"},null,null,null,null,null,null,null,null,null,null,73,{"$f":"IFERROR(VLOOKUP($R$40&Q114,'3. Geographical scope'!$E:$F,2,0),\"\")","v":"Nigerian government"},null,null,null,null,null,null,null,null,null,75,75,{"$f":"IFERROR(VLOOKUP(AC114,'2. Main sheet'!$C:$E,3,0),\"\")","v":""},null,null,null,null,null,null,null,null,null,null,null,null,null,null,null,null,null,null,null,73,{"$f":"IFERROR(VLOOKUP($AY$40&AX114,'4. Resource types'!I:J,2,0),\"\")","v":""}]
[null,null,null,null,74,{"$f":"IFERROR(VLOOKUP($L$18&E115,'6. Sector'!$E:$F,2,0),\"\")","v":"Irish Longitudinal Study on Ageing"},null,null,null,null,null,null,null,null,null,null,74,{"$f":"IFERROR(VLOOKUP($R$40&Q115,'3. Geographical scope'!$E:$F,2,0),\"\")","v":"World Bank Education"},null,null,null,null,null,null,null,null,null,76,76,{"$f":"IFERROR(VLOOKUP(AC115,'2. Main sheet'!$C:$E,3,0),\"\")","v":""},null,null,null,null,null,null,null,null,null,null,null,null,null,null,null,null,null,null,null,74,{"$f":"IFERROR(VLOOKUP($AY$40&AX115,'4. Resource types'!I:J,2,0),\"\")","v":""}]
[null,null,null,null,75,{"$f":"IFERROR(VLOOKUP($L$18&E116,'6. Sector'!$E:$F,2,0),\"\")","v":"International Long Term Care Policy Network"},null,null,null,null,null,null,null,null,null,null,75,{"$f":"IFERROR(VLOOKUP($R$40&Q116,'3. Geographical scope'!$E:$F,2,0),\"\")","v":"Covid 19 Africa Watch"},null,null,null,null,null,null,null,null,null,77,77,{"$f":"IFERROR(VLOOKUP(AC116,'2. Main sheet'!$C:$E,3,0),\"\")","v":""},null,null,null,null,null,null,null,null,null,null,null,null,null,null,null,null,null,null,null,75,{"$f":"IFERROR(VLOOKUP($AY$40&AX116,'4. Resource types'!I:J,2,0),\"\")","v":""}]
[null,null,null,null,76,{"$f":"IFERROR(VLOOKUP($L$18&E117,'6. Sector'!$E:$F,2,0),\"\")","v":"Frontiers Coronavirus Knowledge Hub"},null,null,null,null,null,null,null,null,null,null,76,{"$f":"IFERROR(VLOOKUP($R$40&Q117,'3. Geographical scope'!$E:$F,2,0),\"\")","v":"American College of Cardiology"},null,null,null,null,null,null,null,null,null,78,78,{"$f":"IFERROR(VLOOKUP(AC117,'2. Main sheet'!$C:$E,3,0),\"\")","v":""},null,null,null,null,null,null,null,null,null,null,null,null,null,null,null,null,null,null,null,76,{"$f":"IFERROR(VLOOKUP($AY$40&AX117,'4. Resource types'!I:J,2,0),\"\")","v":"Fasken Covid 19 Knowledge"}]
[null,null,null,null,77,{"$f":"IFERROR(VLOOKUP($L$18&E118,'6. Sector'!$E:$F,2,0),\"\")","v":"American Society of Microbiology"},null,null,null,null,null,null,null,null,null,null,77,{"$f":"IFERROR(VLOOKUP($R$40&Q118,'3. Geographical scope'!$E:$F,2,0),\"\")","v":"International Long Term Care Policy Network"},null,null,null,null,null,null,null,null,null,79,79,{"$f":"IFERROR(VLOOKUP(AC118,'2. Main sheet'!$C:$E,3,0),\"\")","v":""},null,null,null,null,null,null,null,null,null,null,null,null,null,null,null,null,null,null,null,77,{"$f":"IFERROR(VLOOKUP($AY$40&AX118,'4. Resource types'!I:J,2,0),\"\")","v":""}]
[null,null,null,null,78,{"$f":"IFERROR(VLOOKUP($L$18&E119,'6. Sector'!$E:$F,2,0),\"\")","v":"DynaMed"},null,null,null,null,null,null,null,null,null,null,78,{"$f":"IFERROR(VLOOKUP($R$40&Q119,'3. Geographical scope'!$E:$F,2,0),\"\")","v":"Elsevier Novel Coronavirus Information Center"},null,null,null,null,null,null,null,null,null,80,80,{"$f":"IFERROR(VLOOKUP(AC119,'2. Main sheet'!$C:$E,3,0),\"\")","v":""},null,null,null,null,null,null,null,null,null,null,null,null,null,null,null,null,null,null,null,78,{"$f":"IFERROR(VLOOKUP($AY$40&AX119,'4. Resource types'!I:J,2,0),\"\")","v":""}]
[null,null,null,null,79,{"$f":"IFERROR(VLOOKUP($L$18&E120,'6. Sector'!$E:$F,2,0),\"\")","v":"Elsevier Novel Coronavirus Information Center"},null,null,null,null,null,null,null,null,null,null,79,{"$f":"IFERROR(VLOOKUP($R$40&Q120,'3. Geographical scope'!$E:$F,2,0),\"\")","v":"International trade centre"},null,null,null,null,null,null,null,null,null,81,81,{"$f":"IFERROR(VLOOKUP(AC120,'2. Main sheet'!$C:$E,3,0),\"\")","v":""},null,null,null,null,null,null,null,null,null,null,null,null,null,null,null,null,null,null,null,79,{"$f":"IFERROR(VLOOKUP($AY$40&AX120,'4. Resource types'!I:J,2,0),\"\")","v":""}]
[null,null,null,null,80,{"$f":"IFERROR(VLOOKUP($L$18&E121,'6. Sector'!$E:$F,2,0),\"\")","v":"UK government"},null,null,null,null,null,null,null,null,null,null,80,{"$f":"IFERROR(VLOOKUP($R$40&Q121,'3. Geographical scope'!$E:$F,2,0),\"\")","v":"WHO R & D"},null,null,null,null,null,null,null,null,null,82,82,{"$f":"IFERROR(VLOOKUP(AC121,'2. Main sheet'!$C:$E,3,0),\"\")","v":""},null,null,null,null,null,null,null,null,null,null,null,null,null,null,null,null,null,null,null,80,{"$f":"IFERROR(VLOOKUP($AY$40&AX121,'4. Resource types'!I:J,2,0),\"\")","v":""}]
[null,null,null,null,81,{"$f":"IFERROR(VLOOKUP($L$18&E122,'6. Sector'!$E:$F,2,0),\"\")","v":"Elsevier Novel Coronavirus Information Center"},null,null,null,null,null,null,null,null,null,null,81,{"$f":"IFERROR(VLOOKUP($R$40&Q122,'3. Geographical scope'!$E:$F,2,0),\"\")","v":"United Nations Office for the Coordination of Humanitarian Affairs"},null,null,null,null,null,null,null,null,null,83,83,{"$f":"IFERROR(VLOOKUP(AC122,'2. Main sheet'!$C:$E,3,0),\"\")","v":""},null,null,null,null,null,null,null,null,null,null,null,null,null,null,null,null,null,null,null,81,{"$f":"IFERROR(VLOOKUP($AY$40&AX122,'4. Resource types'!I:J,2,0),\"\")","v":""}]
[null,null,null,null,82,{"$f":"IFERROR(VLOOKUP($L$18&E123,'6. Sector'!$E:$F,2,0),\"\")","v":"SocArxi Corona Net"},null,null,null,null,null,null,null,null,null,null,82,{"$f":"IFERROR(VLOOKUP($R$40&Q123,'3. Geographical scope'!$E:$F,2,0),\"\")","v":"UNIDO"},null,null,null,null,null,null,null,null,null,84,84,{"$f":"IFERROR(VLOOKUP(AC123,'2. Main sheet'!$C:$E,3,0),\"\")","v":""},null,null,null,null,null,null,null,null,null,null,null,null,null,null,null,null,null,null,null,82,{"$f":"IFERROR(VLOOKUP($AY$40&AX123,'4. Resource types'!I:J,2,0),\"\")","v":""}]
[null,null,null,null,83,{"$f":"IFERROR(VLOOKUP($L$18&E124,'6. Sector'!$E:$F,2,0),\"\")","v":"WHO R & D"},null,null,null,null,null,null,null,null,null,null,83,{"$f":"IFERROR(VLOOKUP($R$40&Q124,'3. Geographical scope'!$E:$F,2,0),\"\")","v":"International Centre for not-for-profit law"},null,null,null,null,null,null,null,null,null,85,85,{"$f":"IFERROR(VLOOKUP(AC124,'2. Main sheet'!$C:$E,3,0),\"\")","v":""},null,null,null,null,null,null,null,null,null,null,null,null,null,null,null,null,null,null,null,83,{"$f":"IFERROR(VLOOKUP($AY$40&AX124,'4. Resource types'!I:J,2,0),\"\")","v":""}]
[null,null,null,null,84,{"$f":"IFERROR(VLOOKUP($L$18&E125,'6. Sector'!$E:$F,2,0),\"\")","v":"United Nations Office for the Coordination of Humanitarian Affairs"},null,null,null,null,null,null,null,null,null,null,84,{"$f":"IFERROR(VLOOKUP($R$40&Q125,'3. Geographical scope'!$E:$F,2,0),\"\")","v":"Zimbabwe COVID-19 Support Hub"},null,null,null,null,null,null,null,null,null,86,86,{"$f":"IFERROR(VLOOKUP(AC125,'2. Main sheet'!$C:$E,3,0),\"\")","v":""},null,null,null,null,null,null,null,null,null,null,null,null,null,null,null,null,null,null,null,84,{"$f":"IFERROR(VLOOKUP($AY$40&AX125,'4. Resource types'!I:J,2,0),\"\")","v":""}]
[null,null,null,null,85,{"$f":"IFERROR(VLOOKUP($L$18&E126,'6. Sector'!$E:$F,2,0),\"\")","v":"Communication Initiative"},null,null,null,null,null,null,null,null,null,null,85,{"$f":"IFERROR(VLOOKUP($R$40&Q126,'3. Geographical scope'!$E:$F,2,0),\"\")","v":"Asian Development Bank"},null,null,null,null,null,null,null,null,null,87,87,{"$f":"IFERROR(VLOOKUP(AC126,'2. Main sheet'!$C:$E,3,0),\"\")","v":""},null,null,null,null,null,null,null,null,null,null,null,null,null,null,null,null,null,null,null,85,{"$f":"IFERROR(VLOOKUP($AY$40&AX126,'4. Resource types'!I:J,2,0),\"\")","v":"(USA) White House Call to Action to the Tech Community on New Machine Readable COVID-19 Dataset"}]
[null,null,null,null,86,{"$f":"IFERROR(VLOOKUP($L$18&E127,'6. Sector'!$E:$F,2,0),\"\")","v":"Knowledge to Policy Center, American University of Beirut"},null,null,null,null,null,null,null,null,null,null,86,{"$f":"IFERROR(VLOOKUP($R$40&Q127,'3. Geographical scope'!$E:$F,2,0),\"\")","v":"Tableau Public"},null,null,null,null,null,null,null,null,null,88,88,{"$f":"IFERROR(VLOOKUP(AC127,'2. Main sheet'!$C:$E,3,0),\"\")","v":""},null,null,null,null,null,null,null,null,null,null,null,null,null,null,null,null,null,null,null,86,{"$f":"IFERROR(VLOOKUP($AY$40&AX127,'4. Resource types'!I:J,2,0),\"\")","v":""}]
[null,null,null,null,87,{"$f":"IFERROR(VLOOKUP($L$18&E128,'6. Sector'!$E:$F,2,0),\"\")","v":"American Psychological Association: Education"},null,null,null,null,null,null,null,null,null,null,87,{"$f":"IFERROR(VLOOKUP($R$40&Q128,'3. Geographical scope'!$E:$F,2,0),\"\")","v":"Havard Dataverse"},null,null,null,null,null,null,null,null,null,89,89,{"$f":"IFERROR(VLOOKUP(AC128,'2. Main sheet'!$C:$E,3,0),\"\")","v":""},null,null,null,null,null,null,null,null,null,null,null,null,null,null,null,null,null,null,null,87,{"$f":"IFERROR(VLOOKUP($AY$40&AX128,'4. Resource types'!I:J,2,0),\"\")","v":"Wiley Covid-19: Novel Coronavirus Outbreak"}]
[null,null,null,null,88,{"$f":"IFERROR(VLOOKUP($L$18&E129,'6. Sector'!$E:$F,2,0),\"\")","v":"Guidelines Network International"},null,null,null,null,null,null,null,null,null,null,88,{"$f":"IFERROR(VLOOKUP($R$40&Q129,'3. Geographical scope'!$E:$F,2,0),\"\")","v":"WHO Global research on coronavirus disease (COVID-19)"},null,null,null,null,null,null,null,null,null,90,90,{"$f":"IFERROR(VLOOKUP(AC129,'2. Main sheet'!$C:$E,3,0),\"\")","v":""},null,null,null,null,null,null,null,null,null,null,null,null,null,null,null,null,null,null,null,88,{"$f":"IFERROR(VLOOKUP($AY$40&AX129,'4. Resource types'!I:J,2,0),\"\")","v":""}]
[null,null,null,null,89,{"$f":"IFERROR(VLOOKUP($L$18&E130,'6. Sector'!$E:$F,2,0),\"\")","v":"ECRI Guidelines Trust COVID-19 Resource Center"},null,null,null,null,null,null,null,null,null,null,89,{"$f":"IFERROR(VLOOKUP($R$40&Q130,'3. Geographical scope'!$E:$F,2,0),\"\")","v":"World Health Organization (WHO) technical guidelines"},null,null,null,null,null,null,null,null,null,91,91,{"$f":"IFERROR(VLOOKUP(AC130,'2. Main sheet'!$C:$E,3,0),\"\")","v":""},null,null,null,null,null,null,null,null,null,null,null,null,null,null,null,null,null,null,null,89,{"$f":"IFERROR(VLOOKUP($AY$40&AX130,'4. Resource types'!I:J,2,0),\"\")","v":""}]
[null,null,null,null,90,{"$f":"IFERROR(VLOOKUP($L$18&E131,'6. Sector'!$E:$F,2,0),\"\")","v":"MAGICapp"},null,null,null,null,null,null,null,null,null,null,90,{"$f":"IFERROR(VLOOKUP($R$40&Q131,'3. Geographical scope'!$E:$F,2,0),\"\")","v":"UNESCO Planipolis"},null,null,null,null,null,null,null,null,null,92,92,{"$f":"IFERROR(VLOOKUP(AC131,'2. Main sheet'!$C:$E,3,0),\"\")","v":""},null,null,null,null,null,null,null,null,null,null,null,null,null,null,null,null,null,null,null,90,{"$f":"IFERROR(VLOOKUP($AY$40&AX131,'4. Resource types'!I:J,2,0),\"\")","v":"Springer Nature"}]
[null,null,null,null,91,{"$f":"IFERROR(VLOOKUP($L$18&E132,'6. Sector'!$E:$F,2,0),\"\")","v":"McMaster Optimal Aging Portal"},null,null,null,null,null,null,null,null,null,null,91,{"$f":"IFERROR(VLOOKUP($R$40&Q132,'3. Geographical scope'!$E:$F,2,0),\"\")","v":"U.S. Veterans’ Affairs (VA) Evidence Synthesis Program"},null,null,null,null,null,null,null,null,null,93,93,{"$f":"IFERROR(VLOOKUP(AC132,'2. Main sheet'!$C:$E,3,0),\"\")","v":""},null,null,null,null,null,null,null,null,null,null,null,null,null,null,null,null,null,null,null,91,{"$f":"IFERROR(VLOOKUP($AY$40&AX132,'4. Resource types'!I:J,2,0),\"\")","v":""}]
[null,null,null,null,92,{"$f":"IFERROR(VLOOKUP($L$18&E133,'6. Sector'!$E:$F,2,0),\"\")","v":"Havard Dataverse"},null,null,null,null,null,null,null,null,null,null,92,{"$f":"IFERROR(VLOOKUP($R$40&Q133,'3. Geographical scope'!$E:$F,2,0),\"\")","v":"Santé Public France"},null,null,null,null,null,null,null,null,null,94,94,{"$f":"IFERROR(VLOOKUP(AC133,'2. Main sheet'!$C:$E,3,0),\"\")","v":""},null,null,null,null,null,null,null,null,null,null,null,null,null,null,null,null,null,null,null,92,{"$f":"IFERROR(VLOOKUP($AY$40&AX133,'4. Resource types'!I:J,2,0),\"\")","v":""}]
[null,null,null,null,93,{"$f":"IFERROR(VLOOKUP($L$18&E134,'6. Sector'!$E:$F,2,0),\"\")","v":"PROSPERO"},null,null,null,null,null,null,null,null,null,null,93,{"$f":"IFERROR(VLOOKUP($R$40&Q134,'3. Geographical scope'!$E:$F,2,0),\"\")","v":"Campbell UK and Ireland"},null,null,null,null,null,null,null,null,null,95,95,{"$f":"IFERROR(VLOOKUP(AC134,'2. Main sheet'!$C:$E,3,0),\"\")","v":""},null,null,null,null,null,null,null,null,null,null,null,null,null,null,null,null,null,null,null,93,{"$f":"IFERROR(VLOOKUP($AY$40&AX134,'4. Resource types'!I:J,2,0),\"\")","v":""}]
[null,null,null,null,94,{"$f":"IFERROR(VLOOKUP($L$18&E135,'6. Sector'!$E:$F,2,0),\"\")","v":"Turning Research Into Practice (TRIP)"},null,null,null,null,null,null,null,null,null,null,94,{"$f":"IFERROR(VLOOKUP($R$40&Q135,'3. Geographical scope'!$E:$F,2,0),\"\")","v":"Africaxiv"},null,null,null,null,null,null,null,null,null,96,96,{"$f":"IFERROR(VLOOKUP(AC135,'2. Main sheet'!$C:$E,3,0),\"\")","v":""},null,null,null,null,null,null,null,null,null,null,null,null,null,null,null,null,null,null,null,94,{"$f":"IFERROR(VLOOKUP($AY$40&AX135,'4. Resource types'!I:J,2,0),\"\")","v":"Cochrane Covid-19 Study register"}]
[null,null,null,null,95,{"$f":"IFERROR(VLOOKUP($L$18&E136,'6. Sector'!$E:$F,2,0),\"\")","v":"George Institute"},null,null,null,null,null,null,null,null,null,null,95,{"$f":"IFERROR(VLOOKUP($R$40&Q136,'3. Geographical scope'!$E:$F,2,0),\"\")","v":"Our World In data Policy Responses to the Coronavirus Pandemic"},null,null,null,null,null,null,null,null,null,97,97,{"$f":"IFERROR(VLOOKUP(AC136,'2. Main sheet'!$C:$E,3,0),\"\")","v":""},null,null,null,null,null,null,null,null,null,null,null,null,null,null,null,null,null,null,null,95,{"$f":"IFERROR(VLOOKUP($AY$40&AX136,'4. Resource types'!I:J,2,0),\"\")","v":"Coronavirus Tech Handbook"}]
[null,null,null,null,96,{"$f":"IFERROR(VLOOKUP($L$18&E137,'6. Sector'!$E:$F,2,0),\"\")","v":"World Health Organization (WHO) technical guidelines"},null,null,null,null,null,null,null,null,null,null,96,{"$f":"IFERROR(VLOOKUP($R$40&Q137,'3. Geographical scope'!$E:$F,2,0),\"\")","v":"Wolters Kluwer Global Infectious Diseases and Epidemiology Online Network (GIDEON)"},null,null,null,null,null,null,null,null,null,98,98,{"$f":"IFERROR(VLOOKUP(AC137,'2. Main sheet'!$C:$E,3,0),\"\")","v":""},null,null,null,null,null,null,null,null,null,null,null,null,null,null,null,null,null,null,null,96,{"$f":"IFERROR(VLOOKUP($AY$40&AX137,'4. Resource types'!I:J,2,0),\"\")","v":""}]
[null,null,null,null,97,{"$f":"IFERROR(VLOOKUP($L$18&E138,'6. Sector'!$E:$F,2,0),\"\")","v":"WHO Global research on coronavirus disease (COVID-19)"},null,null,null,null,null,null,null,null,null,null,97,{"$f":"IFERROR(VLOOKUP($R$40&Q138,'3. Geographical scope'!$E:$F,2,0),\"\")","v":"European Society of Intensive Care Medicine"},null,null,null,null,null,null,null,null,null,99,99,{"$f":"IFERROR(VLOOKUP(AC138,'2. Main sheet'!$C:$E,3,0),\"\")","v":""},null,null,null,null,null,null,null,null,null,null,null,null,null,null,null,null,null,null,null,97,{"$f":"IFERROR(VLOOKUP($AY$40&AX138,'4. Resource types'!I:J,2,0),\"\")","v":""}]
[null,null,null,null,98,{"$f":"IFERROR(VLOOKUP($L$18&E139,'6. Sector'!$E:$F,2,0),\"\")","v":"Love Platform"},null,null,null,null,null,null,null,null,null,null,98,{"$f":"IFERROR(VLOOKUP($R$40&Q139,'3. Geographical scope'!$E:$F,2,0),\"\")","v":"Health Data Research UK"},null,null,null,null,null,null,null,null,null,100,100,{"$f":"IFERROR(VLOOKUP(AC139,'2. Main sheet'!$C:$E,3,0),\"\")","v":""},null,null,null,null,null,null,null,null,null,null,null,null,null,null,null,null,null,null,null,98,{"$f":"IFERROR(VLOOKUP($AY$40&AX139,'4. Resource types'!I:J,2,0),\"\")","v":""}]
[null,null,null,null,99,{"$f":"IFERROR(VLOOKUP($L$18&E140,'6. Sector'!$E:$F,2,0),\"\")","v":"European Respiratory Society"},null,null,null,null,null,null,null,null,null,null,99,{"$f":"IFERROR(VLOOKUP($R$40&Q140,'3. Geographical scope'!$E:$F,2,0),\"\")","v":"CGD - COVID education policy tracking"},null,null,null,null,null,null,null,null,null,101,101,{"$f":"IFERROR(VLOOKUP(AC140,'2. Main sheet'!$C:$E,3,0),\"\")","v":""},null,null,null,null,null,null,null,null,null,null,null,null,null,null,null,null,null,null,null,99,{"$f":"IFERROR(VLOOKUP($AY$40&AX140,'4. Resource types'!I:J,2,0),\"\")","v":""}]
[null,null,null,null,100,{"$f":"IFERROR(VLOOKUP($L$18&E141,'6. Sector'!$E:$F,2,0),\"\")","v":"Chinese Center for Disease Control and Prevention"},null,null,null,null,null,null,null,null,null,null,100,{"$f":"IFERROR(VLOOKUP($R$40&Q141,'3. Geographical scope'!$E:$F,2,0),\"\")","v":"World Pandemic Research Network (WPRN) "},null,null,null,null,null,null,null,null,null,102,102,{"$f":"IFERROR(VLOOKUP(AC141,'2. Main sheet'!$C:$E,3,0),\"\")","v":""},null,null,null,null,null,null,null,null,null,null,null,null,null,null,null,null,null,null,null,100,{"$f":"IFERROR(VLOOKUP($AY$40&AX141,'4. Resource types'!I:J,2,0),\"\")","v":""}]
[null,null,null,null,101,{"$f":"IFERROR(VLOOKUP($L$18&E142,'6. Sector'!$E:$F,2,0),\"\")","v":"Antimicrobial Stewardship"},null,null,null,null,null,null,null,null,null,null,101,{"$f":"IFERROR(VLOOKUP($R$40&Q142,'3. Geographical scope'!$E:$F,2,0),\"\")","v":"OECD Cities responses"},null,null,null,null,null,null,null,null,null,103,103,{"$f":"IFERROR(VLOOKUP(AC142,'2. Main sheet'!$C:$E,3,0),\"\")","v":""},null,null,null,null,null,null,null,null,null,null,null,null,null,null,null,null,null,null,null,101,{"$f":"IFERROR(VLOOKUP($AY$40&AX142,'4. Resource types'!I:J,2,0),\"\")","v":""}]
[null,null,null,null,102,{"$f":"IFERROR(VLOOKUP($L$18&E143,'6. Sector'!$E:$F,2,0),\"\")","v":"U.S. Veterans’ Affairs (VA) Evidence Synthesis Program"},null,null,null,null,null,null,null,null,null,null,102,{"$f":"IFERROR(VLOOKUP($R$40&Q143,'3. Geographical scope'!$E:$F,2,0),\"\")","v":"International Growth Centre(ICG)"},null,null,null,null,null,null,null,null,null,104,104,{"$f":"IFERROR(VLOOKUP(AC143,'2. Main sheet'!$C:$E,3,0),\"\")","v":""},null,null,null,null,null,null,null,null,null,null,null,null,null,null,null,null,null,null,null,102,{"$f":"IFERROR(VLOOKUP($AY$40&AX143,'4. Resource types'!I:J,2,0),\"\")","v":""}]
[null,null,null,null,103,{"$f":"IFERROR(VLOOKUP($L$18&E144,'6. Sector'!$E:$F,2,0),\"\")","v":"WHO Regional Office for Europe (technical guidance)"},null,null,null,null,null,null,null,null,null,null,103,{"$f":"IFERROR(VLOOKUP($R$40&Q144,'3. Geographical scope'!$E:$F,2,0),\"\")","v":"EY COVID-19 Global Trade Considerations tracker "},null,null,null,null,null,null,null,null,null,105,105,{"$f":"IFERROR(VLOOKUP(AC144,'2. Main sheet'!$C:$E,3,0),\"\")","v":""},null,null,null,null,null,null,null,null,null,null,null,null,null,null,null,null,null,null,null,103,{"$f":"IFERROR(VLOOKUP($AY$40&AX144,'4. Resource types'!I:J,2,0),\"\")","v":"Covid-19 Innovations"}]
[null,null,null,null,104,{"$f":"IFERROR(VLOOKUP($L$18&E145,'6. Sector'!$E:$F,2,0),\"\")","v":"International Network for Government Science Advice (INGSA)"},null,null,null,null,null,null,null,null,null,null,104,{"$f":"IFERROR(VLOOKUP($R$40&Q145,'3. Geographical scope'!$E:$F,2,0),\"\")","v":"OECD SME Policy Responses"},null,null,null,null,null,null,null,null,null,106,106,{"$f":"IFERROR(VLOOKUP(AC145,'2. Main sheet'!$C:$E,3,0),\"\")","v":""},null,null,null,null,null,null,null,null,null,null,null,null,null,null,null,null,null,null,null,104,{"$f":"IFERROR(VLOOKUP($AY$40&AX145,'4. Resource types'!I:J,2,0),\"\")","v":""}]
[null,null,null,null,105,{"$f":"IFERROR(VLOOKUP($L$18&E146,'6. Sector'!$E:$F,2,0),\"\")","v":"Health Technology Assessment International"},null,null,null,null,null,null,null,null,null,null,105,{"$f":"IFERROR(VLOOKUP($R$40&Q146,'3. Geographical scope'!$E:$F,2,0),\"\")","v":"CIAT/IOTA/OECD Tax Response"},null,null,null,null,null,null,null,null,null,107,107,{"$f":"IFERROR(VLOOKUP(AC146,'2. Main sheet'!$C:$E,3,0),\"\")","v":""},null,null,null,null,null,null,null,null,null,null,null,null,null,null,null,null,null,null,null,105,{"$f":"IFERROR(VLOOKUP($AY$40&AX146,'4. Resource types'!I:J,2,0),\"\")","v":""}]
[null,null,null,null,106,{"$f":"IFERROR(VLOOKUP($L$18&E147,'6. Sector'!$E:$F,2,0),\"\")","v":"Call for Action: COVID-19 Data Collaboratives"},null,null,null,null,null,null,null,null,null,null,106,{"$f":"IFERROR(VLOOKUP($R$40&Q147,'3. Geographical scope'!$E:$F,2,0),\"\")","v":"IFPRI Covid 19 Food Trade Policy Tracker"},null,null,null,null,null,null,null,null,null,108,108,{"$f":"IFERROR(VLOOKUP(AC147,'2. Main sheet'!$C:$E,3,0),\"\")","v":""},null,null,null,null,null,null,null,null,null,null,null,null,null,null,null,null,null,null,null,106,{"$f":"IFERROR(VLOOKUP($AY$40&AX147,'4. Resource types'!I:J,2,0),\"\")","v":""}]
[null,null,null,null,107,{"$f":"IFERROR(VLOOKUP($L$18&E148,'6. Sector'!$E:$F,2,0),\"\")","v":"Annals of Internal Medicine"},null,null,null,null,null,null,null,null,null,null,107,{"$f":"IFERROR(VLOOKUP($R$40&Q148,'3. Geographical scope'!$E:$F,2,0),\"\")","v":"Global Health Network Covid-19 Research Implementation Hub"},null,null,null,null,null,null,null,null,null,109,109,{"$f":"IFERROR(VLOOKUP(AC148,'2. Main sheet'!$C:$E,3,0),\"\")","v":""},null,null,null,null,null,null,null,null,null,null,null,null,null,null,null,null,null,null,null,107,{"$f":"IFERROR(VLOOKUP($AY$40&AX148,'4. Resource types'!I:J,2,0),\"\")","v":""}]
[null,null,null,null,108,{"$f":"IFERROR(VLOOKUP($L$18&E149,'6. Sector'!$E:$F,2,0),\"\")","v":"Santé Public France"},null,null,null,null,null,null,null,null,null,null,108,{"$f":"IFERROR(VLOOKUP($R$40&Q149,'3. Geographical scope'!$E:$F,2,0),\"\")","v":"OECD Tourism Summary"},null,null,null,null,null,null,null,null,null,110,110,{"$f":"IFERROR(VLOOKUP(AC149,'2. Main sheet'!$C:$E,3,0),\"\")","v":""},null,null,null,null,null,null,null,null,null,null,null,null,null,null,null,null,null,null,null,108,{"$f":"IFERROR(VLOOKUP($AY$40&AX149,'4. Resource types'!I:J,2,0),\"\")","v":""}]
[null,null,null,null,109,{"$f":"IFERROR(VLOOKUP($L$18&E150,'6. Sector'!$E:$F,2,0),\"\")","v":"Institut national d’excellence en santé et en services sociaux"},null,null,null,null,null,null,null,null,null,null,109,{"$f":"IFERROR(VLOOKUP($R$40&Q150,'3. Geographical scope'!$E:$F,2,0),\"\")","v":"Kaggle"},null,null,null,null,null,null,null,null,null,111,111,{"$f":"IFERROR(VLOOKUP(AC150,'2. Main sheet'!$C:$E,3,0),\"\")","v":""},null,null,null,null,null,null,null,null,null,null,null,null,null,null,null,null,null,null,null,109,{"$f":"IFERROR(VLOOKUP($AY$40&AX150,'4. Resource types'!I:J,2,0),\"\")","v":""}]
[null,null,null,null,110,{"$f":"IFERROR(VLOOKUP($L$18&E151,'6. Sector'!$E:$F,2,0),\"\")","v":"Campbell UK and Ireland"},null,null,null,null,null,null,null,null,null,null,110,{"$f":"IFERROR(VLOOKUP($R$40&Q151,'3. Geographical scope'!$E:$F,2,0),\"\")","v":"Google Covid-19 Community Mobility Reports"},null,null,null,null,null,null,null,null,null,112,112,{"$f":"IFERROR(VLOOKUP(AC151,'2. Main sheet'!$C:$E,3,0),\"\")","v":""},null,null,null,null,null,null,null,null,null,null,null,null,null,null,null,null,null,null,null,110,{"$f":"IFERROR(VLOOKUP($AY$40&AX151,'4. Resource types'!I:J,2,0),\"\")","v":"Centre for Effective Practice"}]
[null,null,null,null,111,{"$f":"IFERROR(VLOOKUP($L$18&E152,'6. Sector'!$E:$F,2,0),\"\")","v":"CareSearch: Palliative Care Knowledge Network"},null,null,null,null,null,null,null,null,null,null,111,{"$f":"IFERROR(VLOOKUP($R$40&Q152,'3. Geographical scope'!$E:$F,2,0),\"\")","v":"Wiley Covid-19: Novel Coronavirus Outbreak"},null,null,null,null,null,null,null,null,null,113,113,{"$f":"IFERROR(VLOOKUP(AC152,'2. Main sheet'!$C:$E,3,0),\"\")","v":""},null,null,null,null,null,null,null,null,null,null,null,null,null,null,null,null,null,null,null,111,{"$f":"IFERROR(VLOOKUP($AY$40&AX152,'4. Resource types'!I:J,2,0),\"\")","v":""}]
[null,null,null,null,112,{"$f":"IFERROR(VLOOKUP($L$18&E153,'6. Sector'!$E:$F,2,0),\"\")","v":"Distiller SR : Evidence Summary "},null,null,null,null,null,null,null,null,null,null,112,{"$f":"IFERROR(VLOOKUP($R$40&Q153,'3. Geographical scope'!$E:$F,2,0),\"\")","v":"COVID-19 Disorder Tracker (CDT)"},null,null,null,null,null,null,null,null,null,114,114,{"$f":"IFERROR(VLOOKUP(AC153,'2. Main sheet'!$C:$E,3,0),\"\")","v":""},null,null,null,null,null,null,null,null,null,null,null,null,null,null,null,null,null,null,null,112,{"$f":"IFERROR(VLOOKUP($AY$40&AX153,'4. Resource types'!I:J,2,0),\"\")","v":""}]
[null,null,null,null,113,{"$f":"IFERROR(VLOOKUP($L$18&E154,'6. Sector'!$E:$F,2,0),\"\")","v":"Africaxiv"},null,null,null,null,null,null,null,null,null,null,113,{"$f":"IFERROR(VLOOKUP($R$40&Q154,'3. Geographical scope'!$E:$F,2,0),\"\")","v":"African Policy Monitor"},null,null,null,null,null,null,null,null,null,115,115,{"$f":"IFERROR(VLOOKUP(AC154,'2. Main sheet'!$C:$E,3,0),\"\")","v":""},null,null,null,null,null,null,null,null,null,null,null,null,null,null,null,null,null,null,null,113,{"$f":"IFERROR(VLOOKUP($AY$40&AX154,'4. Resource types'!I:J,2,0),\"\")","v":""}]
[null,null,null,null,114,{"$f":"IFERROR(VLOOKUP($L$18&E155,'6. Sector'!$E:$F,2,0),\"\")","v":"Wolters Kluwer Global Infectious Diseases and Epidemiology Online Network (GIDEON)"},null,null,null,null,null,null,null,null,null,null,114,{"$f":"IFERROR(VLOOKUP($R$40&Q155,'3. Geographical scope'!$E:$F,2,0),\"\")","v":"Global Policy Responses – Developed Markets "},null,null,null,null,null,null,null,null,null,116,116,{"$f":"IFERROR(VLOOKUP(AC155,'2. Main sheet'!$C:$E,3,0),\"\")","v":""},null,null,null,null,null,null,null,null,null,null,null,null,null,null,null,null,null,null,null,114,{"$f":"IFERROR(VLOOKUP($AY$40&AX155,'4. Resource types'!I:J,2,0),\"\")","v":""}]
[null,null,null,null,115,{"$f":"IFERROR(VLOOKUP($L$18&E156,'6. Sector'!$E:$F,2,0),\"\")","v":"ILO Social Protection Monitor"},null,null,null,null,null,null,null,null,null,null,115,{"$f":"IFERROR(VLOOKUP($R$40&Q156,'3. Geographical scope'!$E:$F,2,0),\"\")","v":"Economic Relief Around the World"},null,null,null,null,null,null,null,null,null,117,117,{"$f":"IFERROR(VLOOKUP(AC156,'2. Main sheet'!$C:$E,3,0),\"\")","v":""},null,null,null,null,null,null,null,null,null,null,null,null,null,null,null,null,null,null,null,115,{"$f":"IFERROR(VLOOKUP($AY$40&AX156,'4. Resource types'!I:J,2,0),\"\")","v":""}]
[null,null,null,null,116,{"$f":"IFERROR(VLOOKUP($L$18&E157,'6. Sector'!$E:$F,2,0),\"\")","v":"Our World In data Policy Responses to the Coronavirus Pandemic"},null,null,null,null,null,null,null,null,null,null,116,{"$f":"IFERROR(VLOOKUP($R$40&Q157,'3. Geographical scope'!$E:$F,2,0),\"\")","v":"Impact Peace Resources on Covid"},null,null,null,null,null,null,null,null,null,118,118,{"$f":"IFERROR(VLOOKUP(AC157,'2. Main sheet'!$C:$E,3,0),\"\")","v":""},null,null,null,null,null,null,null,null,null,null,null,null,null,null,null,null,null,null,null,116,{"$f":"IFERROR(VLOOKUP($AY$40&AX157,'4. Resource types'!I:J,2,0),\"\")","v":"Kenyan Government"}]
[null,null,null,null,117,{"$f":"IFERROR(VLOOKUP($L$18&E158,'6. Sector'!$E:$F,2,0),\"\")","v":"European Society of Intensive Care Medicine"},null,null,null,null,null,null,null,null,null,null,117,{"$f":"IFERROR(VLOOKUP($R$40&Q158,'3. Geographical scope'!$E:$F,2,0),\"\")","v":"EBSCO Medical"},null,null,null,null,null,null,null,null,null,119,119,{"$f":"IFERROR(VLOOKUP(AC158,'2. Main sheet'!$C:$E,3,0),\"\")","v":""},null,null,null,null,null,null,null,null,null,null,null,null,null,null,null,null,null,null,null,117,{"$f":"IFERROR(VLOOKUP($AY$40&AX158,'4. Resource types'!I:J,2,0),\"\")","v":""}]
[null,null,null,null,118,{"$f":"IFERROR(VLOOKUP($L$18&E159,'6. Sector'!$E:$F,2,0),\"\")","v":"IIASA COVID-19 : Visualizing regional socioeconomic indicators for Europe"},null,null,null,null,null,null,null,null,null,null,118,{"$f":"IFERROR(VLOOKUP($R$40&Q159,'3. Geographical scope'!$E:$F,2,0),\"\")","v":"UNDP HDR Global Preparedness and Vulnerability Dashboard"},null,null,null,null,null,null,null,null,null,120,120,{"$f":"IFERROR(VLOOKUP(AC159,'2. Main sheet'!$C:$E,3,0),\"\")","v":""},null,null,null,null,null,null,null,null,null,null,null,null,null,null,null,null,null,null,null,118,{"$f":"IFERROR(VLOOKUP($AY$40&AX159,'4. Resource types'!I:J,2,0),\"\")","v":""}]
[null,null,null,null,119,{"$f":"IFERROR(VLOOKUP($L$18&E160,'6. Sector'!$E:$F,2,0),\"\")","v":"National Institutes of Health treatment guidelines"},null,null,null,null,null,null,null,null,null,null,119,{"$f":"IFERROR(VLOOKUP($R$40&Q160,'3. Geographical scope'!$E:$F,2,0),\"\")","v":""},null,null,null,null,null,null,null,null,null,121,121,{"$f":"IFERROR(VLOOKUP(AC160,'2. Main sheet'!$C:$E,3,0),\"\")","v":""},null,null,null,null,null,null,null,null,null,null,null,null,null,null,null,null,null,null,null,119,{"$f":"IFERROR(VLOOKUP($AY$40&AX160,'4. Resource types'!I:J,2,0),\"\")","v":"OECD Science and innovation policy responses by country"}]
[null,null,null,null,null,{"$f":"IFERROR(VLOOKUP($L$18&E161,'6. Sector'!$E:$F,2,0),\"\")","v":""},null,null,null,null,null,null,null,null,null,null,120,{"$f":"IFERROR(VLOOKUP($R$40&Q161,'3. Geographical scope'!$E:$F,2,0),\"\")","v":""},null,null,null,null,null,null,null,null,null,122,122,{"$f":"IFERROR(VLOOKUP(AC161,'2. Main sheet'!$C:$E,3,0),\"\")","v":""},null,null,null,null,null,null,null,null,null,null,null,null,null,null,null,null,null,null,null,120,{"$f":"IFERROR(VLOOKUP($AY$40&AX161,'4. Resource types'!I:J,2,0),\"\")","v":"Ontario Ministry of Health ,Ministry of Long-Term Care"}]
[null,null,null,null,null,{"$f":"IFERROR(VLOOKUP($L$18&E162,'6. Sector'!$E:$F,2,0),\"\")","v":""},null,null,null,null,null,null,null,null,null,null,121,{"$f":"IFERROR(VLOOKUP($R$40&Q162,'3. Geographical scope'!$E:$F,2,0),\"\")","v":""},null,null,null,null,null,null,null,null,null,123,123,{"$f":"IFERROR(VLOOKUP(AC162,'2. Main sheet'!$C:$E,3,0),\"\")","v":""},null,null,null,null,null,null,null,null,null,null,null,null,null,null,null,null,null,null,null,121,{"$f":"IFERROR(VLOOKUP($AY$40&AX162,'4. Resource types'!I:J,2,0),\"\")","v":""}]
[null,null,null,null,null,{"$f":"IFERROR(VLOOKUP($L$18&E163,'6. Sector'!$E:$F,2,0),\"\")","v":""},null,null,null,null,null,null,null,null,null,null,122,{"$f":"IFERROR(VLOOKUP($R$40&Q163,'3. Geographical scope'!$E:$F,2,0),\"\")","v":""},null,null,null,null,null,null,null,null,null,124,124,{"$f":"IFERROR(VLOOKUP(AC163,'2. Main sheet'!$C:$E,3,0),\"\")","v":""},null,null,null,null,null,null,null,null,null,null,null,null,null,null,null,null,null,null,null,122,{"$f":"IFERROR(VLOOKUP($AY$40&AX163,'4. Resource types'!I:J,2,0),\"\")","v":""}]
[null,null,null,null,null,{"$f":"IFERROR(VLOOKUP($L$18&E164,'6. Sector'!$E:$F,2,0),\"\")","v":""},null,null,null,null,null,null,null,null,null,null,123,{"$f":"IFERROR(VLOOKUP($R$40&Q164,'3. Geographical scope'!$E:$F,2,0),\"\")","v":""},null,null,null,null,null,null,null,null,null,125,125,{"$f":"IFERROR(VLOOKUP(AC164,'2. Main sheet'!$C:$E,3,0),\"\")","v":""},null,null,null,null,null,null,null,null,null,null,null,null,null,null,null,null,null,null,null,123,{"$f":"IFERROR(VLOOKUP($AY$40&AX164,'4. Resource types'!I:J,2,0),\"\")","v":""}]
[null,null,null,null,null,{"$f":"IFERROR(VLOOKUP($L$18&E165,'6. Sector'!$E:$F,2,0),\"\")","v":""},null,null,null,null,null,null,null,null,null,null,124,{"$f":"IFERROR(VLOOKUP($R$40&Q165,'3. Geographical scope'!$E:$F,2,0),\"\")","v":""},null,null,null,null,null,null,null,null,null,126,126,{"$f":"IFERROR(VLOOKUP(AC165,'2. Main sheet'!$C:$E,3,0),\"\")","v":""},null,null,null,null,null,null,null,null,null,null,null,null,null,null,null,null,null,null,null,124,{"$f":"IFERROR(VLOOKUP($AY$40&AX165,'4. Resource types'!I:J,2,0),\"\")","v":""}]
[null,null,null,null,null,{"$f":"IFERROR(VLOOKUP($L$18&E166,'6. Sector'!$E:$F,2,0),\"\")","v":""},null,null,null,null,null,null,null,null,null,null,125,{"$f":"IFERROR(VLOOKUP($R$40&Q166,'3. Geographical scope'!$E:$F,2,0),\"\")","v":""},null,null,null,null,null,null,null,null,null,127,127,{"$f":"IFERROR(VLOOKUP(AC166,'2. Main sheet'!$C:$E,3,0),\"\")","v":""},null,null,null,null,null,null,null,null,null,null,null,null,null,null,null,null,null,null,null,125,{"$f":"IFERROR(VLOOKUP($AY$40&AX166,'4. Resource types'!I:J,2,0),\"\")","v":""}]
[null,null,null,null,null,{"$f":"IFERROR(VLOOKUP($L$18&E167,'6. Sector'!$E:$F,2,0),\"\")","v":""},null,null,null,null,null,null,null,null,null,null,126,{"$f":"IFERROR(VLOOKUP($R$40&Q167,'3. Geographical scope'!$E:$F,2,0),\"\")","v":""},null,null,null,null,null,null,null,null,null,128,128,{"$f":"IFERROR(VLOOKUP(AC167,'2. Main sheet'!$C:$E,3,0),\"\")","v":""},null,null,null,null,null,null,null,null,null,null,null,null,null,null,null,null,null,null,null,126,{"$f":"IFERROR(VLOOKUP($AY$40&AX167,'4. Resource types'!I:J,2,0),\"\")","v":""}]
[null,null,null,null,null,{"$f":"IFERROR(VLOOKUP($L$18&E168,'6. Sector'!$E:$F,2,0),\"\")","v":""},null,null,null,null,null,null,null,null,null,null,127,{"$f":"IFERROR(VLOOKUP($R$40&Q168,'3. Geographical scope'!$E:$F,2,0),\"\")","v":""},null,null,null,null,null,null,null,null,null,129,129,{"$f":"IFERROR(VLOOKUP(AC168,'2. Main sheet'!$C:$E,3,0),\"\")","v":""},null,null,null,null,null,null,null,null,null,null,null,null,null,null,null,null,null,null,null,127,{"$f":"IFERROR(VLOOKUP($AY$40&AX168,'4. Resource types'!I:J,2,0),\"\")","v":""}]
[null,null,null,null,null,null,null,null,null,null,null,null,null,null,null,null,128,{"$f":"IFERROR(VLOOKUP($R$40&Q169,'3. Geographical scope'!$E:$F,2,0),\"\")","v":""},null,null,null,null,null,null,null,null,null,{"$f":"IFERROR(RANK(AC169,$AC$40:$AC$259,1),\"\")","v":130},130,{"$f":"IFERROR(VLOOKUP(AC169,'2. Main sheet'!$C:$E,3,0),\"\")","v":""},null,null,null,null,null,null,null,null,null,null,null,null,null,null,null,null,null,null,null,128,{"$f":"IFERROR(VLOOKUP($AY$40&AX169,'4. Resource types'!I:J,2,0),\"\")","v":""}]
[null,null,null,null,null,null,null,null,null,null,null,null,null,null,null,null,129,{"$f":"IFERROR(VLOOKUP($R$40&Q170,'3. Geographical scope'!$E:$F,2,0),\"\")","v":""},null,null,null,null,null,null,null,null,null,131,131,{"$f":"IFERROR(VLOOKUP(AC170,'2. Main sheet'!$C:$E,3,0),\"\")","v":""},null,null,null,null,null,null,null,null,null,null,null,null,null,null,null,null,null,null,null,129,{"$f":"IFERROR(VLOOKUP($AY$40&AX170,'4. Resource types'!I:J,2,0),\"\")","v":""}]
[null,null,null,null,null,null,null,null,null,null,null,null,null,null,null,null,130,{"$f":"IFERROR(VLOOKUP($R$40&Q171,'3. Geographical scope'!$E:$F,2,0),\"\")","v":""},null,null,null,null,null,null,null,null,null,132,132,{"$f":"IFERROR(VLOOKUP(AC171,'2. Main sheet'!$C:$E,3,0),\"\")","v":""},null,null,null,null,null,null,null,null,null,null,null,null,null,null,null,null,null,null,null,130,{"$f":"IFERROR(VLOOKUP($AY$40&AX171,'4. Resource types'!I:J,2,0),\"\")","v":"Nigerian government"}]
[null,null,null,null,null,null,null,null,null,null,null,null,null,null,null,null,131,{"$f":"IFERROR(VLOOKUP($R$40&Q172,'3. Geographical scope'!$E:$F,2,0),\"\")","v":""},null,null,null,null,null,null,null,null,null,133,133,{"$f":"IFERROR(VLOOKUP(AC172,'2. Main sheet'!$C:$E,3,0),\"\")","v":""},null,null,null,null,null,null,null,null,null,null,null,null,null,null,null,null,null,null,null,131,{"$f":"IFERROR(VLOOKUP($AY$40&AX172,'4. Resource types'!I:J,2,0),\"\")","v":""}]
[null,null,null,null,null,null,null,null,null,null,null,null,null,null,null,null,132,{"$f":"IFERROR(VLOOKUP($R$40&Q173,'3. Geographical scope'!$E:$F,2,0),\"\")","v":""},null,null,null,null,null,null,null,null,null,134,134,{"$f":"IFERROR(VLOOKUP(AC173,'2. Main sheet'!$C:$E,3,0),\"\")","v":""},null,null,null,null,null,null,null,null,null,null,null,null,null,null,null,null,null,null,null,132,{"$f":"IFERROR(VLOOKUP($AY$40&AX173,'4. Resource types'!I:J,2,0),\"\")","v":""}]
[null,null,null,null,null,null,null,null,null,null,null,null,null,null,null,null,133,{"$f":"IFERROR(VLOOKUP($R$40&Q174,'3. Geographical scope'!$E:$F,2,0),\"\")","v":""},null,null,null,null,null,null,null,null,null,135,135,{"$f":"IFERROR(VLOOKUP(AC174,'2. Main sheet'!$C:$E,3,0),\"\")","v":""},null,null,null,null,null,null,null,null,null,null,null,null,null,null,null,null,null,null,null,133,{"$f":"IFERROR(VLOOKUP($AY$40&AX174,'4. Resource types'!I:J,2,0),\"\")","v":"Oxford Evidence Service"}]
[null,null,null,null,null,null,null,null,null,null,null,null,null,null,null,null,134,{"$f":"IFERROR(VLOOKUP($R$40&Q175,'3. Geographical scope'!$E:$F,2,0),\"\")","v":""},null,null,null,null,null,null,null,null,null,136,136,{"$f":"IFERROR(VLOOKUP(AC175,'2. Main sheet'!$C:$E,3,0),\"\")","v":""},null,null,null,null,null,null,null,null,null,null,null,null,null,null,null,null,null,null,null,134,{"$f":"IFERROR(VLOOKUP($AY$40&AX175,'4. Resource types'!I:J,2,0),\"\")","v":""}]
[null,null,null,null,null,null,null,null,null,null,null,null,null,null,null,null,135,{"$f":"IFERROR(VLOOKUP($R$40&Q176,'3. Geographical scope'!$E:$F,2,0),\"\")","v":""},null,null,null,null,null,null,null,null,null,137,137,{"$f":"IFERROR(VLOOKUP(AC176,'2. Main sheet'!$C:$E,3,0),\"\")","v":""},null,null,null,null,null,null,null,null,null,null,null,null,null,null,null,null,null,null,null,135,{"$f":"IFERROR(VLOOKUP($AY$40&AX176,'4. Resource types'!I:J,2,0),\"\")","v":""}]
[null,null,null,null,null,null,null,null,null,null,null,null,null,null,null,null,136,{"$f":"IFERROR(VLOOKUP($R$40&Q177,'3. Geographical scope'!$E:$F,2,0),\"\")","v":""},null,null,null,null,null,null,null,null,null,138,138,{"$f":"IFERROR(VLOOKUP(AC177,'2. Main sheet'!$C:$E,3,0),\"\")","v":""},null,null,null,null,null,null,null,null,null,null,null,null,null,null,null,null,null,null,null,136,{"$f":"IFERROR(VLOOKUP($AY$40&AX177,'4. Resource types'!I:J,2,0),\"\")","v":""}]
[null,null,null,null,null,null,null,null,null,null,null,null,null,null,null,null,137,{"$f":"IFERROR(VLOOKUP($R$40&Q178,'3. Geographical scope'!$E:$F,2,0),\"\")","v":""},null,null,null,null,null,null,null,null,null,139,139,{"$f":"IFERROR(VLOOKUP(AC178,'2. Main sheet'!$C:$E,3,0),\"\")","v":""},null,null,null,null,null,null,null,null,null,null,null,null,null,null,null,null,null,null,null,137,{"$f":"IFERROR(VLOOKUP($AY$40&AX178,'4. Resource types'!I:J,2,0),\"\")","v":""}]
[null,null,null,null,null,null,null,null,null,null,null,null,null,null,null,null,138,{"$f":"IFERROR(VLOOKUP($R$40&Q179,'3. Geographical scope'!$E:$F,2,0),\"\")","v":""},null,null,null,null,null,null,null,null,null,140,140,{"$f":"IFERROR(VLOOKUP(AC179,'2. Main sheet'!$C:$E,3,0),\"\")","v":""},null,null,null,null,null,null,null,null,null,null,null,null,null,null,null,null,null,null,null,138,{"$f":"IFERROR(VLOOKUP($AY$40&AX179,'4. Resource types'!I:J,2,0),\"\")","v":""}]
[null,null,null,null,null,null,null,null,null,null,null,null,null,null,null,null,139,{"$f":"IFERROR(VLOOKUP($R$40&Q180,'3. Geographical scope'!$E:$F,2,0),\"\")","v":""},null,null,null,null,null,null,null,null,null,141,141,{"$f":"IFERROR(VLOOKUP(AC180,'2. Main sheet'!$C:$E,3,0),\"\")","v":""},null,null,null,null,null,null,null,null,null,null,null,null,null,null,null,null,null,null,null,139,{"$f":"IFERROR(VLOOKUP($AY$40&AX180,'4. Resource types'!I:J,2,0),\"\")","v":"Oxford Evidence Service"}]
[null,null,null,null,null,null,null,null,null,null,null,null,null,null,null,null,140,{"$f":"IFERROR(VLOOKUP($R$40&Q181,'3. Geographical scope'!$E:$F,2,0),\"\")","v":""},null,null,null,null,null,null,null,null,null,142,142,{"$f":"IFERROR(VLOOKUP(AC181,'2. Main sheet'!$C:$E,3,0),\"\")","v":""},null,null,null,null,null,null,null,null,null,null,null,null,null,null,null,null,null,null,null,140,{"$f":"IFERROR(VLOOKUP($AY$40&AX181,'4. Resource types'!I:J,2,0),\"\")","v":""}]
[null,null,null,null,null,null,null,null,null,null,null,null,null,null,null,null,141,{"$f":"IFERROR(VLOOKUP($R$40&Q182,'3. Geographical scope'!$E:$F,2,0),\"\")","v":""},null,null,null,null,null,null,null,null,null,143,143,{"$f":"IFERROR(VLOOKUP(AC182,'2. Main sheet'!$C:$E,3,0),\"\")","v":""},null,null,null,null,null,null,null,null,null,null,null,null,null,null,null,null,null,null,null,141,{"$f":"IFERROR(VLOOKUP($AY$40&AX182,'4. Resource types'!I:J,2,0),\"\")","v":""}]
[null,null,null,null,null,null,null,null,null,null,null,null,null,null,null,null,142,{"$f":"IFERROR(VLOOKUP($R$40&Q183,'3. Geographical scope'!$E:$F,2,0),\"\")","v":""},null,null,null,null,null,null,null,null,null,144,144,{"$f":"IFERROR(VLOOKUP(AC183,'2. Main sheet'!$C:$E,3,0),\"\")","v":""},null,null,null,null,null,null,null,null,null,null,null,null,null,null,null,null,null,null,null,142,{"$f":"IFERROR(VLOOKUP($AY$40&AX183,'4. Resource types'!I:J,2,0),\"\")","v":""}]
[null,null,null,null,null,null,null,null,null,null,null,null,null,null,null,null,143,{"$f":"IFERROR(VLOOKUP($R$40&Q184,'3. Geographical scope'!$E:$F,2,0),\"\")","v":""},null,null,null,null,null,null,null,null,null,145,145,{"$f":"IFERROR(VLOOKUP(AC184,'2. Main sheet'!$C:$E,3,0),\"\")","v":""},null,null,null,null,null,null,null,null,null,null,null,null,null,null,null,null,null,null,null,143,{"$f":"IFERROR(VLOOKUP($AY$40&AX184,'4. Resource types'!I:J,2,0),\"\")","v":""}]
[null,null,null,null,null,null,null,null,null,null,null,null,null,null,null,null,144,{"$f":"IFERROR(VLOOKUP($R$40&Q185,'3. Geographical scope'!$E:$F,2,0),\"\")","v":""},null,null,null,null,null,null,null,null,null,146,146,{"$f":"IFERROR(VLOOKUP(AC185,'2. Main sheet'!$C:$E,3,0),\"\")","v":""},null,null,null,null,null,null,null,null,null,null,null,null,null,null,null,null,null,null,null,144,{"$f":"IFERROR(VLOOKUP($AY$40&AX185,'4. Resource types'!I:J,2,0),\"\")","v":""}]
[null,null,null,null,null,null,null,null,null,null,null,null,null,null,null,null,145,{"$f":"IFERROR(VLOOKUP($R$40&Q186,'3. Geographical scope'!$E:$F,2,0),\"\")","v":""},null,null,null,null,null,null,null,null,null,147,147,{"$f":"IFERROR(VLOOKUP(AC186,'2. Main sheet'!$C:$E,3,0),\"\")","v":""},null,null,null,null,null,null,null,null,null,null,null,null,null,null,null,null,null,null,null,145,{"$f":"IFERROR(VLOOKUP($AY$40&AX186,'4. Resource types'!I:J,2,0),\"\")","v":"Cochrane Covid 19 Pregnancy and Fertility"}]
[null,null,null,null,null,null,null,null,null,null,null,null,null,null,null,null,146,{"$f":"IFERROR(VLOOKUP($R$40&Q187,'3. Geographical scope'!$E:$F,2,0),\"\")","v":""},null,null,null,null,null,null,null,null,null,148,148,{"$f":"IFERROR(VLOOKUP(AC187,'2. Main sheet'!$C:$E,3,0),\"\")","v":""},null,null,null,null,null,null,null,null,null,null,null,null,null,null,null,null,null,null,null,146,{"$f":"IFERROR(VLOOKUP($AY$40&AX187,'4. Resource types'!I:J,2,0),\"\")","v":""}]
[null,null,null,null,null,null,null,null,null,null,null,null,null,null,null,null,147,{"$f":"IFERROR(VLOOKUP($R$40&Q188,'3. Geographical scope'!$E:$F,2,0),\"\")","v":""},null,null,null,null,null,null,null,null,null,149,149,{"$f":"IFERROR(VLOOKUP(AC188,'2. Main sheet'!$C:$E,3,0),\"\")","v":""},null,null,null,null,null,null,null,null,null,null,null,null,null,null,null,null,null,null,null,147,{"$f":"IFERROR(VLOOKUP($AY$40&AX188,'4. Resource types'!I:J,2,0),\"\")","v":""}]
[null,null,null,null,null,null,null,null,null,null,null,null,null,null,null,null,148,{"$f":"IFERROR(VLOOKUP($R$40&Q189,'3. Geographical scope'!$E:$F,2,0),\"\")","v":""},null,null,null,null,null,null,null,null,null,150,150,{"$f":"IFERROR(VLOOKUP(AC189,'2. Main sheet'!$C:$E,3,0),\"\")","v":""},null,null,null,null,null,null,null,null,null,null,null,null,null,null,null,null,null,null,null,148,{"$f":"IFERROR(VLOOKUP($AY$40&AX189,'4. Resource types'!I:J,2,0),\"\")","v":""}]
[null,null,null,null,null,null,null,null,null,null,null,null,null,null,null,null,149,{"$f":"IFERROR(VLOOKUP($R$40&Q190,'3. Geographical scope'!$E:$F,2,0),\"\")","v":""},null,null,null,null,null,null,null,null,null,151,151,{"$f":"IFERROR(VLOOKUP(AC190,'2. Main sheet'!$C:$E,3,0),\"\")","v":""},null,null,null,null,null,null,null,null,null,null,null,null,null,null,null,null,null,null,null,149,{"$f":"IFERROR(VLOOKUP($AY$40&AX190,'4. Resource types'!I:J,2,0),\"\")","v":"Johanna Briggs Institute"}]
[null,null,null,null,null,null,null,null,null,null,null,null,null,null,null,null,150,{"$f":"IFERROR(VLOOKUP($R$40&Q191,'3. Geographical scope'!$E:$F,2,0),\"\")","v":""},null,null,null,null,null,null,null,null,null,"",null,null,null,null,null,null,null,null,null,null,null,null,null,null,null,null,null,null,null,null,null,150,{"$f":"IFERROR(VLOOKUP($AY$40&AX191,'4. Resource types'!I:J,2,0),\"\")","v":""}]
[null,null,null,null,null,null,null,null,null,null,null,null,null,null,null,null,151,{"$f":"IFERROR(VLOOKUP($R$40&Q192,'3. Geographical scope'!$E:$F,2,0),\"\")","v":""},null,null,null,null,null,null,null,null,null,"",null,null,null,null,null,null,null,null,null,null,null,null,null,null,null,null,null,null,null,null,null,151,{"$f":"IFERROR(VLOOKUP($AY$40&AX192,'4. Resource types'!I:J,2,0),\"\")","v":"SAGE"}]
[null,null,null,null,null,null,null,null,null,null,null,null,null,null,null,null,152,{"$f":"IFERROR(VLOOKUP($R$40&Q193,'3. Geographical scope'!$E:$F,2,0),\"\")","v":""},null,null,null,null,null,null,null,null,null,"",null,null,null,null,null,null,null,null,null,null,null,null,null,null,null,null,null,null,null,null,null,152,{"$f":"IFERROR(VLOOKUP($AY$40&AX193,'4. Resource types'!I:J,2,0),\"\")","v":""}]
[null,null,null,null,null,null,null,null,null,null,null,null,null,null,null,null,153,{"$f":"IFERROR(VLOOKUP($R$40&Q194,'3. Geographical scope'!$E:$F,2,0),\"\")","v":""},null,null,null,null,null,null,null,null,null,"",null,null,null,null,null,null,null,null,null,null,null,null,null,null,null,null,null,null,null,null,null,153,{"$f":"IFERROR(VLOOKUP($AY$40&AX194,'4. Resource types'!I:J,2,0),\"\")","v":""}]
[null,null,null,null,null,null,null,null,null,null,null,null,null,null,null,null,154,{"$f":"IFERROR(VLOOKUP($R$40&Q195,'3. Geographical scope'!$E:$F,2,0),\"\")","v":""},null,null,null,null,null,null,null,null,null,"",null,null,null,null,null,null,null,null,null,null,null,null,null,null,null,null,null,null,null,null,null,154,{"$f":"IFERROR(VLOOKUP($AY$40&AX195,'4. Resource types'!I:J,2,0),\"\")","v":""}]
[null,null,null,null,null,null,null,null,null,null,null,null,null,null,null,null,155,{"$f":"IFERROR(VLOOKUP($R$40&Q196,'3. Geographical scope'!$E:$F,2,0),\"\")","v":""},null,null,null,null,null,null,null,null,null,"",null,null,null,null,null,null,null,null,null,null,null,null,null,null,null,null,null,null,null,null,null,155,{"$f":"IFERROR(VLOOKUP($AY$40&AX196,'4. Resource types'!I:J,2,0),\"\")","v":""}]
[null,null,null,null,null,null,null,null,null,null,null,null,null,null,null,null,156,{"$f":"IFERROR(VLOOKUP($R$40&Q197,'3. Geographical scope'!$E:$F,2,0),\"\")","v":""},null,null,null,null,null,null,null,null,null,"",null,null,null,null,null,null,null,null,null,null,null,null,null,null,null,null,null,null,null,null,null,156,{"$f":"IFERROR(VLOOKUP($AY$40&AX197,'4. Resource types'!I:J,2,0),\"\")","v":"New England Journal of Medicine"}]
[null,null,null,null,null,null,null,null,null,null,null,null,null,null,null,null,157,{"$f":"IFERROR(VLOOKUP($R$40&Q198,'3. Geographical scope'!$E:$F,2,0),\"\")","v":""},null,null,null,null,null,null,null,null,null,"",null,null,null,null,null,null,null,null,null,null,null,null,null,null,null,null,null,null,null,null,null,157,{"$f":"IFERROR(VLOOKUP($AY$40&AX198,'4. Resource types'!I:J,2,0),\"\")","v":"American Chemistry Society"}]
[null,null,null,null,null,null,null,null,null,null,null,null,null,null,null,null,158,{"$f":"IFERROR(VLOOKUP($R$40&Q199,'3. Geographical scope'!$E:$F,2,0),\"\")","v":""},null,null,null,null,null,null,null,null,null,"",null,null,null,null,null,null,null,null,null,null,null,null,null,null,null,null,null,null,null,null,null,158,{"$f":"IFERROR(VLOOKUP($AY$40&AX199,'4. Resource types'!I:J,2,0),\"\")","v":""}]
[null,null,null,null,null,null,null,null,null,null,null,null,null,null,null,null,159,{"$f":"IFERROR(VLOOKUP($R$40&Q200,'3. Geographical scope'!$E:$F,2,0),\"\")","v":""},null,null,null,null,null,null,null,null,null,"",null,null,null,null,null,null,null,null,null,null,null,null,null,null,null,null,null,null,null,null,null,159,{"$f":"IFERROR(VLOOKUP($AY$40&AX200,'4. Resource types'!I:J,2,0),\"\")","v":""}]
[null,null,null,null,null,null,null,null,null,null,null,null,null,null,null,null,160,{"$f":"IFERROR(VLOOKUP($R$40&Q201,'3. Geographical scope'!$E:$F,2,0),\"\")","v":""},null,null,null,null,null,null,null,null,null,"",null,null,null,null,null,null,null,null,null,null,null,null,null,null,null,null,null,null,null,null,null,160,{"$f":"IFERROR(VLOOKUP($AY$40&AX201,'4. Resource types'!I:J,2,0),\"\")","v":""}]
[null,null,null,null,null,null,null,null,null,null,null,null,null,null,null,null,161,{"$f":"IFERROR(VLOOKUP($R$40&Q202,'3. Geographical scope'!$E:$F,2,0),\"\")","v":""},null,null,null,null,null,null,null,null,null,"",null,null,null,null,null,null,null,null,null,null,null,null,null,null,null,null,null,null,null,null,null,161,{"$f":"IFERROR(VLOOKUP($AY$40&AX202,'4. Resource types'!I:J,2,0),\"\")","v":""}]
[null,null,null,null,null,null,null,null,null,null,null,null,null,null,null,null,162,{"$f":"IFERROR(VLOOKUP($R$40&Q203,'3. Geographical scope'!$E:$F,2,0),\"\")","v":""},null,null,null,null,null,null,null,null,null,"",null,null,null,null,null,null,null,null,null,null,null,null,null,null,null,null,null,null,null,null,null,162,{"$f":"IFERROR(VLOOKUP($AY$40&AX203,'4. Resource types'!I:J,2,0),\"\")","v":""}]
[null,null,null,null,null,null,null,null,null,null,null,null,null,null,null,null,163,{"$f":"IFERROR(VLOOKUP($R$40&Q204,'3. Geographical scope'!$E:$F,2,0),\"\")","v":""},null,null,null,null,null,null,null,null,null,"",null,null,null,null,null,null,null,null,null,null,null,null,null,null,null,null,null,null,null,null,null,163,{"$f":"IFERROR(VLOOKUP($AY$40&AX204,'4. Resource types'!I:J,2,0),\"\")","v":"World Bank Education"}]
[null,null,null,null,null,null,null,null,null,null,null,null,null,null,null,null,164,{"$f":"IFERROR(VLOOKUP($R$40&Q205,'3. Geographical scope'!$E:$F,2,0),\"\")","v":""},null,null,null,null,null,null,null,null,null,"",null,null,null,null,null,null,null,null,null,null,null,null,null,null,null,null,null,null,null,null,null,164,{"$f":"IFERROR(VLOOKUP($AY$40&AX205,'4. Resource types'!I:J,2,0),\"\")","v":""}]
[null,null,null,null,null,null,null,null,null,null,null,null,null,null,null,null,165,{"$f":"IFERROR(VLOOKUP($R$40&Q206,'3. Geographical scope'!$E:$F,2,0),\"\")","v":""},null,null,null,null,null,null,null,null,null,"",null,null,null,null,null,null,null,null,null,null,null,null,null,null,null,null,null,null,null,null,null,165,{"$f":"IFERROR(VLOOKUP($AY$40&AX206,'4. Resource types'!I:J,2,0),\"\")","v":""}]
[null,null,null,null,null,null,null,null,null,null,null,null,null,null,null,null,166,{"$f":"IFERROR(VLOOKUP($R$40&Q207,'3. Geographical scope'!$E:$F,2,0),\"\")","v":""},null,null,null,null,null,null,null,null,null,"",null,null,null,null,null,null,null,null,null,null,null,null,null,null,null,null,null,null,null,null,null,166,{"$f":"IFERROR(VLOOKUP($AY$40&AX207,'4. Resource types'!I:J,2,0),\"\")","v":""}]
[null,null,null,null,null,null,null,null,null,null,null,null,null,null,null,null,167,{"$f":"IFERROR(VLOOKUP($R$40&Q208,'3. Geographical scope'!$E:$F,2,0),\"\")","v":""},null,null,null,null,null,null,null,null,null,"",null,null,null,null,null,null,null,null,null,null,null,null,null,null,null,null,null,null,null,null,null,167,{"$f":"IFERROR(VLOOKUP($AY$40&AX208,'4. Resource types'!I:J,2,0),\"\")","v":""}]
[null,null,null,null,null,null,null,null,null,null,null,null,null,null,null,null,168,{"$f":"IFERROR(VLOOKUP($R$40&Q209,'3. Geographical scope'!$E:$F,2,0),\"\")","v":""},null,null,null,null,null,null,null,null,null,"",null,null,null,null,null,null,null,null,null,null,null,null,null,null,null,null,null,null,null,null,null,168,{"$f":"IFERROR(VLOOKUP($AY$40&AX209,'4. Resource types'!I:J,2,0),\"\")","v":""}]
[null,null,null,null,null,null,null,null,null,null,null,null,null,null,null,null,169,{"$f":"IFERROR(VLOOKUP($R$40&Q210,'3. Geographical scope'!$E:$F,2,0),\"\")","v":""},null,null,null,null,null,null,null,null,null,"",null,null,null,null,null,null,null,null,null,null,null,null,null,null,null,null,null,null,null,null,null,169,{"$f":"IFERROR(VLOOKUP($AY$40&AX210,'4. Resource types'!I:J,2,0),\"\")","v":""}]
[null,null,null,null,null,null,null,null,null,null,null,null,null,null,null,null,170,{"$f":"IFERROR(VLOOKUP($R$40&Q211,'3. Geographical scope'!$E:$F,2,0),\"\")","v":""},null,null,null,null,null,null,null,null,null,"",null,null,null,null,null,null,null,null,null,null,null,null,null,null,null,null,null,null,null,null,null,170,{"$f":"IFERROR(VLOOKUP($AY$40&AX211,'4. Resource types'!I:J,2,0),\"\")","v":""}]
[null,null,null,null,null,null,null,null,null,null,null,null,null,null,null,null,171,{"$f":"IFERROR(VLOOKUP($R$40&Q212,'3. Geographical scope'!$E:$F,2,0),\"\")","v":""},null,null,null,null,null,null,null,null,null,"",null,null,null,null,null,null,null,null,null,null,null,null,null,null,null,null,null,null,null,null,null,171,{"$f":"IFERROR(VLOOKUP($AY$40&AX212,'4. Resource types'!I:J,2,0),\"\")","v":""}]
[null,null,null,null,null,null,null,null,null,null,null,null,null,null,null,null,172,{"$f":"IFERROR(VLOOKUP($R$40&Q213,'3. Geographical scope'!$E:$F,2,0),\"\")","v":""},null,null,null,null,null,null,null,null,null,"",null,null,null,null,null,null,null,null,null,null,null,null,null,null,null,null,null,null,null,null,null,172,{"$f":"IFERROR(VLOOKUP($AY$40&AX213,'4. Resource types'!I:J,2,0),\"\")","v":"Cochrane ENT, Hearing & Balance"}]
[null,null,null,null,null,null,null,null,null,null,null,null,null,null,null,null,173,{"$f":"IFERROR(VLOOKUP($R$40&Q214,'3. Geographical scope'!$E:$F,2,0),\"\")","v":""},null,null,null,null,null,null,null,null,null,"",null,null,null,null,null,null,null,null,null,null,null,null,null,null,null,null,null,null,null,null,null,173,{"$f":"IFERROR(VLOOKUP($AY$40&AX214,'4. Resource types'!I:J,2,0),\"\")","v":""}]
[null,null,null,null,null,null,null,null,null,null,null,null,null,null,null,null,174,{"$f":"IFERROR(VLOOKUP($R$40&Q215,'3. Geographical scope'!$E:$F,2,0),\"\")","v":""},null,null,null,null,null,null,null,null,null,"",null,null,null,null,null,null,null,null,null,null,null,null,null,null,null,null,null,null,null,null,null,174,{"$f":"IFERROR(VLOOKUP($AY$40&AX215,'4. Resource types'!I:J,2,0),\"\")","v":""}]
[null,null,null,null,null,null,null,null,null,null,null,null,null,null,null,null,175,{"$f":"IFERROR(VLOOKUP($R$40&Q216,'3. Geographical scope'!$E:$F,2,0),\"\")","v":""},null,null,null,null,null,null,null,null,null,"",null,null,null,null,null,null,null,null,null,null,null,null,null,null,null,null,null,null,null,null,null,175,{"$f":"IFERROR(VLOOKUP($AY$40&AX216,'4. Resource types'!I:J,2,0),\"\")","v":""}]
[null,null,null,null,null,null,null,null,null,null,null,null,null,null,null,null,176,{"$f":"IFERROR(VLOOKUP($R$40&Q217,'3. Geographical scope'!$E:$F,2,0),\"\")","v":""},null,null,null,null,null,null,null,null,null,"",null,null,null,null,null,null,null,null,null,null,null,null,null,null,null,null,null,null,null,null,null,176,{"$f":"IFERROR(VLOOKUP($AY$40&AX217,'4. Resource types'!I:J,2,0),\"\")","v":""}]
[null,null,null,null,null,null,null,null,null,null,null,null,null,null,null,null,177,{"$f":"IFERROR(VLOOKUP($R$40&Q218,'3. Geographical scope'!$E:$F,2,0),\"\")","v":""},null,null,null,null,null,null,null,null,null,"",null,null,null,null,null,null,null,null,null,null,null,null,null,null,null,null,null,null,null,null,null,177,{"$f":"IFERROR(VLOOKUP($AY$40&AX218,'4. Resource types'!I:J,2,0),\"\")","v":"DynaMed"}]
[null,null,null,null,null,null,null,null,null,null,null,null,null,null,null,null,178,{"$f":"IFERROR(VLOOKUP($R$40&Q219,'3. Geographical scope'!$E:$F,2,0),\"\")","v":""},null,null,null,null,null,null,null,null,null,"",null,null,null,null,null,null,null,null,null,null,null,null,null,null,null,null,null,null,null,null,null,178,{"$f":"IFERROR(VLOOKUP($AY$40&AX219,'4. Resource types'!I:J,2,0),\"\")","v":""}]
[null,null,null,null,null,null,null,null,null,null,null,null,null,null,null,null,179,{"$f":"IFERROR(VLOOKUP($R$40&Q220,'3. Geographical scope'!$E:$F,2,0),\"\")","v":""},null,null,null,null,null,null,null,null,null,"",null,null,null,null,null,null,null,null,null,null,null,null,null,null,null,null,null,null,null,null,null,179,{"$f":"IFERROR(VLOOKUP($AY$40&AX220,'4. Resource types'!I:J,2,0),\"\")","v":""}]
[null,null,null,null,null,null,null,null,null,null,null,null,null,null,null,null,180,{"$f":"IFERROR(VLOOKUP($R$40&Q221,'3. Geographical scope'!$E:$F,2,0),\"\")","v":""},null,null,null,null,null,null,null,null,null,"",null,null,null,null,null,null,null,null,null,null,null,null,null,null,null,null,null,null,null,null,null,180,{"$f":"IFERROR(VLOOKUP($AY$40&AX221,'4. Resource types'!I:J,2,0),\"\")","v":""}]
[null,null,null,null,null,null,null,null,null,null,null,null,null,null,null,null,181,{"$f":"IFERROR(VLOOKUP($R$40&Q222,'3. Geographical scope'!$E:$F,2,0),\"\")","v":""},null,null,null,null,null,null,null,null,null,"",null,null,null,null,null,null,null,null,null,null,null,null,null,null,null,null,null,null,null,null,null,181,{"$f":"IFERROR(VLOOKUP($AY$40&AX222,'4. Resource types'!I:J,2,0),\"\")","v":""}]
[null,null,null,null,null,null,null,null,null,null,null,null,null,null,null,null,182,{"$f":"IFERROR(VLOOKUP($R$40&Q223,'3. Geographical scope'!$E:$F,2,0),\"\")","v":""},null,null,null,null,null,null,null,null,null,"",null,null,null,null,null,null,null,null,null,null,null,null,null,null,null,null,null,null,null,null,null,182,{"$f":"IFERROR(VLOOKUP($AY$40&AX223,'4. Resource types'!I:J,2,0),\"\")","v":""}]
[null,null,null,null,null,null,null,null,null,null,null,null,null,null,null,null,183,{"$f":"IFERROR(VLOOKUP($R$40&Q224,'3. Geographical scope'!$E:$F,2,0),\"\")","v":""},null,null,null,null,null,null,null,null,null,"",null,null,null,null,null,null,null,null,null,null,null,null,null,null,null,null,null,null,null,null,null,183,{"$f":"IFERROR(VLOOKUP($AY$40&AX224,'4. Resource types'!I:J,2,0),\"\")","v":""}]
[null,null,null,null,null,null,null,null,null,null,null,null,null,null,null,null,184,{"$f":"IFERROR(VLOOKUP($R$40&Q225,'3. Geographical scope'!$E:$F,2,0),\"\")","v":""},null,null,null,null,null,null,null,null,null,"",null,null,null,null,null,null,null,null,null,null,null,null,null,null,null,null,null,null,null,null,null,184,{"$f":"IFERROR(VLOOKUP($AY$40&AX225,'4. Resource types'!I:J,2,0),\"\")","v":""}]
[null,null,null,null,null,null,null,null,null,null,null,null,null,null,null,null,185,{"$f":"IFERROR(VLOOKUP($R$40&Q226,'3. Geographical scope'!$E:$F,2,0),\"\")","v":""},null,null,null,null,null,null,null,null,null,"",null,null,null,null,null,null,null,null,null,null,null,null,null,null,null,null,null,null,null,null,null,185,{"$f":"IFERROR(VLOOKUP($AY$40&AX226,'4. Resource types'!I:J,2,0),\"\")","v":"American Society of Microbiology"}]
[null,null,null,null,null,null,null,null,null,null,null,null,null,null,null,null,186,{"$f":"IFERROR(VLOOKUP($R$40&Q227,'3. Geographical scope'!$E:$F,2,0),\"\")","v":""},null,null,null,null,null,null,null,null,null,"",null,null,null,null,null,null,null,null,null,null,null,null,null,null,null,null,null,null,null,null,null,186,{"$f":"IFERROR(VLOOKUP($AY$40&AX227,'4. Resource types'!I:J,2,0),\"\")","v":""}]
[null,null,null,null,null,null,null,null,null,null,null,null,null,null,null,null,187,{"$f":"IFERROR(VLOOKUP($R$40&Q228,'3. Geographical scope'!$E:$F,2,0),\"\")","v":""},null,null,null,null,null,null,null,null,null,"",null,null,null,null,null,null,null,null,null,null,null,null,null,null,null,null,null,null,null,null,null,187,{"$f":"IFERROR(VLOOKUP($AY$40&AX228,'4. Resource types'!I:J,2,0),\"\")","v":"Elsevier Novel Coronavirus Information Center"}]
[null,null,null,null,null,null,null,null,null,null,null,null,null,null,null,null,188,{"$f":"IFERROR(VLOOKUP($R$40&Q229,'3. Geographical scope'!$E:$F,2,0),\"\")","v":""},null,null,null,null,null,null,null,null,null,"",null,null,null,null,null,null,null,null,null,null,null,null,null,null,null,null,null,null,null,null,null,188,{"$f":"IFERROR(VLOOKUP($AY$40&AX229,'4. Resource types'!I:J,2,0),\"\")","v":""}]
[null,null,null,null,null,null,null,null,null,null,null,null,null,null,null,null,189,{"$f":"IFERROR(VLOOKUP($R$40&Q230,'3. Geographical scope'!$E:$F,2,0),\"\")","v":""},null,null,null,null,null,null,null,null,null,"",null,null,null,null,null,null,null,null,null,null,null,null,null,null,null,null,null,null,null,null,null,189,{"$f":"IFERROR(VLOOKUP($AY$40&AX230,'4. Resource types'!I:J,2,0),\"\")","v":""}]
[null,null,null,null,null,null,null,null,null,null,null,null,null,null,null,null,190,{"$f":"IFERROR(VLOOKUP($R$40&Q231,'3. Geographical scope'!$E:$F,2,0),\"\")","v":""},null,null,null,null,null,null,null,null,null,"",null,null,null,null,null,null,null,null,null,null,null,null,null,null,null,null,null,null,null,null,null,190,{"$f":"IFERROR(VLOOKUP($AY$40&AX231,'4. Resource types'!I:J,2,0),\"\")","v":""}]
[null,null,null,null,null,null,null,null,null,null,null,null,null,null,null,null,191,{"$f":"IFERROR(VLOOKUP($R$40&Q232,'3. Geographical scope'!$E:$F,2,0),\"\")","v":""},null,null,null,null,null,null,null,null,null,"",null,null,null,null,null,null,null,null,null,null,null,null,null,null,null,null,null,null,null,null,null,191,{"$f":"IFERROR(VLOOKUP($AY$40&AX232,'4. Resource types'!I:J,2,0),\"\")","v":""}]
[null,null,null,null,null,null,null,null,null,null,null,null,null,null,null,null,192,{"$f":"IFERROR(VLOOKUP($R$40&Q233,'3. Geographical scope'!$E:$F,2,0),\"\")","v":""},null,null,null,null,null,null,null,null,null,{"$f":"IFERROR(RANK(AC233,$AC$40:$AC$259,1),\"\")","v":""},null,null,null,null,null,null,null,null,null,null,null,null,null,null,null,null,null,null,null,null,null,192,{"$f":"IFERROR(VLOOKUP($AY$40&AX233,'4. Resource types'!I:J,2,0),\"\")","v":""}]
[null,null,null,null,null,null,null,null,null,null,null,null,null,null,null,null,193,{"$f":"IFERROR(VLOOKUP($R$40&Q234,'3. Geographical scope'!$E:$F,2,0),\"\")","v":""},null,null,null,null,null,null,null,null,null,"",null,null,null,null,null,null,null,null,null,null,null,null,null,null,null,null,null,null,null,null,null,193,{"$f":"IFERROR(VLOOKUP($AY$40&AX234,'4. Resource types'!I:J,2,0),\"\")","v":""}]
[null,null,null,null,null,null,null,null,null,null,null,null,null,null,null,null,194,{"$f":"IFERROR(VLOOKUP($R$40&Q235,'3. Geographical scope'!$E:$F,2,0),\"\")","v":""},null,null,null,null,null,null,null,null,null,"",null,null,null,null,null,null,null,null,null,null,null,null,null,null,null,null,null,null,null,null,null,194,{"$f":"IFERROR(VLOOKUP($AY$40&AX235,'4. Resource types'!I:J,2,0),\"\")","v":""}]
[null,null,null,null,null,null,null,null,null,null,null,null,null,null,null,null,195,{"$f":"IFERROR(VLOOKUP($R$40&Q236,'3. Geographical scope'!$E:$F,2,0),\"\")","v":""},null,null,null,null,null,null,null,null,null,"",null,null,null,null,null,null,null,null,null,null,null,null,null,null,null,null,null,null,null,null,null,195,{"$f":"IFERROR(VLOOKUP($AY$40&AX236,'4. Resource types'!I:J,2,0),\"\")","v":""}]
[null,null,null,null,null,null,null,null,null,null,null,null,null,null,null,null,196,{"$f":"IFERROR(VLOOKUP($R$40&Q237,'3. Geographical scope'!$E:$F,2,0),\"\")","v":""},null,null,null,null,null,null,null,null,null,"",null,null,null,null,null,null,null,null,null,null,null,null,null,null,null,null,null,null,null,null,null,196,{"$f":"IFERROR(VLOOKUP($AY$40&AX237,'4. Resource types'!I:J,2,0),\"\")","v":""}]
[null,null,null,null,null,null,null,null,null,null,null,null,null,null,null,null,197,{"$f":"IFERROR(VLOOKUP($R$40&Q238,'3. Geographical scope'!$E:$F,2,0),\"\")","v":""},null,null,null,null,null,null,null,null,null,"",null,null,null,null,null,null,null,null,null,null,null,null,null,null,null,null,null,null,null,null,null,197,{"$f":"IFERROR(VLOOKUP($AY$40&AX238,'4. Resource types'!I:J,2,0),\"\")","v":"UNIDO"}]
[null,null,null,null,null,null,null,null,null,null,null,null,null,null,null,null,198,{"$f":"IFERROR(VLOOKUP($R$40&Q239,'3. Geographical scope'!$E:$F,2,0),\"\")","v":""},null,null,null,null,null,null,null,null,null,"",null,null,null,null,null,null,null,null,null,null,null,null,null,null,null,null,null,null,null,null,null,198,{"$f":"IFERROR(VLOOKUP($AY$40&AX239,'4. Resource types'!I:J,2,0),\"\")","v":""}]
[null,null,null,null,null,null,null,null,null,null,null,null,null,null,null,null,199,{"$f":"IFERROR(VLOOKUP($R$40&Q240,'3. Geographical scope'!$E:$F,2,0),\"\")","v":""},null,null,null,null,null,null,null,null,null,"",null,null,null,null,null,null,null,null,null,null,null,null,null,null,null,null,null,null,null,null,null,199,{"$f":"IFERROR(VLOOKUP($AY$40&AX240,'4. Resource types'!I:J,2,0),\"\")","v":""}]
[null,null,null,null,null,null,null,null,null,null,null,null,null,null,null,null,200,{"$f":"IFERROR(VLOOKUP($R$40&Q241,'3. Geographical scope'!$E:$F,2,0),\"\")","v":""},null,null,null,null,null,null,null,null,null,"",null,null,null,null,null,null,null,null,null,null,null,null,null,null,null,null,null,null,null,null,null,200,{"$f":"IFERROR(VLOOKUP($AY$40&AX241,'4. Resource types'!I:J,2,0),\"\")","v":""}]
[null,null,null,null,null,null,null,null,null,null,null,null,null,null,null,null,201,{"$f":"IFERROR(VLOOKUP($R$40&Q242,'3. Geographical scope'!$E:$F,2,0),\"\")","v":""},null,null,null,null,null,null,null,null,null,"",null,null,null,null,null,null,null,null,null,null,null,null,null,null,null,null,null,null,null,null,null,201,{"$f":"IFERROR(VLOOKUP($AY$40&AX242,'4. Resource types'!I:J,2,0),\"\")","v":"Zimbabwe COVID-19 Support Hub"}]
[null,null,null,null,null,null,null,null,null,null,null,null,null,null,null,null,202,{"$f":"IFERROR(VLOOKUP($R$40&Q243,'3. Geographical scope'!$E:$F,2,0),\"\")","v":""},null,null,null,null,null,null,null,null,null,"",null,null,null,null,null,null,null,null,null,null,null,null,null,null,null,null,null,null,null,null,null,202,{"$f":"IFERROR(VLOOKUP($AY$40&AX243,'4. Resource types'!I:J,2,0),\"\")","v":""}]
[null,null,null,null,null,null,null,null,null,null,null,null,null,null,null,null,203,{"$f":"IFERROR(VLOOKUP($R$40&Q244,'3. Geographical scope'!$E:$F,2,0),\"\")","v":""},null,null,null,null,null,null,null,null,null,"",null,null,null,null,null,null,null,null,null,null,null,null,null,null,null,null,null,null,null,null,null,203,{"$f":"IFERROR(VLOOKUP($AY$40&AX244,'4. Resource types'!I:J,2,0),\"\")","v":"Zimbabwe COVID-19 Support Hub"}]
[null,null,null,null,null,null,null,null,null,null,null,null,null,null,null,null,204,{"$f":"IFERROR(VLOOKUP($R$40&Q245,'3. Geographical scope'!$E:$F,2,0),\"\")","v":""},null,null,null,null,null,null,null,null,null,"",null,null,null,null,null,null,null,null,null,null,null,null,null,null,null,null,null,null,null,null,null,204,{"$f":"IFERROR(VLOOKUP($AY$40&AX245,'4. Resource types'!I:J,2,0),\"\")","v":""}]
[null,null,null,null,null,null,null,null,null,null,null,null,null,null,null,null,205,{"$f":"IFERROR(VLOOKUP($R$40&Q246,'3. Geographical scope'!$E:$F,2,0),\"\")","v":""},null,null,null,null,null,null,null,null,null,"",null,null,null,null,null,null,null,null,null,null,null,null,null,null,null,null,null,null,null,null,null,205,{"$f":"IFERROR(VLOOKUP($AY$40&AX246,'4. Resource types'!I:J,2,0),\"\")","v":"Regional Educational Laboratories (RELs)"}]
[null,null,null,null,null,null,null,null,null,null,null,null,null,null,null,null,206,{"$f":"IFERROR(VLOOKUP($R$40&Q247,'3. Geographical scope'!$E:$F,2,0),\"\")","v":""},null,null,null,null,null,null,null,null,null,"",null,null,null,null,null,null,null,null,null,null,null,null,null,null,null,null,null,null,null,null,null,206,{"$f":"IFERROR(VLOOKUP($AY$40&AX247,'4. Resource types'!I:J,2,0),\"\")","v":""}]
[null,null,null,null,null,null,null,null,null,null,null,null,null,null,null,null,207,{"$f":"IFERROR(VLOOKUP($R$40&Q248,'3. Geographical scope'!$E:$F,2,0),\"\")","v":""},null,null,null,null,null,null,null,null,null,"",null,null,null,null,null,null,null,null,null,null,null,null,null,null,null,null,null,null,null,null,null,207,{"$f":"IFERROR(VLOOKUP($AY$40&AX248,'4. Resource types'!I:J,2,0),\"\")","v":"MAGICapp"}]
[null,null,null,null,null,null,null,null,null,null,null,null,null,null,null,null,208,{"$f":"IFERROR(VLOOKUP($R$40&Q249,'3. Geographical scope'!$E:$F,2,0),\"\")","v":""},null,null,null,null,null,null,null,null,null,"",null,null,null,null,null,null,null,null,null,null,null,null,null,null,null,null,null,null,null,null,null,208,{"$f":"IFERROR(VLOOKUP($AY$40&AX249,'4. Resource types'!I:J,2,0),\"\")","v":""}]
[null,null,null,null,null,null,null,null,null,null,null,null,null,null,null,null,209,{"$f":"IFERROR(VLOOKUP($R$40&Q250,'3. Geographical scope'!$E:$F,2,0),\"\")","v":""},null,null,null,null,null,null,null,null,null,"",null,null,null,null,null,null,null,null,null,null,null,null,null,null,null,null,null,null,null,null,null,209,{"$f":"IFERROR(VLOOKUP($AY$40&AX250,'4. Resource types'!I:J,2,0),\"\")","v":""}]
[null,null,null,null,null,null,null,null,null,null,null,null,null,null,null,null,210,{"$f":"IFERROR(VLOOKUP($R$40&Q251,'3. Geographical scope'!$E:$F,2,0),\"\")","v":""},null,null,null,null,null,null,null,null,null,"",null,null,null,null,null,null,null,null,null,null,null,null,null,null,null,null,null,null,null,null,null,210,{"$f":"IFERROR(VLOOKUP($AY$40&AX251,'4. Resource types'!I:J,2,0),\"\")","v":""}]
[null,null,null,null,null,null,null,null,null,null,null,null,null,null,null,null,211,{"$f":"IFERROR(VLOOKUP($R$40&Q252,'3. Geographical scope'!$E:$F,2,0),\"\")","v":""},null,null,null,null,null,null,null,null,null,"",null,null,null,null,null,null,null,null,null,null,null,null,null,null,null,null,null,null,null,null,null,211,{"$f":"IFERROR(VLOOKUP($AY$40&AX252,'4. Resource types'!I:J,2,0),\"\")","v":""}]
[null,null,null,null,null,null,null,null,null,null,null,null,null,null,null,null,212,{"$f":"IFERROR(VLOOKUP($R$40&Q253,'3. Geographical scope'!$E:$F,2,0),\"\")","v":""},null,null,null,null,null,null,null,null,null,"",null,null,null,null,null,null,null,null,null,null,null,null,null,null,null,null,null,null,null,null,null,212,{"$f":"IFERROR(VLOOKUP($AY$40&AX253,'4. Resource types'!I:J,2,0),\"\")","v":""}]
[null,null,null,null,null,null,null,null,null,null,null,null,null,null,null,null,213,{"$f":"IFERROR(VLOOKUP($R$40&Q254,'3. Geographical scope'!$E:$F,2,0),\"\")","v":""},null,null,null,null,null,null,null,null,null,"",null,null,null,null,null,null,null,null,null,null,null,null,null,null,null,null,null,null,null,null,null,213,{"$f":"IFERROR(VLOOKUP($AY$40&AX254,'4. Resource types'!I:J,2,0),\"\")","v":""}]
[null,null,null,null,null,null,null,null,null,null,null,null,null,null,null,null,214,{"$f":"IFERROR(VLOOKUP($R$40&Q255,'3. Geographical scope'!$E:$F,2,0),\"\")","v":""},null,null,null,null,null,null,null,null,null,"",null,null,null,null,null,null,null,null,null,null,null,null,null,null,null,null,null,null,null,null,null,214,{"$f":"IFERROR(VLOOKUP($AY$40&AX255,'4. Resource types'!I:J,2,0),\"\")","v":""}]
[null,null,null,null,null,null,null,null,null,null,null,null,null,null,null,null,215,{"$f":"IFERROR(VLOOKUP($R$40&Q256,'3. Geographical scope'!$E:$F,2,0),\"\")","v":""},null,null,null,null,null,null,null,null,null,"",null,null,null,null,null,null,null,null,null,null,null,null,null,null,null,null,null,null,null,null,null,215,{"$f":"IFERROR(VLOOKUP($AY$40&AX256,'4. Resource types'!I:J,2,0),\"\")","v":"European Respiratory Society"}]
[null,null,null,null,null,null,null,null,null,null,null,null,null,null,null,null,216,{"$f":"IFERROR(VLOOKUP($R$40&Q257,'3. Geographical scope'!$E:$F,2,0),\"\")","v":""},null,null,null,null,null,null,null,null,null,"",null,null,null,null,null,null,null,null,null,null,null,null,null,null,null,null,null,null,null,null,null,216,{"$f":"IFERROR(VLOOKUP($AY$40&AX257,'4. Resource types'!I:J,2,0),\"\")","v":""}]
[null,null,null,null,null,null,null,null,null,null,null,null,null,null,null,null,217,{"$f":"IFERROR(VLOOKUP($R$40&Q258,'3. Geographical scope'!$E:$F,2,0),\"\")","v":""},null,null,null,null,null,null,null,null,null,"",null,null,null,null,null,null,null,null,null,null,null,null,null,null,null,null,null,null,null,null,null,217,{"$f":"IFERROR(VLOOKUP($AY$40&AX258,'4. Resource types'!I:J,2,0),\"\")","v":""}]
[null,null,null,null,null,null,null,null,null,null,null,null,null,null,null,null,218,{"$f":"IFERROR(VLOOKUP($R$40&Q259,'3. Geographical scope'!$E:$F,2,0),\"\")","v":""},null,null,null,null,null,null,null,null,null,"",null,null,null,null,null,null,null,null,null,null,null,null,null,null,null,null,null,null,null,null,null,218,{"$f":"IFERROR(VLOOKUP($AY$40&AX259,'4. Resource types'!I:J,2,0),\"\")","v":""}]
[null,null,null,null,null,null,null,null,null,null,null,null,null,null,null,null,219,{"$f":"IFERROR(VLOOKUP($R$40&Q260,'3. Geographical scope'!$E:$F,2,0),\"\")","v":""},null,null,null,null,null,null,null,null,null,null,null,null,null,null,null,null,null,null,null,null,null,null,null,null,null,null,null,null,null,null,null,219,{"$f":"IFERROR(VLOOKUP($AY$40&AX260,'4. Resource types'!I:J,2,0),\"\")","v":"Chinese Center for Disease Control and Prevention"}]
[null,null,null,null,null,null,null,null,null,null,null,null,null,null,null,null,220,{"$f":"IFERROR(VLOOKUP($R$40&Q261,'3. Geographical scope'!$E:$F,2,0),\"\")","v":""},null,null,null,null,null,null,null,null,null,null,null,null,null,null,null,null,null,null,null,null,null,null,null,null,null,null,null,null,null,null,null,220,{"$f":"IFERROR(VLOOKUP($AY$40&AX261,'4. Resource types'!I:J,2,0),\"\")","v":"Antimicrobial Stewardship"}]
[null,null,null,null,null,null,null,null,null,null,null,null,null,null,null,null,221,{"$f":"IFERROR(VLOOKUP($R$40&Q262,'3. Geographical scope'!$E:$F,2,0),\"\")","v":""},null,null,null,null,null,null,null,null,null,null,null,null,null,null,null,null,null,null,null,null,null,null,null,null,null,null,null,null,null,null,null,221,{"$f":"IFERROR(VLOOKUP($AY$40&AX262,'4. Resource types'!I:J,2,0),\"\")","v":""}]
[null,null,null,null,null,null,null,null,null,null,null,null,null,null,null,null,222,{"$f":"IFERROR(VLOOKUP($R$40&Q263,'3. Geographical scope'!$E:$F,2,0),\"\")","v":""},null,null,null,null,null,null,null,null,null,null,null,null,null,null,null,null,null,null,null,null,null,null,null,null,null,null,null,null,null,null,null,222,{"$f":"IFERROR(VLOOKUP($AY$40&AX263,'4. Resource types'!I:J,2,0),\"\")","v":""}]
[null,null,null,null,null,null,null,null,null,null,null,null,null,null,null,null,223,{"$f":"IFERROR(VLOOKUP($R$40&Q264,'3. Geographical scope'!$E:$F,2,0),\"\")","v":""},null,null,null,null,null,null,null,null,null,null,null,null,null,null,null,null,null,null,null,null,null,null,null,null,null,null,null,null,null,null,null,223,{"$f":"IFERROR(VLOOKUP($AY$40&AX264,'4. Resource types'!I:J,2,0),\"\")","v":""}]
[null,null,null,null,null,null,null,null,null,null,null,null,null,null,null,null,224,{"$f":"IFERROR(VLOOKUP($R$40&Q265,'3. Geographical scope'!$E:$F,2,0),\"\")","v":""},null,null,null,null,null,null,null,null,null,null,null,null,null,null,null,null,null,null,null,null,null,null,null,null,null,null,null,null,null,null,null,224,{"$f":"IFERROR(VLOOKUP($AY$40&AX265,'4. Resource types'!I:J,2,0),\"\")","v":""}]
[null,null,null,null,null,null,null,null,null,null,null,null,null,null,null,null,225,{"$f":"IFERROR(VLOOKUP($R$40&Q266,'3. Geographical scope'!$E:$F,2,0),\"\")","v":""},null,null,null,null,null,null,null,null,null,null,null,null,null,null,null,null,null,null,null,null,null,null,null,null,null,null,null,null,null,null,null,225,{"$f":"IFERROR(VLOOKUP($AY$40&AX266,'4. Resource types'!I:J,2,0),\"\")","v":""}]
[null,null,null,null,null,null,null,null,null,null,null,null,null,null,null,null,226,{"$f":"IFERROR(VLOOKUP($R$40&Q267,'3. Geographical scope'!$E:$F,2,0),\"\")","v":""},null,null,null,null,null,null,null,null,null,null,null,null,null,null,null,null,null,null,null,null,null,null,null,null,null,null,null,null,null,null,null,226,{"$f":"IFERROR(VLOOKUP($AY$40&AX267,'4. Resource types'!I:J,2,0),\"\")","v":""}]
[null,null,null,null,null,null,null,null,null,null,null,null,null,null,null,null,227,{"$f":"IFERROR(VLOOKUP($R$40&Q268,'3. Geographical scope'!$E:$F,2,0),\"\")","v":""},null,null,null,null,null,null,null,null,null,null,null,null,null,null,null,null,null,null,null,null,null,null,null,null,null,null,null,null,null,null,null,227,{"$f":"IFERROR(VLOOKUP($AY$40&AX268,'4. Resource types'!I:J,2,0),\"\")","v":""}]
[null,null,null,null,null,null,null,null,null,null,null,null,null,null,null,null,228,{"$f":"IFERROR(VLOOKUP($R$40&Q269,'3. Geographical scope'!$E:$F,2,0),\"\")","v":""},null,null,null,null,null,null,null,null,null,null,null,null,null,null,null,null,null,null,null,null,null,null,null,null,null,null,null,null,null,null,null,228,{"$f":"IFERROR(VLOOKUP($AY$40&AX269,'4. Resource types'!I:J,2,0),\"\")","v":""}]
[null,null,null,null,null,null,null,null,null,null,null,null,null,null,null,null,229,{"$f":"IFERROR(VLOOKUP($R$40&Q270,'3. Geographical scope'!$E:$F,2,0),\"\")","v":""},null,null,null,null,null,null,null,null,null,null,null,null,null,null,null,null,null,null,null,null,null,null,null,null,null,null,null,null,null,null,null,229,{"$f":"IFERROR(VLOOKUP($AY$40&AX270,'4. Resource types'!I:J,2,0),\"\")","v":""}]
[null,null,null,null,null,null,null,null,null,null,null,null,null,null,null,null,230,{"$f":"IFERROR(VLOOKUP($R$40&Q271,'3. Geographical scope'!$E:$F,2,0),\"\")","v":""},null,null,null,null,null,null,null,null,null,null,null,null,null,null,null,null,null,null,null,null,null,null,null,null,null,null,null,null,null,null,null,230,{"$f":"IFERROR(VLOOKUP($AY$40&AX271,'4. Resource types'!I:J,2,0),\"\")","v":""}]
[null,null,null,null,null,null,null,null,null,null,null,null,null,null,null,null,231,{"$f":"IFERROR(VLOOKUP($R$40&Q272,'3. Geographical scope'!$E:$F,2,0),\"\")","v":""},null,null,null,null,null,null,null,null,null,null,null,null,null,null,null,null,null,null,null,null,null,null,null,null,null,null,null,null,null,null,null,231,{"$f":"IFERROR(VLOOKUP($AY$40&AX272,'4. Resource types'!I:J,2,0),\"\")","v":""}]
[null,null,null,null,null,null,null,null,null,null,null,null,null,null,null,null,232,{"$f":"IFERROR(VLOOKUP($R$40&Q273,'3. Geographical scope'!$E:$F,2,0),\"\")","v":""},null,null,null,null,null,null,null,null,null,null,null,null,null,null,null,null,null,null,null,null,null,null,null,null,null,null,null,null,null,null,null,232,{"$f":"IFERROR(VLOOKUP($AY$40&AX273,'4. Resource types'!I:J,2,0),\"\")","v":""}]
[null,null,null,null,null,null,null,null,null,null,null,null,null,null,null,null,233,{"$f":"IFERROR(VLOOKUP($R$40&Q274,'3. Geographical scope'!$E:$F,2,0),\"\")","v":""},null,null,null,null,null,null,null,null,null,null,null,null,null,null,null,null,null,null,null,null,null,null,null,null,null,null,null,null,null,null,null,233,{"$f":"IFERROR(VLOOKUP($AY$40&AX274,'4. Resource types'!I:J,2,0),\"\")","v":"CareSearch: Palliative Care Knowledge Network"}]
[null,null,null,null,null,null,null,null,null,null,null,null,null,null,null,null,234,{"$f":"IFERROR(VLOOKUP($R$40&Q275,'3. Geographical scope'!$E:$F,2,0),\"\")","v":""},null,null,null,null,null,null,null,null,null,null,null,null,null,null,null,null,null,null,null,null,null,null,null,null,null,null,null,null,null,null,null,234,{"$f":"IFERROR(VLOOKUP($AY$40&AX275,'4. Resource types'!I:J,2,0),\"\")","v":""}]
[null,null,null,null,null,null,null,null,null,null,null,null,null,null,null,null,235,{"$f":"IFERROR(VLOOKUP($R$40&Q276,'3. Geographical scope'!$E:$F,2,0),\"\")","v":""},null,null,null,null,null,null,null,null,null,null,null,null,null,null,null,null,null,null,null,null,null,null,null,null,null,null,null,null,null,null,null,235,{"$f":"IFERROR(VLOOKUP($AY$40&AX276,'4. Resource types'!I:J,2,0),\"\")","v":""}]
[null,null,null,null,null,null,null,null,null,null,null,null,null,null,null,null,236,{"$f":"IFERROR(VLOOKUP($R$40&Q277,'3. Geographical scope'!$E:$F,2,0),\"\")","v":""},null,null,null,null,null,null,null,null,null,null,null,null,null,null,null,null,null,null,null,null,null,null,null,null,null,null,null,null,null,null,null,236,{"$f":"IFERROR(VLOOKUP($AY$40&AX277,'4. Resource types'!I:J,2,0),\"\")","v":""}]
[null,null,null,null,null,null,null,null,null,null,null,null,null,null,null,null,237,{"$f":"IFERROR(VLOOKUP($R$40&Q278,'3. Geographical scope'!$E:$F,2,0),\"\")","v":""},null,null,null,null,null,null,null,null,null,null,null,null,null,null,null,null,null,null,null,null,null,null,null,null,null,null,null,null,null,null,null,237,{"$f":"IFERROR(VLOOKUP($AY$40&AX278,'4. Resource types'!I:J,2,0),\"\")","v":""}]
[null,null,null,null,null,null,null,null,null,null,null,null,null,null,null,null,238,{"$f":"IFERROR(VLOOKUP($R$40&Q279,'3. Geographical scope'!$E:$F,2,0),\"\")","v":""},null,null,null,null,null,null,null,null,null,null,null,null,null,null,null,null,null,null,null,null,null,null,null,null,null,null,null,null,null,null,null,238,{"$f":"IFERROR(VLOOKUP($AY$40&AX279,'4. Resource types'!I:J,2,0),\"\")","v":"National COVID-19 Living Evidence Task Force"}]
[null,null,null,null,null,null,null,null,null,null,null,null,null,null,null,null,239,{"$f":"IFERROR(VLOOKUP($R$40&Q280,'3. Geographical scope'!$E:$F,2,0),\"\")","v":""},null,null,null,null,null,null,null,null,null,null,null,null,null,null,null,null,null,null,null,null,null,null,null,null,null,null,null,null,null,null,null,239,{"$f":"IFERROR(VLOOKUP($AY$40&AX280,'4. Resource types'!I:J,2,0),\"\")","v":""}]
[null,null,null,null,null,null,null,null,null,null,null,null,null,null,null,null,240,{"$f":"IFERROR(VLOOKUP($R$40&Q281,'3. Geographical scope'!$E:$F,2,0),\"\")","v":""},null,null,null,null,null,null,null,null,null,null,null,null,null,null,null,null,null,null,null,null,null,null,null,null,null,null,null,null,null,null,null,240,{"$f":"IFERROR(VLOOKUP($AY$40&AX281,'4. Resource types'!I:J,2,0),\"\")","v":""}]
[null,null,null,null,null,null,null,null,null,null,null,null,null,null,null,null,241,{"$f":"IFERROR(VLOOKUP($R$40&Q282,'3. Geographical scope'!$E:$F,2,0),\"\")","v":""},null,null,null,null,null,null,null,null,null,null,null,null,null,null,null,null,null,null,null,null,null,null,null,null,null,null,null,null,null,null,null,241,{"$f":"IFERROR(VLOOKUP($AY$40&AX282,'4. Resource types'!I:J,2,0),\"\")","v":""}]
[null,null,null,null,null,null,null,null,null,null,null,null,null,null,null,null,242,{"$f":"IFERROR(VLOOKUP($R$40&Q283,'3. Geographical scope'!$E:$F,2,0),\"\")","v":""},null,null,null,null,null,null,null,null,null,null,null,null,null,null,null,null,null,null,null,null,null,null,null,null,null,null,null,null,null,null,null,242,{"$f":"IFERROR(VLOOKUP($AY$40&AX283,'4. Resource types'!I:J,2,0),\"\")","v":""}]
[null,null,null,null,null,null,null,null,null,null,null,null,null,null,null,null,243,{"$f":"IFERROR(VLOOKUP($R$40&Q284,'3. Geographical scope'!$E:$F,2,0),\"\")","v":""},null,null,null,null,null,null,null,null,null,null,null,null,null,null,null,null,null,null,null,null,null,null,null,null,null,null,null,null,null,null,null,243,{"$f":"IFERROR(VLOOKUP($AY$40&AX284,'4. Resource types'!I:J,2,0),\"\")","v":""}]
[null,null,null,null,null,null,null,null,null,null,null,null,null,null,null,null,244,{"$f":"IFERROR(VLOOKUP($R$40&Q285,'3. Geographical scope'!$E:$F,2,0),\"\")","v":""},null,null,null,null,null,null,null,null,null,null,null,null,null,null,null,null,null,null,null,null,null,null,null,null,null,null,null,null,null,null,null,244,{"$f":"IFERROR(VLOOKUP($AY$40&AX285,'4. Resource types'!I:J,2,0),\"\")","v":""}]
[null,null,null,null,null,null,null,null,null,null,null,null,null,null,null,null,245,{"$f":"IFERROR(VLOOKUP($R$40&Q286,'3. Geographical scope'!$E:$F,2,0),\"\")","v":""},null,null,null,null,null,null,null,null,null,null,null,null,null,null,null,null,null,null,null,null,null,null,null,null,null,null,null,null,null,null,null,245,{"$f":"IFERROR(VLOOKUP($AY$40&AX286,'4. Resource types'!I:J,2,0),\"\")","v":"Africaxiv"}]
[null,null,null,null,null,null,null,null,null,null,null,null,null,null,null,null,246,{"$f":"IFERROR(VLOOKUP($R$40&Q287,'3. Geographical scope'!$E:$F,2,0),\"\")","v":""},null,null,null,null,null,null,null,null,null,null,null,null,null,null,null,null,null,null,null,null,null,null,null,null,null,null,null,null,null,null,null,246,{"$f":"IFERROR(VLOOKUP($AY$40&AX287,'4. Resource types'!I:J,2,0),\"\")","v":""}]
[null,null,null,null,null,null,null,null,null,null,null,null,null,null,null,null,247,{"$f":"IFERROR(VLOOKUP($R$40&Q288,'3. Geographical scope'!$E:$F,2,0),\"\")","v":""},null,null,null,null,null,null,null,null,null,null,null,null,null,null,null,null,null,null,null,null,null,null,null,null,null,null,null,null,null,null,null,247,{"$f":"IFERROR(VLOOKUP($AY$40&AX288,'4. Resource types'!I:J,2,0),\"\")","v":""}]
[null,null,null,null,null,null,null,null,null,null,null,null,null,null,null,null,248,{"$f":"IFERROR(VLOOKUP($R$40&Q289,'3. Geographical scope'!$E:$F,2,0),\"\")","v":""},null,null,null,null,null,null,null,null,null,null,null,null,null,null,null,null,null,null,null,null,null,null,null,null,null,null,null,null,null,null,null,248,{"$f":"IFERROR(VLOOKUP($AY$40&AX289,'4. Resource types'!I:J,2,0),\"\")","v":"Our World In data Policy Responses to the Coronavirus Pandemic"}]
[null,null,null,null,null,null,null,null,null,null,null,null,null,null,null,null,249,{"$f":"IFERROR(VLOOKUP($R$40&Q290,'3. Geographical scope'!$E:$F,2,0),\"\")","v":""},null,null,null,null,null,null,null,null,null,null,null,null,null,null,null,null,null,null,null,null,null,null,null,null,null,null,null,null,null,null,null,249,{"$f":"IFERROR(VLOOKUP($AY$40&AX290,'4. Resource types'!I:J,2,0),\"\")","v":""}]
[null,null,null,null,null,null,null,null,null,null,null,null,null,null,null,null,250,{"$f":"IFERROR(VLOOKUP($R$40&Q291,'3. Geographical scope'!$E:$F,2,0),\"\")","v":""},null,null,null,null,null,null,null,null,null,null,null,null,null,null,null,null,null,null,null,null,null,null,null,null,null,null,null,null,null,null,null,250,{"$f":"IFERROR(VLOOKUP($AY$40&AX291,'4. Resource types'!I:J,2,0),\"\")","v":""}]
[null,null,null,null,null,null,null,null,null,null,null,null,null,null,null,null,251,{"$f":"IFERROR(VLOOKUP($R$40&Q292,'3. Geographical scope'!$E:$F,2,0),\"\")","v":""},null,null,null,null,null,null,null,null,null,null,null,null,null,null,null,null,null,null,null,null,null,null,null,null,null,null,null,null,null,null,null,251,{"$f":"IFERROR(VLOOKUP($AY$40&AX292,'4. Resource types'!I:J,2,0),\"\")","v":""}]
[null,null,null,null,null,null,null,null,null,null,null,null,null,null,null,null,252,{"$f":"IFERROR(VLOOKUP($R$40&Q293,'3. Geographical scope'!$E:$F,2,0),\"\")","v":""},null,null,null,null,null,null,null,null,null,null,null,null,null,null,null,null,null,null,null,null,null,null,null,null,null,null,null,null,null,null,null,252,{"$f":"IFERROR(VLOOKUP($AY$40&AX293,'4. Resource types'!I:J,2,0),\"\")","v":""}]
[null,null,null,null,null,null,null,null,null,null,null,null,null,null,null,null,253,{"$f":"IFERROR(VLOOKUP($R$40&Q294,'3. Geographical scope'!$E:$F,2,0),\"\")","v":""},null,null,null,null,null,null,null,null,null,null,null,null,null,null,null,null,null,null,null,null,null,null,null,null,null,null,null,null,null,null,null,253,{"$f":"IFERROR(VLOOKUP($AY$40&AX294,'4. Resource types'!I:J,2,0),\"\")","v":""}]
[null,null,null,null,null,null,null,null,null,null,null,null,null,null,null,null,254,{"$f":"IFERROR(VLOOKUP($R$40&Q295,'3. Geographical scope'!$E:$F,2,0),\"\")","v":""},null,null,null,null,null,null,null,null,null,null,null,null,null,null,null,null,null,null,null,null,null,null,null,null,null,null,null,null,null,null,null,254,{"$f":"IFERROR(VLOOKUP($AY$40&AX295,'4. Resource types'!I:J,2,0),\"\")","v":""}]
[null,null,null,null,null,null,null,null,null,null,null,null,null,null,null,null,255,{"$f":"IFERROR(VLOOKUP($R$40&Q296,'3. Geographical scope'!$E:$F,2,0),\"\")","v":""},null,null,null,null,null,null,null,null,null,null,null,null,null,null,null,null,null,null,null,null,null,null,null,null,null,null,null,null,null,null,null,255,{"$f":"IFERROR(VLOOKUP($AY$40&AX296,'4. Resource types'!I:J,2,0),\"\")","v":"National Institutes of Health treatment guidelines"}]
[null,null,null,null,null,null,null,null,null,null,null,null,null,null,null,null,null,{"$f":"IFERROR(VLOOKUP($R$40&Q297,'3. Geographical scope'!$E:$F,2,0),\"\")","v":""},null,null,null,null,null,null,null,null,null,null,null,null,null,null,null,null,null,null,null,null,null,null,null,null,null,null,null,null,null,null,null,256,{"$f":"IFERROR(VLOOKUP($AY$40&AX297,'4. Resource types'!I:J,2,0),\"\")","v":""}]
[null,null,null,null,null,null,null,null,null,null,null,null,null,null,null,null,null,{"$f":"IFERROR(VLOOKUP($R$40&Q298,'3. Geographical scope'!$E:$F,2,0),\"\")","v":""},null,null,null,null,null,null,null,null,null,null,null,null,null,null,null,null,null,null,null,null,null,null,null,null,null,null,null,null,null,null,null,257,{"$f":"IFERROR(VLOOKUP($AY$40&AX298,'4. Resource types'!I:J,2,0),\"\")","v":""}]
[null,null,null,null,null,null,null,null,null,null,null,null,null,null,null,null,null,{"$f":"IFERROR(VLOOKUP($R$40&Q299,'3. Geographical scope'!$E:$F,2,0),\"\")","v":""},null,null,null,null,null,null,null,null,null,null,null,null,null,null,null,null,null,null,null,null,null,null,null,null,null,null,null,null,null,null,null,258,{"$f":"IFERROR(VLOOKUP($AY$40&AX299,'4. Resource types'!I:J,2,0),\"\")","v":""}]
[null,null,null,null,null,null,null,null,null,null,null,null,null,null,null,null,null,{"$f":"IFERROR(VLOOKUP($R$40&Q300,'3. Geographical scope'!$E:$F,2,0),\"\")","v":""},null,null,null,null,null,null,null,null,null,null,null,null,null,null,null,null,null,null,null,null,null,null,null,null,null,null,null,null,null,null,null,259,{"$f":"IFERROR(VLOOKUP($AY$40&AX300,'4. Resource types'!I:J,2,0),\"\")","v":""}]
[null,null,null,null,null,null,null,null,null,null,null,null,null,null,null,null,null,{"$f":"IFERROR(VLOOKUP($R$40&Q301,'3. Geographical scope'!$E:$F,2,0),\"\")","v":""},null,null,null,null,null,null,null,null,null,null,null,null,null,null,null,null,null,null,null,null,null,null,null,null,null,null,null,null,null,null,null,260,{"$f":"IFERROR(VLOOKUP($AY$40&AX301,'4. Resource types'!I:J,2,0),\"\")","v":""}]
[null,null,null,null,null,null,null,null,null,null,null,null,null,null,null,null,null,{"$f":"IFERROR(VLOOKUP($R$40&Q302,'3. Geographical scope'!$E:$F,2,0),\"\")","v":""},null,null,null,null,null,null,null,null,null,null,null,null,null,null,null,null,null,null,null,null,null,null,null,null,null,null,null,null,null,null,null,261,{"$f":"IFERROR(VLOOKUP($AY$40&AX302,'4. Resource types'!I:J,2,0),\"\")","v":""}]
[null,null,null,null,null,null,null,null,null,null,null,null,null,null,null,null,null,{"$f":"IFERROR(VLOOKUP($R$40&Q303,'3. Geographical scope'!$E:$F,2,0),\"\")","v":""},null,null,null,null,null,null,null,null,null,null,null,null,null,null,null,null,null,null,null,null,null,null,null,null,null,null,null,null,null,null,null,262,{"$f":"IFERROR(VLOOKUP($AY$40&AX303,'4. Resource types'!I:J,2,0),\"\")","v":""}]
[null,null,null,null,null,null,null,null,null,null,null,null,null,null,null,null,null,{"$f":"IFERROR(VLOOKUP($R$40&Q304,'3. Geographical scope'!$E:$F,2,0),\"\")","v":""},null,null,null,null,null,null,null,null,null,null,null,null,null,null,null,null,null,null,null,null,null,null,null,null,null,null,null,null,null,null,null,263,{"$f":"IFERROR(VLOOKUP($AY$40&AX304,'4. Resource types'!I:J,2,0),\"\")","v":""}]
[null,null,null,null,null,null,null,null,null,null,null,null,null,null,null,null,null,{"$f":"IFERROR(VLOOKUP($R$40&Q305,'3. Geographical scope'!$E:$F,2,0),\"\")","v":""},null,null,null,null,null,null,null,null,null,null,null,null,null,null,null,null,null,null,null,null,null,null,null,null,null,null,null,null,null,null,null,264,{"$f":"IFERROR(VLOOKUP($AY$40&AX305,'4. Resource types'!I:J,2,0),\"\")","v":""}]
[null,null,null,null,null,null,null,null,null,null,null,null,null,null,null,null,null,{"$f":"IFERROR(VLOOKUP($R$40&Q306,'3. Geographical scope'!$E:$F,2,0),\"\")","v":""},null,null,null,null,null,null,null,null,null,null,null,null,null,null,null,null,null,null,null,null,null,null,null,null,null,null,null,null,null,null,null,265,{"$f":"IFERROR(VLOOKUP($AY$40&AX306,'4. Resource types'!I:J,2,0),\"\")","v":""}]
[null,null,null,null,null,null,null,null,null,null,null,null,null,null,null,null,null,{"$f":"IFERROR(VLOOKUP($R$40&Q307,'3. Geographical scope'!$E:$F,2,0),\"\")","v":""},null,null,null,null,null,null,null,null,null,null,null,null,null,null,null,null,null,null,null,null,null,null,null,null,null,null,null,null,null,null,null,266,{"$f":"IFERROR(VLOOKUP($AY$40&AX307,'4. Resource types'!I:J,2,0),\"\")","v":""}]
[null,null,null,null,null,null,null,null,null,null,null,null,null,null,null,null,null,{"$f":"IFERROR(VLOOKUP($R$40&Q308,'3. Geographical scope'!$E:$F,2,0),\"\")","v":""},null,null,null,null,null,null,null,null,null,null,null,null,null,null,null,null,null,null,null,null,null,null,null,null,null,null,null,null,null,null,null,267,{"$f":"IFERROR(VLOOKUP($AY$40&AX308,'4. Resource types'!I:J,2,0),\"\")","v":""}]
[null,null,null,null,null,null,null,null,null,null,null,null,null,null,null,null,null,{"$f":"IFERROR(VLOOKUP($R$40&Q309,'3. Geographical scope'!$E:$F,2,0),\"\")","v":""},null,null,null,null,null,null,null,null,null,null,null,null,null,null,null,null,null,null,null,null,null,null,null,null,null,null,null,null,null,null,null,268,{"$f":"IFERROR(VLOOKUP($AY$40&AX309,'4. Resource types'!I:J,2,0),\"\")","v":""}]
[null,null,null,null,null,null,null,null,null,null,null,null,null,null,null,null,null,{"$f":"IFERROR(VLOOKUP($R$40&Q310,'3. Geographical scope'!$E:$F,2,0),\"\")","v":""},null,null,null,null,null,null,null,null,null,null,null,null,null,null,null,null,null,null,null,null,null,null,null,null,null,null,null,null,null,null,null,269,{"$f":"IFERROR(VLOOKUP($AY$40&AX310,'4. Resource types'!I:J,2,0),\"\")","v":"Health Data Research UK"}]
[null,null,null,null,null,null,null,null,null,null,null,null,null,null,null,null,null,{"$f":"IFERROR(VLOOKUP($R$40&Q311,'3. Geographical scope'!$E:$F,2,0),\"\")","v":""},null,null,null,null,null,null,null,null,null,null,null,null,null,null,null,null,null,null,null,null,null,null,null,null,null,null,null,null,null,null,null,270,{"$f":"IFERROR(VLOOKUP($AY$40&AX311,'4. Resource types'!I:J,2,0),\"\")","v":""}]
[null,null,null,null,null,null,null,null,null,null,null,null,null,null,null,null,null,{"$f":"IFERROR(VLOOKUP($R$40&Q312,'3. Geographical scope'!$E:$F,2,0),\"\")","v":""},null,null,null,null,null,null,null,null,null,null,null,null,null,null,null,null,null,null,null,null,null,null,null,null,null,null,null,null,null,null,null,271,{"$f":"IFERROR(VLOOKUP($AY$40&AX312,'4. Resource types'!I:J,2,0),\"\")","v":""}]
[null,null,null,null,null,null,null,null,null,null,null,null,null,null,null,null,null,{"$f":"IFERROR(VLOOKUP($R$40&Q313,'3. Geographical scope'!$E:$F,2,0),\"\")","v":""},null,null,null,null,null,null,null,null,null,null,null,null,null,null,null,null,null,null,null,null,null,null,null,null,null,null,null,null,null,null,null,272,{"$f":"IFERROR(VLOOKUP($AY$40&AX313,'4. Resource types'!I:J,2,0),\"\")","v":""}]
[null,null,null,null,null,null,null,null,null,null,null,null,null,null,null,null,null,{"$f":"IFERROR(VLOOKUP($R$40&Q314,'3. Geographical scope'!$E:$F,2,0),\"\")","v":""},null,null,null,null,null,null,null,null,null,null,null,null,null,null,null,null,null,null,null,null,null,null,null,null,null,null,null,null,null,null,null,273,{"$f":"IFERROR(VLOOKUP($AY$40&AX314,'4. Resource types'!I:J,2,0),\"\")","v":""}]
[null,null,null,null,null,null,null,null,null,null,null,null,null,null,null,null,null,{"$f":"IFERROR(VLOOKUP($R$40&Q315,'3. Geographical scope'!$E:$F,2,0),\"\")","v":""},null,null,null,null,null,null,null,null,null,null,null,null,null,null,null,null,null,null,null,null,null,null,null,null,null,null,null,null,null,null,null,274,{"$f":"IFERROR(VLOOKUP($AY$40&AX315,'4. Resource types'!I:J,2,0),\"\")","v":""}]
[null,null,null,null,null,null,null,null,null,null,null,null,null,null,null,null,null,{"$f":"IFERROR(VLOOKUP($R$40&Q316,'3. Geographical scope'!$E:$F,2,0),\"\")","v":""},null,null,null,null,null,null,null,null,null,null,null,null,null,null,null,null,null,null,null,null,null,null,null,null,null,null,null,null,null,null,null,275,{"$f":"IFERROR(VLOOKUP($AY$40&AX316,'4. Resource types'!I:J,2,0),\"\")","v":"Global Health Network Covid-19 Research Implementation Hub"}]
[null,null,null,null,null,null,null,null,null,null,null,null,null,null,null,null,null,{"$f":"IFERROR(VLOOKUP($R$40&Q317,'3. Geographical scope'!$E:$F,2,0),\"\")","v":""},null,null,null,null,null,null,null,null,null,null,null,null,null,null,null,null,null,null,null,null,null,null,null,null,null,null,null,null,null,null,null,276,{"$f":"IFERROR(VLOOKUP($AY$40&AX317,'4. Resource types'!I:J,2,0),\"\")","v":""}]
[null,null,null,null,null,null,null,null,null,null,null,null,null,null,null,null,null,{"$f":"IFERROR(VLOOKUP($R$40&Q318,'3. Geographical scope'!$E:$F,2,0),\"\")","v":""},null,null,null,null,null,null,null,null,null,null,null,null,null,null,null,null,null,null,null,null,null,null,null,null,null,null,null,null,null,null,null,277,{"$f":"IFERROR(VLOOKUP($AY$40&AX318,'4. Resource types'!I:J,2,0),\"\")","v":""}]
[null,null,null,null,null,null,null,null,null,null,null,null,null,null,null,null,null,{"$f":"IFERROR(VLOOKUP($R$40&Q319,'3. Geographical scope'!$E:$F,2,0),\"\")","v":""},null,null,null,null,null,null,null,null,null,null,null,null,null,null,null,null,null,null,null,null,null,null,null,null,null,null,null,null,null,null,null,278,{"$f":"IFERROR(VLOOKUP($AY$40&AX319,'4. Resource types'!I:J,2,0),\"\")","v":""}]
[null,null,null,null,null,null,null,null,null,null,null,null,null,null,null,null,null,{"$f":"IFERROR(VLOOKUP($R$40&Q320,'3. Geographical scope'!$E:$F,2,0),\"\")","v":""},null,null,null,null,null,null,null,null,null,null,null,null,null,null,null,null,null,null,null,null,null,null,null,null,null,null,null,null,null,null,null,279,{"$f":"IFERROR(VLOOKUP($AY$40&AX320,'4. Resource types'!I:J,2,0),\"\")","v":""}]
[null,null,null,null,null,null,null,null,null,null,null,null,null,null,null,null,null,{"$f":"IFERROR(VLOOKUP($R$40&Q321,'3. Geographical scope'!$E:$F,2,0),\"\")","v":""},null,null,null,null,null,null,null,null,null,null,null,null,null,null,null,null,null,null,null,null,null,null,null,null,null,null,null,null,null,null,null,280,{"$f":"IFERROR(VLOOKUP($AY$40&AX321,'4. Resource types'!I:J,2,0),\"\")","v":""}]
[null,null,null,null,null,null,null,null,null,null,null,null,null,null,null,null,null,{"$f":"IFERROR(VLOOKUP($R$40&Q322,'3. Geographical scope'!$E:$F,2,0),\"\")","v":""},null,null,null,null,null,null,null,null,null,null,null,null,null,null,null,null,null,null,null,null,null,null,null,null,null,null,null,null,null,null,null,281,{"$f":"IFERROR(VLOOKUP($AY$40&AX322,'4. Resource types'!I:J,2,0),\"\")","v":""}]
[null,null,null,null,null,null,null,null,null,null,null,null,null,null,null,null,null,{"$f":"IFERROR(VLOOKUP($R$40&Q323,'3. Geographical scope'!$E:$F,2,0),\"\")","v":""},null,null,null,null,null,null,null,null,null,null,null,null,null,null,null,null,null,null,null,null,null,null,null,null,null,null,null,null,null,null,null,282,{"$f":"IFERROR(VLOOKUP($AY$40&AX323,'4. Resource types'!I:J,2,0),\"\")","v":""}]
[null,null,null,null,null,null,null,null,null,null,null,null,null,null,null,null,null,{"$f":"IFERROR(VLOOKUP($R$40&Q324,'3. Geographical scope'!$E:$F,2,0),\"\")","v":""},null,null,null,null,null,null,null,null,null,null,null,null,null,null,null,null,null,null,null,null,null,null,null,null,null,null,null,null,null,null,null,283,{"$f":"IFERROR(VLOOKUP($AY$40&AX324,'4. Resource types'!I:J,2,0),\"\")","v":""}]
[null,null,null,null,null,null,null,null,null,null,null,null,null,null,null,null,null,{"$f":"IFERROR(VLOOKUP($R$40&Q325,'3. Geographical scope'!$E:$F,2,0),\"\")","v":""},null,null,null,null,null,null,null,null,null,null,null,null,null,null,null,null,null,null,null,null,null,null,null,null,null,null,null,null,null,null,null,284,{"$f":"IFERROR(VLOOKUP($AY$40&AX325,'4. Resource types'!I:J,2,0),\"\")","v":""}]
[null,null,null,null,null,null,null,null,null,null,null,null,null,null,null,null,null,{"$f":"IFERROR(VLOOKUP($R$40&Q326,'3. Geographical scope'!$E:$F,2,0),\"\")","v":""},null,null,null,null,null,null,null,null,null,null,null,null,null,null,null,null,null,null,null,null,null,null,null,null,null,null,null,null,null,null,null,285,{"$f":"IFERROR(VLOOKUP($AY$40&AX326,'4. Resource types'!I:J,2,0),\"\")","v":"Society of Critical Care Medicine"}]
[null,null,null,null,null,null,null,null,null,null,null,null,null,null,null,null,null,{"$f":"IFERROR(VLOOKUP($R$40&Q327,'3. Geographical scope'!$E:$F,2,0),\"\")","v":""},null,null,null,null,null,null,null,null,null,null,null,null,null,null,null,null,null,null,null,null,null,null,null,null,null,null,null,null,null,null,null,286,{"$f":"IFERROR(VLOOKUP($AY$40&AX327,'4. Resource types'!I:J,2,0),\"\")","v":""}]
[null,null,null,null,null,null,null,null,null,null,null,null,null,null,null,null,null,{"$f":"IFERROR(VLOOKUP($R$40&Q328,'3. Geographical scope'!$E:$F,2,0),\"\")","v":""},null,null,null,null,null,null,null,null,null,null,null,null,null,null,null,null,null,null,null,null,null,null,null,null,null,null,null,null,null,null,null,287,{"$f":"IFERROR(VLOOKUP($AY$40&AX328,'4. Resource types'!I:J,2,0),\"\")","v":"Covid 19 Research Explorer"}]
[null,null,null,null,null,null,null,null,null,null,null,null,null,null,null,null,null,{"$f":"IFERROR(VLOOKUP($R$40&Q329,'3. Geographical scope'!$E:$F,2,0),\"\")","v":""},null,null,null,null,null,null,null,null,null,null,null,null,null,null,null,null,null,null,null,null,null,null,null,null,null,null,null,null,null,null,null,288,{"$f":"IFERROR(VLOOKUP($AY$40&AX329,'4. Resource types'!I:J,2,0),\"\")","v":""}]
[null,null,null,null,null,null,null,null,null,null,null,null,null,null,null,null,null,{"$f":"IFERROR(VLOOKUP($R$40&Q330,'3. Geographical scope'!$E:$F,2,0),\"\")","v":""},null,null,null,null,null,null,null,null,null,null,null,null,null,null,null,null,null,null,null,null,null,null,null,null,null,null,null,null,null,null,null,289,{"$f":"IFERROR(VLOOKUP($AY$40&AX330,'4. Resource types'!I:J,2,0),\"\")","v":""}]
[null,null,null,null,null,null,null,null,null,null,null,null,null,null,null,null,null,{"$f":"IFERROR(VLOOKUP($R$40&Q331,'3. Geographical scope'!$E:$F,2,0),\"\")","v":""},null,null,null,null,null,null,null,null,null,null,null,null,null,null,null,null,null,null,null,null,null,null,null,null,null,null,null,null,null,null,null,290,{"$f":"IFERROR(VLOOKUP($AY$40&AX331,'4. Resource types'!I:J,2,0),\"\")","v":""}]
[null,null,null,null,null,null,null,null,null,null,null,null,null,null,null,null,null,{"$f":"IFERROR(VLOOKUP($R$40&Q332,'3. Geographical scope'!$E:$F,2,0),\"\")","v":""},null,null,null,null,null,null,null,null,null,null,null,null,null,null,null,null,null,null,null,null,null,null,null,null,null,null,null,null,null,null,null,291,{"$f":"IFERROR(VLOOKUP($AY$40&AX332,'4. Resource types'!I:J,2,0),\"\")","v":""}]
[null,null,null,null,null,null,null,null,null,null,null,null,null,null,null,null,null,{"$f":"IFERROR(VLOOKUP($R$40&Q333,'3. Geographical scope'!$E:$F,2,0),\"\")","v":""},null,null,null,null,null,null,null,null,null,null,null,null,null,null,null,null,null,null,null,null,null,null,null,null,null,null,null,null,null,null,null,292,{"$f":"IFERROR(VLOOKUP($AY$40&AX333,'4. Resource types'!I:J,2,0),\"\")","v":""}]
[null,null,null,null,null,null,null,null,null,null,null,null,null,null,null,null,null,{"$f":"IFERROR(VLOOKUP($R$40&Q334,'3. Geographical scope'!$E:$F,2,0),\"\")","v":""},null,null,null,null,null,null,null,null,null,null,null,null,null,null,null,null,null,null,null,null,null,null,null,null,null,null,null,null,null,null,null,293,{"$f":"IFERROR(VLOOKUP($AY$40&AX334,'4. Resource types'!I:J,2,0),\"\")","v":""}]
[null,null,null,null,null,null,null,null,null,null,null,null,null,null,null,null,null,{"$f":"IFERROR(VLOOKUP($R$40&Q335,'3. Geographical scope'!$E:$F,2,0),\"\")","v":""},null,null,null,null,null,null,null,null,null,null,null,null,null,null,null,null,null,null,null,null,null,null,null,null,null,null,null,null,null,null,null,294,{"$f":"IFERROR(VLOOKUP($AY$40&AX335,'4. Resource types'!I:J,2,0),\"\")","v":""}]
[null,null,null,null,null,null,null,null,null,null,null,null,null,null,null,null,null,{"$f":"IFERROR(VLOOKUP($R$40&Q336,'3. Geographical scope'!$E:$F,2,0),\"\")","v":""},null,null,null,null,null,null,null,null,null,null,null,null,null,null,null,null,null,null,null,null,null,null,null,null,null,null,null,null,null,null,null,295,{"$f":"IFERROR(VLOOKUP($AY$40&AX336,'4. Resource types'!I:J,2,0),\"\")","v":"Wiley Covid-19: Novel Coronavirus Outbreak"}]
[null,null,null,null,null,null,null,null,null,null,null,null,null,null,null,null,null,{"$f":"IFERROR(VLOOKUP($R$40&Q337,'3. Geographical scope'!$E:$F,2,0),\"\")","v":""}]
[null,null,null,null,null,null,null,null,null,null,null,null,null,null,null,null,null,{"$f":"IFERROR(VLOOKUP($R$40&Q338,'3. Geographical scope'!$E:$F,2,0),\"\")","v":""}]
[null,null,null,null,null,null,null,null,null,null,null,null,null,null,null,null,null,{"$f":"IFERROR(VLOOKUP($R$40&Q339,'3. Geographical scope'!$E:$F,2,0),\"\")","v":""}]
[null,null,null,null,null,null,null,null,null,null,null,null,null,null,null,null,null,{"$f":"IFERROR(VLOOKUP($R$40&Q340,'3. Geographical scope'!$E:$F,2,0),\"\")","v":""}]
[null,null,null,null,null,null,null,null,null,null,null,null,null,null,null,null,null,{"$f":"IFERROR(VLOOKUP($R$40&Q341,'3. Geographical scope'!$E:$F,2,0),\"\")","v":""}]
[null,null,null,null,null,null,null,null,null,null,null,null,null,null,null,null,null,{"$f":"IFERROR(VLOOKUP($R$40&Q342,'3. Geographical scope'!$E:$F,2,0),\"\")","v":""}]
[null,null,null,null,null,null,null,null,null,null,null,null,null,null,null,null,null,{"$f":"IFERROR(VLOOKUP($R$40&Q343,'3. Geographical scope'!$E:$F,2,0),\"\")","v":""}]
[null,null,null,null,null,null,null,null,null,null,null,null,null,null,null,null,null,{"$f":"IFERROR(VLOOKUP($R$40&Q344,'3. Geographical scope'!$E:$F,2,0),\"\")","v":""}]
[null,null,null,null,null,null,null,null,null,null,null,null,null,null,null,null,null,{"$f":"IFERROR(VLOOKUP($R$40&Q345,'3. Geographical scope'!$E:$F,2,0),\"\")","v":""}]
[null,null,null,null,null,null,null,null,null,null,null,null,null,null,null,null,null,{"$f":"IFERROR(VLOOKUP($R$40&Q346,'3. Geographical scope'!$E:$F,2,0),\"\")","v":""}]
[null,null,null,null,null,null,null,null,null,null,null,null,null,null,null,null,null,{"$f":"IFERROR(VLOOKUP($R$40&Q347,'3. Geographical scope'!$E:$F,2,0),\"\")","v":""}]
[null,null,null,null,null,null,null,null,null,null,null,null,null,null,null,null,null,{"$f":"IFERROR(VLOOKUP($R$40&Q348,'3. Geographical scope'!$E:$F,2,0),\"\")","v":""}]
[null,null,null,null,null,null,null,null,null,null,null,null,null,null,null,null,null,{"$f":"IFERROR(VLOOKUP($R$40&Q349,'3. Geographical scope'!$E:$F,2,0),\"\")","v":""}]

{"sheet":"2. Search results","index":1,"n_rows":88,"n_cols":10,"rows_kept":88,"cut":false,"hidden":false,"merged":[[1,10,87,16],[4,3,5,9],[9,5,9,6],[13,5,13,6],[14,5,14,6],[70,5,70,9],[83,5,83,6],[43,3,45,3],[26,4,26,6],[27,4,27,6],[85,4,85,6],[1,3,1,9],[1,0,87,1],[40,3,40,6],[41,3,41,6],[42,3,42,6],[43,4,43,6],[44,4,44,6],[35,4,35,6],[36,4,36,6],[37,4,37,6],[38,3,38,6],[39,3,39,6],[28,4,28,6],[32,4,32,6],[33,4,33,6],[31,4,31,6],[29,4,29,6],[34,4,34,6],[26,3,27,3],[45,4,45,6],[30,4,30,6],[33,3,37,3],[28,3,32,3]]}
["Johns Hopkins University and Medicine Coronavirus Resource Center",{"$f":"VLOOKUP(A1,'2. Main sheet'!E:F,2,0)","v":"https://coronavirus.jhu.edu/"}]
[null,null,null,{"$f":"HYPERLINK(B1,A1)","v":"Johns Hopkins University and Medicine Coronavirus Resource Center"}]
[]
[null,null,null,"DESCRIPTION"]
[null,null,null,{"$f":"VLOOKUP(A1,'2. Main sheet'!E:G,3,0)","v":"Johns Hopkins experts in global public health, infectious disease, and emergency preparedness have been at the forefront of the international response to COVID-19.\nThis website is a resource to help advance the understanding of the virus, inform the public, and brief policymakers in order to guide a response, improve care, and save lives."}]
[]
[null,null,null,"This is a",{"$f":"VLOOKUP(A1,'2. Main sheet'!E:Z,22,0)","v":"Public"},"institution governed as a",{"$f":"VLOOKUP(A1,'2. Main sheet'!E:X,20,0)","v":"Academic institution"},"with a",{"$f":"VLOOKUP(A1,'2. Main sheet'!E:H,4,0)","v":"Global "},"scope"]
[]
[null,null,null,"CONTACT WITH POLICYMAKERS"]
[null,null,null,"This Hub",{"$f":"+IF(VLOOKUP(A1,'2. Main sheet'!E:T,16,0)=\"Yes\",\"answers\",\"does not answer\")","v":"answers"},"questions from policymakers"]
[]
[null,null,null,"NAVIGATION"]
[null,null,null,"In this website you:",{"$f":"IF(VLOOKUP($A$1,'2. Main sheet'!E:BM,59,0)=\"Yes\",\"can\",\"can't\")","v":"can't"},"search for resources"]
[null,null,null,null,{"$f":"IF(VLOOKUP($A$1,'2. Main sheet'!E:BM,60,0)=\"Yes\",\"can\",\"can't\")","v":"can't"},"filter the resources available"]
[null,null,null,null,{"$f":"IF(VLOOKUP($A$1,'2. Main sheet'!E:BM,61,0)=\"Yes\",\"can\",\"can't\")","v":"can't"},"filter by geographical territory"]
[]
[null,null,null,"This website is in",{"$f":"VLOOKUP(A1,'2. Main sheet'!E:BQ,65,0)","v":"English"}]
[]
[null,null,null,"TOPICS COVERED"]
[null,null,null,"Public-health measures",null,{"$f":"IF(IFERROR(VLOOKUP($A$1&D20,'5. Decisions'!$D:$D,1,0),\"No\")<>\"No\",\"Yes\",\"No\")","v":"Yes"}]
[null,null,null,"Clinical management",null,{"$f":"IF(IFERROR(VLOOKUP($A$1&D21,'5. Decisions'!$D:$D,1,0),\"No\")<>\"No\",\"Yes\",\"No\")","v":"No"}]
[null,null,null,"Health-system arrangements",null,{"$f":"IF(IFERROR(VLOOKUP($A$1&D22,'5. Decisions'!$D:$D,1,0),\"No\")<>\"No\",\"Yes\",\"No\")","v":"No"}]
[null,null,null,"Economic and social responses",null,{"$f":"IF(IFERROR(VLOOKUP($A$1&D23,'5. Decisions'!$D:$D,1,0),\"No\")<>\"No\",\"Yes\",\"No\")","v":"No"}]
[]
[]
[null,null,null,"RESOURCES AVAILABLE (expand)"]
[null,null,null,"Recommendations","Recommendations or guidance that used evidence syntheses",null,null,{"$f":"D27&E27","v":"RecommendationsRecommendations or guidance that used evidence syntheses"},{"$f":"IF(IFERROR(VLOOKUP($A$1&H27,'4. Resource types'!K:K,1,0),\"No\")<>\"No\",\"Yes\",\"No\")","v":"No"}]
[null,null,null,null,"Recommendations or guidance not reporting using evidence syntheses",null,null,"Recommendations or guidance not reporting using evidence syntheses",{"$f":"IF(IFERROR(VLOOKUP($A$1&H28,'4. Resource types'!K:K,1,0),\"No\")<>\"No\",\"Yes\",\"No\")","v":"No"}]
[null,null,null,"Evidence syntheses","Systematic reviews",null,null,"Evidence synthesesSystematic reviews",{"$f":"IF(IFERROR(VLOOKUP($A$1&H29,'4. Resource types'!K:K,1,0),\"No\")<>\"No\",\"Yes\",\"No\")","v":"No"}]
[null,null,null,null,"Evidence maps",null,null,"Evidence maps",{"$f":"IF(IFERROR(VLOOKUP($A$1&H30,'4. Resource types'!K:K,1,0),\"No\")<>\"No\",\"Yes\",\"No\")","v":"No"}]
[null,null,null,null,"Rapid reviews",null,null,"Rapid reviews",{"$f":"IF(IFERROR(VLOOKUP($A$1&H31,'4. Resource types'!K:K,1,0),\"No\")<>\"No\",\"Yes\",\"No\")","v":"No"}]
[null,null,null,null,"Evidence syntheses building on systematic reviews",null,null,"Evidence syntheses building on systematic reviews",{"$f":"IF(IFERROR(VLOOKUP($A$1&H32,'4. Resource types'!K:K,1,0),\"No\")<>\"No\",\"Yes\",\"No\")","v":"No"}]
[null,null,null,null,"Protocols of systematic reviews that are underway",null,null,"Protocols of systematic reviews that are underway",{"$f":"IF(IFERROR(VLOOKUP($A$1&H33,'4. Resource types'!K:K,1,0),\"No\")<>\"No\",\"Yes\",\"No\")","v":"No"}]
[null,null,null,"Single studies","Clinical trials",null,null,"Single studiesClinical trials",{"$f":"IF(IFERROR(VLOOKUP($A$1&H34,'4. Resource types'!K:K,1,0),\"No\")<>\"No\",\"Yes\",\"No\")","v":"No"}]
[null,null,null,null,"Searchable databases of single studies and often systematic reviews as well",null,null,"Searchable databases of single studies and often systematic reviews as well",{"$f":"IF(IFERROR(VLOOKUP($A$1&H35,'4. Resource types'!K:K,1,0),\"No\")<>\"No\",\"Yes\",\"No\")","v":"No"}]
[null,null,null,null,"Other primary research studies",null,null,"Other primary research studies",{"$f":"IF(IFERROR(VLOOKUP($A$1&H36,'4. Resource types'!K:K,1,0),\"No\")<>\"No\",\"Yes\",\"No\")","v":"No"}]
[null,null,null,null,"Pre-print services",null,null,"Pre-print services",{"$f":"IF(IFERROR(VLOOKUP($A$1&H37,'4. Resource types'!K:K,1,0),\"No\")<>\"No\",\"Yes\",\"No\")","v":"No"}]
[null,null,null,null,"Protocols of single studies that are underway",null,null,"Protocols of single studies that are underway",{"$f":"IF(IFERROR(VLOOKUP($A$1&H38,'4. Resource types'!K:K,1,0),\"No\")<>\"No\",\"Yes\",\"No\")","v":"No"}]
[null,null,null,"Analyses of primary data",null,null,null,{"$f":"D39&\"N/A\"","v":"Analyses of primary dataN/A"},{"$f":"IF(IFERROR(VLOOKUP($A$1&H39,'4. Resource types'!K:K,1,0),\"No\")<>\"No\",\"Yes\",\"No\")","v":"Yes"}]
[null,null,null,"Government responses",null,null,null,{"$f":"D40&\"N/A\"","v":"Government responsesN/A"},{"$f":"IF(IFERROR(VLOOKUP($A$1&H40,'4. Resource types'!K:K,1,0),\"No\")<>\"No\",\"Yes\",\"No\")","v":"No"}]
[null,null,null,"Expert opinions",null,null,null,"Expert opinionsN/A",{"$f":"IF(IFERROR(VLOOKUP($A$1&H41,'4. Resource types'!K:K,1,0),\"No\")<>\"No\",\"Yes\",\"No\")","v":"Yes"}]
[null,null,null,"Training resources and events",null,null,null,"Training resources and eventsN/A",{"$f":"IF(IFERROR(VLOOKUP($A$1&H42,'4. Resource types'!K:K,1,0),\"No\")<>\"No\",\"Yes\",\"No\")","v":"Yes"}]
[null,null,null,"Funding opportunities",null,null,null,"Funding opportunitiesN/A",{"$f":"IF(IFERROR(VLOOKUP($A$1&H43,'4. Resource types'!K:K,1,0),\"No\")<>\"No\",\"Yes\",\"No\")","v":"No"}]
[null,null,null,"Others","Research methods",null,null,{"$f":"D44&E44","v":"OthersResearch methods"},{"$f":"IF(IFERROR(VLOOKUP($A$1&H44,'4. Resource types'!K:K,1,0),\"No\")<>\"No\",\"Yes\",\"No\")","v":"No"}]
[null,null,null,null,"Books or handbooks",null,null,{"$f":"D45&E45","v":"Books or handbooks"},{"$f":"IF(IFERROR(VLOOKUP($A$1&H45,'4. Resource types'!K:K,1,0),\"No\")<>\"No\",\"Yes\",\"No\")","v":"No"}]
[null,null,null,null,"Other",null,null,{"$f":"D46&E46","v":"Other"},{"$f":"IF(IFERROR(VLOOKUP($A$1&H46,'4. Resource types'!K:K,1,0),\"No\")<>\"No\",\"Yes\",\"No\")","v":"No"}]
[]
[null,null,null,"SECTORS (expand)"]
[null,null,null,"Children and youth services",null,{"$f":"IF(IFERROR(VLOOKUP($A$1&D49,'6. Sector'!G:G,1,0),\"No\")<>\"No\",\"Yes\",\"No\")","v":"No"}]
[null,null,null,"Climate action",null,{"$f":"IF(IFERROR(VLOOKUP($A$1&D50,'6. Sector'!G:G,1,0),\"No\")<>\"No\",\"Yes\",\"No\")","v":"No"}]
[null,null,null,"Community and social services",null,{"$f":"IF(IFERROR(VLOOKUP($A$1&D51,'6. Sector'!G:G,1,0),\"No\")<>\"No\",\"Yes\",\"No\")","v":"No"}]
[null,null,null,"Consumer protection",null,{"$f":"IF(IFERROR(VLOOKUP($A$1&D52,'6. Sector'!G:G,1,0),\"No\")<>\"No\",\"Yes\",\"No\")","v":"No"}]
[null,null,null,"Culture and gender",null,{"$f":"IF(IFERROR(VLOOKUP($A$1&D53,'6. Sector'!G:G,1,0),\"No\")<>\"No\",\"Yes\",\"No\")","v":"No"}]
[null,null,null,"Economic development and growth",null,{"$f":"IF(IFERROR(VLOOKUP($A$1&D54,'6. Sector'!G:G,1,0),\"No\")<>\"No\",\"Yes\",\"No\")","v":"No"}]
[null,null,null,"Education",null,{"$f":"IF(IFERROR(VLOOKUP($A$1&D55,'6. Sector'!G:G,1,0),\"No\")<>\"No\",\"Yes\",\"No\")","v":"No"}]
[null,null,null,"Employment",null,{"$f":"IF(IFERROR(VLOOKUP($A$1&D56,'6. Sector'!G:G,1,0),\"No\")<>\"No\",\"Yes\",\"No\")","v":"No"}]
[null,null,null,"Energy supply",null,{"$f":"IF(IFERROR(VLOOKUP($A$1&D57,'6. Sector'!G:G,1,0),\"No\")<>\"No\",\"Yes\",\"No\")","v":"No"}]
[null,null,null,"Environmental conservation",null,{"$f":"IF(IFERROR(VLOOKUP($A$1&D58,'6. Sector'!G:G,1,0),\"No\")<>\"No\",\"Yes\",\"No\")","v":"No"}]
[null,null,null,"Financial protection",null,{"$f":"IF(IFERROR(VLOOKUP($A$1&D59,'6. Sector'!G:G,1,0),\"No\")<>\"No\",\"Yes\",\"No\")","v":"No"}]
[null,null,null,"Food safety and security",null,{"$f":"IF(IFERROR(VLOOKUP($A$1&D60,'6. Sector'!G:G,1,0),\"No\")<>\"No\",\"Yes\",\"No\")","v":"No"}]
[null,null,null,"Government services",null,{"$f":"IF(IFERROR(VLOOKUP($A$1&D61,'6. Sector'!G:G,1,0),\"No\")<>\"No\",\"Yes\",\"No\")","v":"No"}]
[null,null,null,"Health",null,{"$f":"IF(IFERROR(VLOOKUP($A$1&D62,'6. Sector'!G:G,1,0),\"No\")<>\"No\",\"Yes\",\"No\")","v":"Yes"}]
[null,null,null,"Housing",null,{"$f":"IF(IFERROR(VLOOKUP($A$1&D63,'6. Sector'!G:G,1,0),\"No\")<>\"No\",\"Yes\",\"No\")","v":"No"}]
[null,null,null,"Infrastructure",null,{"$f":"IF(IFERROR(VLOOKUP($A$1&D64,'6. Sector'!G:G,1,0),\"No\")<>\"No\",\"Yes\",\"No\")","v":"No"}]
[null,null,null,"Natural resources",null,{"$f":"IF(IFERROR(VLOOKUP($A$1&D65,'6. Sector'!G:G,1,0),\"No\")<>\"No\",\"Yes\",\"No\")","v":"No"}]
[null,null,null,"Public safety and justice",null,{"$f":"IF(IFERROR(VLOOKUP($A$1&D66,'6. Sector'!G:G,1,0),\"No\")<>\"No\",\"Yes\",\"No\")","v":"No"}]
[null,null,null,"Recreation",null,{"$f":"IF(IFERROR(VLOOKUP($A$1&D67,'6. Sector'!G:G,1,0),\"No\")<>\"No\",\"Yes\",\"No\")","v":"No"}]
[null,null,null,"Transportation",null,{"$f":"IF(IFERROR(VLOOKUP($A$1&D68,'6. Sector'!G:G,1,0),\"No\")<>\"No\",\"Yes\",\"No\")","v":"No"}]
[]
[null,null,null,"UPDATING INFORMATION"]
[null,null,null,"In",{"$f":"VLOOKUP(A1,'2. Main sheet'!$E:$BO,63,0)","v":"27/05/2020"},"we checked the information available in this Hub,and it was updated"]
[null,null,null,null,"as per",{"$f":"VLOOKUP(A1,'2. Main sheet'!$E:$BO,62,0)","v":"Unclear"}]
[]
[null,null,null,"ABOUT THE RESOURCES AVAILABLE"]
[null,null,null,"Language(s) of the resources"]
[null,null,null,"English"]
[null,null,null,"French"]
[]
[null,null,null,"Formats available"]
[null,null,null,"Documents"]
[null,null,null,"Video"]
[null,null,null,"Audio (podcasts)"]
[]
[null,null,null,"The","%","of the resources are open-access"]
[]
[null,null,null,null,{"$f":"IF(VLOOKUP(A1,'2. Main sheet'!E:CD,78,0)=\"Yes\",\"The website has newsletters/bulletin to subscribe\",\"The website does not have newsletters/bulletin to subscribe\")","v":"The website has newsletters/bulletin to subscribe"}]
[]
[null,null,null,"Total number of resources available",null,30]

{"sheet":"2. Main sheet","index":2,"n_rows":216,"n_cols":85,"rows_kept":216,"cut":false,"hidden":true,"merged":[[0,8,0,13],[0,14,0,17],[0,73,0,79],[0,53,0,61],[0,50,0,52]]}
[null,null,null,null,1.1000000000000001,1.2,1.3,1.4,"1.5 Geographical classification",null,null,null,null,null,"1.6 Income classification",null,null,null,2.1,2.2000000000000002,2.2999999999999998,2.4,2.5,3.1,"3.1.1.",3.2,"4.1.1","4.1.2","4.2.1","4.2.2","4.2.3","4.2.4","4.2.5","4.3.1","4.3.2","4.3.3","4.3.4","4.3.5","4. Resources available: Recommendations or guidance , evidence synthesis and single studies",4.4000000000000004,4.5,4.5999999999999996,4.7,4.8,4.9000000000000004,4.0999999999999996,4.1100000000000003,4.12,6.1,6.2,"6.3 Measuring the likely impact of the pandemic",null,null,"6.4 Options to manage the spread of the pandemic",null,null,null,null,null,null,null,null,7.1,7.2,7.3,7.4,7.5,7.6,7.7,7.8,7.9,7.1,7.11,"7.12 Format in which the resources are presented",null,null,null,null,null,null,7.13,7.14,7.15,7.16]
[null,"Person extracting",null,null,"Name of hub","Hub URL","Short description of the Hub","Geographical scope of the Hub","AFRO","EMRO","EURO","PAHO","SEARO","WPRO","Low-income","Lower-middle-income","Upper-middle-income","High-income","COVID-19 Knowledge Hub?","Scope (public policymaking?)","Category","Include/Exclude","Reason for exclude","Governance","Other specify","Type","Recommendations or guidance that used evidence syntheses","Recommendations or guidance not reporting using evidence syntheses","Systematic reviews","Evidence maps","Rapid reviews","Evidence syntheses building on systematic reviews","Protocols of systematic reviews that are underway","Clinical trials","Searchable databases of single studies and often systematic reviews as well","Other primary research studies","Pre-print services","Protocols of single studies that are underway",null,"Analyses of primary data","Expert opinions","Training resources and events","Government responses","Funding opportunities","Research methods","Books or handbooks","Research projects _ output not clear at the moment","Other (specify)","Measuring the evolvement and spread of the pandemic","General characteristics of the virus","Health outcomes","Social outcomes","Economic outcomes","Vaccine development","Social distancing","Social isolation and lockdowns\n","Travel advice","Closure of non-essential businesses","Individual measures (e.g., hygiene, wearing face-masks)","Tracking cases and contacts","Early diagnosis and testing","Clinical management","Search function","Filters","Geographic filters","Last update","Date checked","Total number of resources available","Language(s) of the website","Language of the resources available","Sectors","Non-health sector","Response mechanism for policymakers","Text (html)","Text (document)","Video","Audio (podcast)","Visualisation","External links","Other(speficy)","Open access","Newsletter/bulletins available","Time stamp","Quality","Time taken"]
["28/05/2020","Andile",{"$f":"IFERROR(RANK(D3,D:D,1),\"\")","v":""},{"$f":"IFERROR(FINDB('1. Searching Hubs'!$E$14, E3)+ROW()/100000,\"\")","v":""},"(USA) White House Call to Action to the Tech Community on New Machine Readable COVID-19 Dataset","https://www.coronavirus.gov/","The United States of America`s information portal and news updates for coronavirus diseas related issues.","National","No","No","No","Yes","No","No","No","No","No","Yes","Yes","Yes","First category (at least one: having documents, epi info, or government responses)","Include","N/A","Governments and public institutions","N/A","Public","No","Yes",0,0,0,0,0,0,0,0,0,0,0,"No","No","No","Yes","No","No","No",0,"N/A","No","No","No","No","No",0,0,0,0,0,0,0,0,0,"No","No","No","Unclear","28/05/2020","Unclear","English","English",0,"No","No","No","Yes","Yes","No","No","External links_Other hubs","N/A","Yes","No","Last update of the document","No"]
[null,"Nkuli","",{"$f":"IFERROR(SEARCH('1. Searching Hubs'!$E$14, E4)+ROW()/100000,\"\")","v":""},"Africa Evidence Network Hub","https://www.africaevidencenetwork.org/en/eidm-during-covid-19","As champions in advocating for the use of evidence in decision-making, the COVID-19 pandemic presents each AEN member with an opportunity to advocate for evidence-use during these trying times. The AEN has therefore created a special page to support this cause.\n \n The AEN will curate new evidence, examples of evidence-use, and experiences of evidence-use on the African continent during COVID-19 to share with our and your networks throughout the region.\n \n Examples of the kind of content we imagine hosting, among other types, include:\n \n Rapid reviews for best-practices relevant to certain sectors;\n Participating in multisectoral task forces to address a key concern;\n Responding to demand-led syntheses of best available information to advise decision-making;\n Providing creative ways to address critical challenges in EIDM at this time; and\n Guidelines that have considered as far as possible the best available evidence\n News media highlights on EIDM during COVID in various African countries\n Blogs by AEN members on key \"EIDM during COVID\" topics","Regional","Yes","No","No","No","No","No","Yes","Yes","Yes","No","Yes","Yes","First category (at least one: having documents, epi info, or government responses)","Include","N/A","NGO","N/A","Public","Yes","Yes","Yes","No","Yes","Yes","No","No","No","No","No","No",0,"No","Yes","No","Yes","No","No","No",0,"N/A","No","No","Yes","Yes","Yes","No","Yes","Yes","Yes","No","Yes","No","No","No","No","No","No","Unclear","26/05/2020","13: 4 rapid responses, 2 media briefing, 1 poster, 5 guides, 1 report","English, French","English","Economic development and growth","Yes","No","No","Yes","Yes","No","No","External links_Resource","N/A","Yes","No","Date of publication","No"]
["2020-09-06","Nkuli","",{"$f":"IFERROR(SEARCH('1. Searching Hubs'!$E$14, E5)+ROW()/100000,\"\")","v":""},"African Policy Monitor","https://covid19africawatch.org/african-policy-monitor/","COVID-19 Africa Watch is tracking a variety of policy developments across Africa. The hub extensively tracks country-specific fiscla and monetary responses, emergency declarations, social distang and school closure policies.","Regional","Yes","No","No","No","No","No","Yes","Yes","Yes","No","Yes","Yes","First category (at least one: having documents, epi info, or government responses)","Include","N/A","NGO","N/A","Public",0,0,0,0,0,0,0,0,0,0,0,0,0,"No","No","No","Yes","No","No","No","No","N/A","No","No","Yes","Yes","Yes",0,0,0,0,0,0,0,0,0,"N/A","Yes","N/A","14/05/2020","2020-09-06","Unclear","English","English",0,"Yes","No","No","Yes","No","No","No","External links_Resource","N/A","Yes","No","None of them","No","50 mins"]
["2020-08-06","Irvine","",{"$f":"IFERROR(SEARCH('1. Searching Hubs'!$E$14, E6)+ROW()/100000,\"\")","v":""},"Africaxiv","https://info.africarxiv.org/covid-19/ ","Resources, ideas, and guidelines around the COVID-19 pandemic in Africa Thousands of individuals and hundreds of grassroots and international organisations, CBOs, NPOs, governmental and industrial are working hard to mitigate the effects of the pandemic on the African continent. We are not trying to replicate other organisations’ efforts, instead:\n\n","Regional","Yes","Yes","Yes","Yes","Yes","Yes","Yes","Yes","Yes","Yes","Yes","Yes","Second category (at least two: having expert opinions or others)","Include","N/A","International Organization","N/A","Public",0,0,0,0,0,0,0,0,0,0,0,0,0,"Yes","Yes","Yes","Yes","No","Yes","Yes","No","N/A","Yes","Yes","Yes","Yes","Yes",0,0,0,0,0,0,0,0,0,"Yes","Yes","Yes","Unclear","2020-08-06","Unclear","English","English",0,"No","No","Yes","Yes","Yes","Yes","Yes","External links_Resource","N/A","Yes","No","Last update of the document","No"]
["2020-03-06","Irvine","",{"$f":"IFERROR(SEARCH('1. Searching Hubs'!$E$14, E7)+ROW()/100000,\"\")","v":""},"American Chemistry Society","https://pubs.acs.org/page/vi/chemistry_coronavirus_research#","n light of the current outbreak of a novel coronavirus (2019–nCoV), ACS Publications would like to share this Virtual Issue that features a collection of articles on coronavirus research. Chemistry has a key role to play in understanding everything from viral structure to pathogenesis, isolation of vaccines and therapies, as well as in the development of materials and techniques used by basic researchers, virologists and clinicians. This Virtual Issue aims to provide a brief overview of the important contributions of chemistry to understanding and controlling the spread of coronaviruses and includes articles from ACS Publications and the preprint server ChemRxiv. We hope the research contained in this Virtual Issue will provide you with","No geographical scope","N/A","N/A","N/A","N/A","N/A","N/A","N/A","N/A","N/A","N/A","Yes","Yes","First category (at least one: having documents, epi info, or government responses)","Include","N/A","NGO","Journal","Public",0,0,0,0,0,0,0,0,0,0,0,0,0,"Yes","Yes","No","No","No","No","Yes",0,"N/A","No","Yes","Yes","No","No",0,0,0,0,0,0,0,0,0,"Yes","N/A","N/A","Unclear","2020-03-06","Unclear","English","English",0,"No","No","Yes","Yes","No","No","No","External links_Resource","N/A","Yes","No","Date of publication","No"]
["2020-03-06","Irvine","",{"$f":"IFERROR(SEARCH('1. Searching Hubs'!$E$14, E8)+ROW()/100000,\"\")","v":""},"American College of Cardiology","https://www.acc.org/latest-in-cardiology/features/accs-coronavirus-disease-2019-covid-19-hub#sort=%40fcommonsortdate90022%20descending","The ACC is working to provide COVID-19 clinical guidance for the global cardiovascular care team. The content in this Hub has been reviewed and approved by ACC's Science and Quality Committee. Learn more about the hub and article methodology.","Global ","Yes","Yes","Yes","Yes","Yes","No","Yes","Yes","Yes","Yes","Yes","Yes","First category (at least one: having documents, epi info, or government responses)","Include","N/A","NGO","N/A","Public",0,0,0,0,0,0,0,0,0,0,0,0,0,"Yes","Yes","No","Yes","No","No","Yes","No","N/A","Yes","Yes","Yes","Yes","Yes",0,0,0,0,0,0,0,0,0,"Yes","Yes","No","Unclear","2020-03-06","Unclear","English","English",0,"No","No","Yes","Yes","Yes","Yes","Yes","External links_Resource","N/A","Yes","No","Date of publication","Yes"]
["2020-04-06","Andile","",{"$f":"IFERROR(SEARCH('1. Searching Hubs'!$E$14, E9)+ROW()/100000,\"\")","v":""},"American Psychological Association: Education","https://www.apa.org/topics/covid-19","Information hub on telepsychology, telework, distance learning, self-care, parenting and caregiving, isolation, trauma, and stress related to the COVID-19 pandemic","National","No","No","No","Yes","No","No","No","No","No","Yes","Yes","Yes","First category (at least one: having documents, epi info, or government responses)","Include","N/A","Other","Scientific and proffessional organisation","Private not for profit",0,0,0,0,0,0,0,0,0,0,0,0,0,"No","No","Yes","No","No","No","No","No","N/A","No","No","Yes","No","No",0,0,0,0,0,0,0,0,0,"No","No","No","Unclear","2020-04-06","Unclear","English","English",0,"No","No","Yes","Yes","Yes","Yes","No","External links_Other hubs","N/A","Yes","No","Date of publication","No"]
[null,"Irvine","",{"$f":"IFERROR(SEARCH('1. Searching Hubs'!$E$14, E10)+ROW()/100000,\"\")","v":""},"American Society of Microbiology","https://asm.org/Press-Releases/2020/COVID-19-Resources","This registry includes top-ranked, COVID-19 research articles curated by experts and serves as a resource for scientists working to accelerate scientific research on SARS-CoV-2.","No geographical scope","N/A","N/A","N/A","N/A","N/A","N/A","N/A","N/A","N/A","N/A","Yes","Yes","Second category (at least two: having expert opinions or others)","Include","N/A","NGO","N/A","Private not for profit",0,0,0,0,0,0,0,0,0,0,0,0,0,"Yes","Yes","Yes","No","Yes","Yes","Yes","No","N/A","Yes","Yes","Yes","No","No",0,0,0,0,0,0,0,0,0,"Yes","Yes","No","Unclear","2020-04-06","Unclear","English","English",0,"No","No","Yes","Yes","Yes","Yes","Yes","External links_Other hubs","N/A","Yes","Yes","Date of publication","No"]
["2020-05-06","Promise","",{"$f":"IFERROR(SEARCH('1. Searching Hubs'!$E$14, E11)+ROW()/100000,\"\")","v":""},"Annals of Internal Medicine","https://annals.org/aim/pages/coronavirus-content","A collection of Annals of Internal Medicine articles related to coronavirus","No geographical scope","N/A","N/A","N/A","N/A","N/A","N/A","N/A","N/A","N/A","N/A","Yes","Yes","First category (at least one: having documents, epi info, or government responses)","Include","N/A","NGO","N/A","Public",0,0,0,0,0,0,0,0,0,0,0,0,0,"No","Yes","No","No","No","Yes","No","No","N/A","No","No","Yes","No","No",0,0,0,0,0,0,0,0,0,"No","Yes","No","Unclear","2020-05-06","105 articles","English","English",0,"No","No","No","Yes","No","No","No","No","N/A","Yes","No","Last update of the document","No","50 mins"]
["2020-05-07","Irvine","",{"$f":"IFERROR(SEARCH('1. Searching Hubs'!$E$14, E12)+ROW()/100000,\"\")","v":""},"Antimicrobial Stewardship","https://www.antimicrobialstewardship.com/covid-19","COVID-19 (SARS-CoV-2)\nCurrent clinical management and drug information","No geographical scope","N/A","N/A","N/A","N/A","N/A","N/A","N/A","N/A","N/A","N/A","Yes","Yes","Second category (at least two: having expert opinions or others)","Include","N/A","NGO","N/A","Public",0,0,0,0,0,0,0,0,0,0,0,0,0,"No","Yes","No","No","No","No","Yes","No","N/A","No","Yes","Yes","No","No",0,0,0,0,0,0,0,0,0,"Yes","No","No","Unclear","2020-05-06","6 Guideline documents","English","English",0,"No","No","Yes","Yes","No","No","No","No","N/A","Yes","No","Last update of the document","No","45 mins"]
["2020-04-06","Promise","",{"$f":"IFERROR(SEARCH('1. Searching Hubs'!$E$14, E13)+ROW()/100000,\"\")","v":""},"Asian Development Bank","https://data.adb.org/dataset/adb-covid-19-policy-database","A policy database that provides information on the key economic measures that governments are taking to combat the COVID-19 pandemic. Measures are classified according to how they work their way through the financial system, and how they affect the financial positions of different sectors of society. It also tracks noneconomic measures.","Global ","Yes","Yes","Yes","Yes","Yes","Yes","Yes","Yes","Yes","Yes","Yes","Yes","First category (at least one: having documents, epi info, or government responses)","Include","N/A","Other","Financial institution","Public",0,0,0,0,0,0,0,0,0,0,0,0,0,"No","No","No","Yes","No","No","No","No","N/A","Yes","No","No","No","No",0,0,0,0,0,0,0,0,0,"N/A","Yes","Yes",43985,"2020-04-06","1 policy measures platform, 1 data extraction platform and 1 case tracking platform","English","English",0,"Yes","No","Yes","Yes","No","No","No","No","N/A","Yes","No","Last update of the document","No","20 mins"]
["27/05/2020","Promise","",{"$f":"IFERROR(SEARCH('1. Searching Hubs'!$E$14, E14)+ROW()/100000,\"\")","v":""},"AU","https://au.int/en/covid19","An African centred that tracks continental  cases and deaths, provides updates in the form of briefs, platform for frequently answered questions, joint strategy, guidelines and policies as well as scientific and public health updates.","Regional","Yes","Yes","No","No","No","No","Yes","Yes","Yes","No","Yes","Yes","First category (at least one: having documents, epi info, or government responses)","Include","N/A","Other","Continental union","Public","No","No",0,0,0,0,0,0,0,0,0,0,0,"No","No","Yes","No","No","No","No",0,"N/A","Yes","No","No","No","No",0,0,0,0,0,0,0,0,0,"No","No","No","Unclear","27/05/2020","1 Case map, 14 briefs, 1 joint strategy document, 3 guidelines and policy documents, 1 scientifc and public updates documents","English","English",0,"No","No","No","Yes","Yes","No","Yes","No","N/A","Yes","Yes","None of them","No","65 mins"]
["2020-09-06","Andile","",{"$f":"IFERROR(SEARCH('1. Searching Hubs'!$E$14, E15)+ROW()/100000,\"\")","v":""},"BioRxiv & MedRxiv","https://connect.medrxiv.org/relate/content/181","MedRxiv is receiving many new papers on coronavirus SARS-CoV-2.  These are preliminary reports that have not been peer-reviewed. They should not be regarded as conclusive, guide clinical practice/health-related behavior, or be reported in news media as established information.","No geographical scope","N/A","N/A","N/A","N/A","N/A","N/A","N/A","N/A","N/A","N/A","Yes","Yes","First category (at least one: having documents, epi info, or government responses)","Include","N/A","Other","Preprint Server ","Private not for profit",0,0,0,0,0,0,0,0,0,0,0,0,0,"No","No","No","No","No","No","No","No","N/A","No","No","No","No","No",0,0,0,0,0,0,0,0,0,"No","No","No","Unclear","2020-09-06","4 895 Articles","English","English",0,"No","No","No","Yes","No","No","No","No","N/A","Yes","No","Date of publication","No"]
["2020-08-06","Nkuli","",{"$f":"IFERROR(SEARCH('1. Searching Hubs'!$E$14, E16)+ROW()/100000,\"\")","v":""},"Brennan Center for Justice","https://www.brennancenter.org/our-work/research-reports/courts-responses-covid-19-crisis","The Brennan Center is compiling the formal policy responses of federal courts, immigration courts, and state courts to the Covid-19 public health crisis.\n\nThus far, courts’ responses vary substantially across jurisdictions, with policies ranging from carrying on business as usual to closing courthouses entirely and suspending in-person proceedings indefinitely. Even within the same jurisdiction, different courthouses and judges often have wide discretion to determine which hearings must take place in person and which court personnel must come to work.\n\nCourts are quickly adopting new policies and we will seek to update this page regularly.","National","No","No","No","Yes","No","No","No","No","No","Yes","Yes","Yes","First category (at least one: having documents, epi info, or government responses)","Include","N/A","NGO","N/A","Public",0,0,0,0,0,0,0,0,0,0,0,0,0,"No","No","No","Yes","No","No","No","No","N/A","No","No","No","No","No",0,0,0,0,0,0,0,0,0,"No","No","No","28/05/2020","2020-08-06","7 external links, 2 sheets of court responses","English","English",0,"Yes","No","Yes","No","No","No","No","External links_Resource","N/A","No","Yes","None of them","No","34 mins"]
["2020-05-06","Nkuli","",{"$f":"IFERROR(SEARCH('1. Searching Hubs'!$E$14, E17)+ROW()/100000,\"\")","v":""},"Call for Action: COVID-19 Data Collaboratives","https://docs.google.com/document/d/1JWeD1AaIGKMPry_EN8GjIqwX4J4KLQIAqP09exZ-ENI/edit","This Living Repository is part of a call for action to build a responsible infrastructure for data-driven pandemic response (JOIN US AND SIGN HERE) . \nIt serves as a repository for data collaboratives seeking to address the spread of COVID-19 and its secondary effects. \nYou can find ongoing data collaborative projects here\nData competitions, challenges, and calls for proposals can be found here.\nRequests for data and expertise can be found here.\nThe repository invites individuals to share projects that show a commitment to privacy protection, data responsibility, and overall user well-being. A project’s inclusion in this living repository does not indicate endorsement by The GovLab or confirmation of its success in meeting these goals.\n","No geographical scope","N/A","N/A","N/A","N/A","N/A","N/A","N/A","N/A","N/A","N/A","Yes","Yes","First category (at least one: having documents, epi info, or government responses)","Include","N/A","NGO","N/A","Public",0,0,0,0,0,0,0,0,0,0,0,0,0,"No","No","No","Yes","No","No","No","No","N/A","No","No","Yes","No","No",0,0,0,0,0,0,0,0,0,"No","No","No","Unclear","2020-05-06","1 Google document","English","English",0,"Yes","No","Yes","Yes","No","No","No","External links_Other hubs","N/A","Yes","No","None of them","No","30 mins"]
["2020-05-06","Nkuli","",{"$f":"IFERROR(SEARCH('1. Searching Hubs'!$E$14, E18)+ROW()/100000,\"\")","v":""},"Campbell UK and Ireland","http://meta-evidence.co.uk/the-role-of-evidence-synthesis-in-covid19/","The intention of this map is to geolocate where emerging research takes place to aid networking between research groups working across the world. This geolocation reflects the affiliation of researchers and not necessarily the geographic locations that are under study.\n\nThis database of emerging research includes a number of different resource types including:\n\nCase studies/case reports\nGuidance documents including clinical and normative practice guidance\nReviews including narrative and systematic reviews\nResearch reports including comparative studies, epidemiological studies, and translational research, as well as corrections and retractions\nOpinion pieces including editorials","Global ","Yes","Yes","Yes","Yes","Yes","Yes","Yes","Yes","Yes","Yes","Yes","No","Second category (at least two: having expert opinions or others)","Include","N/A","NGO","N/A","Public",0,0,0,0,0,0,0,0,0,0,0,0,0,"Yes","Yes","Yes","No","No","No","No","Yes","N/A","Yes","Yes","Yes","Yes","Yes",0,0,0,0,0,0,0,0,0,"No","No","Yes","Unclear","2020-05-06","1 interactive map","English","English",0,"Yes","No","No","No","No","No","Yes","External links_Other hubs & Resources ","N/A","Yes","No","None of them","No","40 mins"]
["2020-03-06","Promise","",{"$f":"IFERROR(SEARCH('1. Searching Hubs'!$E$14, E19)+ROW()/100000,\"\")","v":""},"Canadian Agency for Drugs and Technologies in Health","https://covid.cadth.ca/","CADTH is committed to supporting Canada’s health care decision-makers through this challenging and uncertain time. If you’re looking for credible answers to your COVID-19 questions, we can help.\n\nOn this site, you’ll find information related to COVID-19 from CADTH and other respected organizations","No geographical scope","N/A","N/A","N/A","N/A","N/A","N/A","N/A","N/A","N/A","N/A","Yes","Yes","First category (at least one: having documents, epi info, or government responses)","Include","N/A","NGO","N/A","Private not for profit",0,0,0,0,0,0,0,0,0,0,0,0,0,"No","No","Yes","No","No","No","No","No","N/A","No","No","No","No","No",0,0,0,0,0,0,0,0,0,"Yes","Yes","Yes","Unclear","2020-03-06","48 studies, 5 on-going projects including 2 trials and 3 rapid reports","English","English",0,"No","No","No","Yes","No","No","No","No","N/A","Yes","No","Date of publication","No","33 mins"]
["29/05/2020","Irvine","",{"$f":"IFERROR(SEARCH('1. Searching Hubs'!$E$14, E20)+ROW()/100000,\"\")","v":""},"Canadian Centre on substance use and addiction","https://www.ccsa.ca/Impacts-COVID-19-Substance-Use?_cldee=bGF2aXNqQG1jbWFzdGVyLmNh&recipientid=contact-cef0e4fd111ee7118111480fcfeab9c1-2159d9a71b0347f89516305682d43e92&esid=c541fc48-7173-ea11-a811-000d3af42c56","CSA is the go-to place in Canada for trusted information on COVID-19 and substance use. We have put together a suite of resources from websites and organizations from around the world, as well publications from our own experts. Our subject-matter experts have gathered this material from sources we believe are trustworthy and credible. We have reviewed it against a set of criteria that includes alignment with evidence.","National","No","No","No","Yes","No","No","No","No","No","Yes","Yes","Yes","First category (at least one: having documents, epi info, or government responses)","Include","N/A","NGO","N/A",0,0,0,0,0,0,0,0,0,0,0,0,0,0,"Yes","Yes","Yes","No","No","Yes","Yes","No","N/A","No","Yes","Yes","Yes","Yes",0,0,0,0,0,0,0,0,0,"Yes","Yes","No","29/05/2020","29/05/2020","Unclear","English","English",0,"No","No","No","Yes","Yes","Yes","Yes","External links_Resource","N/A","Yes","Yes","Last update of the document","Yes"]
["2020-09-06","Andile","",{"$f":"IFERROR(SEARCH('1. Searching Hubs'!$E$14, E21)+ROW()/100000,\"\")","v":""},"Candid Philanthropic Funding Data","https://candid.org/explore-issues/coronavirus","We've created this pop-up web page to get you the information you need to do good during the novel coronavirus (COVID-19) pandemic. It includes a funding opportunities section, a funding summary, and news items.","Global ","Yes","Yes","Yes","Yes","Yes","Yes","Yes","Yes","Yes","Yes","Yes","Yes","Second category (at least two: having expert opinions or others)","Include","N/A","NGO","N/A","Public",0,0,0,0,0,0,0,0,0,0,0,0,0,"Yes","No","No","No","Yes","No","No","No","N/A","No","No","No","No","No",0,0,0,0,0,0,0,0,0,"No","No","No","Unclear","2020-09-06","Unclear","English","English",0,"No","No","Yes","No","No","No","Yes","No","N/A","Yes","No","Date of publication","No"]
["2020-05-06","Promise","",{"$f":"IFERROR(SEARCH('1. Searching Hubs'!$E$14, E22)+ROW()/100000,\"\")","v":""},"CareSearch: Palliative Care Knowledge Network","https://www.caresearch.com.au/caresearch/tabid/5971/Default.aspx","COVID-19 has been identified as a key issue for health and aged care. The Australian Government has adopted a whole of government emergency response which provides a framework for preparing for, responding to and managing COVID-19 in Australia.\n\nFor most patients dying in the community – at home, in RACFs, and in rural and remote areas – the coordinators and managers of palliative care will be GPs, nurses and local non-specialist medical services. There are many resources available that can support GPs and primary care providers.","National","No","No","No","No","No","No","No","No","No","Yes","Yes","Yes","First category (at least one: having documents, epi info, or government responses)","Include","N/A","Governments and public institutions","N/A","Public",0,0,0,0,0,0,0,0,0,0,0,0,0,"No","No","No","No","No","No","No","No","N/A","No","No","No","No","No",0,0,0,0,0,0,0,0,0,"No","No","No","Unclear","2020-05-06","Care of the dying and seriously ill guidelines including  15 Australian resources and 17 International resources AND 48 Medicines management guidelines including 7 Australian resouces ,2 International resources, 11 Telehealth, 3 Decision-making, 8 communication, 5 Self-care, 6 Infection control, 2 Grief and Bereavement, 4 Practice management","English","English",0,"No","No","No","Yes","Yes","No","No","No","N/A","Yes","No","Date of publication","No"]
["2020-02-06","Promise","",{"$f":"IFERROR(SEARCH('1. Searching Hubs'!$E$14, E23)+ROW()/100000,\"\")","v":""},"Cell Press Coronavirus Resource Hub","https://www.cell.com/20","At Cell Press, we recognize the urgent need to quickly share information about SARS-CoV-2, the coronavirus that causes COVID-19. On this hub page, curated by members of our editorial team, you'll find the latest content about the outbreak as it appears in Cell Press journals.","No geographical scope","N/A","N/A","N/A","N/A","N/A","N/A","N/A","N/A","N/A","N/A","Yes","Yes","First category (at least one: having documents, epi info, or government responses)","Include","N/A","Academic institution","N/A","Public",0,0,0,0,0,0,0,0,0,0,0,0,0,"Yes","No","No","No","No","No","No",0,"N/A","No","Yes","No","No","No",0,0,0,0,0,0,0,0,0,"No","N/A","N/A","Unclear","2020-01-07","108 articles ","English","English",0,"No","No","No","Yes","No","No","No","No","N/A","Yes","No","Date of publication","No","45 mins"]
[null,"Irvine","",{"$f":"IFERROR(SEARCH('1. Searching Hubs'!$E$14, E24)+ROW()/100000,\"\")","v":""},"Centers for Disease Control and Prevention","https://www.cdc.gov/library/researchguides/2019novelcoronavirus/researcharticles.html","The Stephen B. Thacker CDC Library is collecting COVID-19 (2019 Novel Coronavirus) research articles and compiling them into an easily accessible and downloadable database to help researchers find the latest COVID-19 research.\n\nThis database is updated by systematically searching various bibliographic databases and hand searching selected grey literature sources.","Global ","Yes","Yes","Yes","Yes","Yes","Yes","Yes","Yes","Yes","Yes","Yes","Yes","Second category (at least two: having expert opinions or others)","Include","N/A","Governments and public institutions","N/A","Public","Yes","Yes","Yes","Yes","Yes","Yes","Yes","Yes","Yes","Yes","Yes","Yes",0,"Yes","Yes","No","No","No","No","No",0,"N/A","Yes","Yes","Yes","Yes","Yes","Yes","No","No","Yes","No","No","No","No","No","Yes","No","No","22/05/2020","25/05/2020","Unclear","English","English","Health","No","No","Yes","Yes","No","No","No","External links_Other hubs & Resources ","N/A","Yes","No","Last update of the document","No","70 min"]
["29/05/2020","Irvine","",{"$f":"IFERROR(SEARCH('1. Searching Hubs'!$E$14, E25)+ROW()/100000,\"\")","v":""},"Centre for Effective Practice","https://tools.cep.health/tool/covid-19/","The COVID-19 Resource Centre is intended for family physicians and primary care nurse practitioners in Ontario. It is revised often and new content is added regularly to guarantee that the latest evidence and regulatory recommendations are included. The CEP is committed to ensuring this information is accurate and up to date.","Sub-national","No","No","No","Yes","No","No","No","No","No","No","No","No","Second category (at least two: having expert opinions or others)","Include","N/A","NGO","N/A","Public",0,0,0,0,0,0,0,0,0,0,0,0,0,"Yes","Yes","Yes","No","No","Yes","Yes","No","N/A","Yes","Yes","Yes","Yes","No",0,0,0,0,0,0,0,0,0,"Yes","Yes","Yes","Unclear","29/05/2020","Unclear","English","English",0,"No","No","Yes","Yes","Yes","Yes","Yes","External links_Resource","N/A","Yes","No","Date of publication","Yes"]
["2020-08-06","Nkuli","",{"$f":"IFERROR(SEARCH('1. Searching Hubs'!$E$14, E26)+ROW()/100000,\"\")","v":""},"CGD - COVID education policy tracking","https://docs.google.com/spreadsheets/d/1ndHgP53atJ5J-EtxgWcpSfYG8LdzHpUsnb6mWybErYg/edit#gid=0","This Google sheet tracks all the government responses that have been undertaken in the education sector globally. It details policies related to the closure and reopening of education institutions at all levels (primary, secondary and tertiary).","Global ","Yes","Yes","Yes","Yes","Yes","Yes","Yes","Yes","Yes","Yes","Yes","Yes","First category (at least one: having documents, epi info, or government responses)","Include","N/A","NGO","N/A","Public",0,0,0,0,0,0,0,0,0,0,0,0,0,"No","No","No","Yes","No","No","No","No","N/A","No","No","No","Yes","No",0,0,0,0,0,0,0,0,0,"N/A","N/A","N/A","Unclear","2020-08-06","1 Google sheet, 2 external links","English","English",0,"Yes","No","Yes","Yes","No","No","No","External links_Resource","N/A","Yes","No","None of them","No","45 mins"]
["2020-01-06","Irvine","",{"$f":"IFERROR(SEARCH('1. Searching Hubs'!$E$14, E27)+ROW()/100000,\"\")","v":""},"CHAIN","www.chain-network.org.uk/resources.html","CHAIN is a successful online mutual support network of people working in health and social care. The Network originated 20 years ago in the NHS Research & Development programme in England. It is multi-professional and cross organisational, and is designed to connect like-minded health and social care practitioners, educators, researchers and managers. CHAIN now covers the whole of the UK and is also becoming international, with smaller satellites in Australia, Canada, Scandinavia, Italy, Spain and members in 40 other countries worldwide. CHAIN is a not-for-profit organisation; the network is free to join and use; and its costs are met by a consortium of stakeholders.","Global ","Yes","Yes","Yes","Yes","Yes","Yes","Yes","Yes","Yes","Yes","Yes","Yes","First category (at least one: having documents, epi info, or government responses)","Include","N/A","NGO","N/A","Private not for profit",0,0,0,0,0,0,0,0,0,0,0,0,0,"Yes","Yes","Yes","No","Yes","No","No","Yes","N/A","Yes","Yes","Yes","Yes","Yes",0,0,0,0,0,0,0,0,0,"No","No","No","Unclear","2020-01-05","Unclear","English","English",0,"Yes","No","No","No","No","No","No","External links_Other hubs & Resources ","No","Yes","No","None of them","No"]
["28/05/2020","Andile","",{"$f":"IFERROR(SEARCH('1. Searching Hubs'!$E$14, E28)+ROW()/100000,\"\")","v":""},"China National Knowledge Infrastructure (CNKI)","http://new.oversea.cnki.net/index/marketing/CNKIebook/en/homepage.html","COVID-19 has attracted widespread attention from experts, scholars and the public since its outbreak in December, 2019. In order to provide more information about this epidemic and relevant knowledge on disease protection, diagnosis and treatment, CNKI has cooperated with domestic publishers to present worldwide readers the latest books and audios of fighting against COVID-19 through CNKI-eBooks (Intl) platform.","Global ","Yes","Yes","Yes","Yes","Yes","Yes","Yes","Yes","Yes","Yes","Yes","Yes","First category (at least one: having documents, epi info, or government responses)","Include","N/A","Academic institution","N/A","Public","No","No",0,0,0,0,0,0,0,0,0,0,0,"No","No","No","No","No","No","Yes","No","N/A","No","No","No","No","No",0,0,0,0,0,0,0,0,0,"No","No","No","Unclear","2020-03-06","10 e-books","English, Traditional Chinese","Chinese, English, Italian, Spanish, French, Japanese, Korean, Persian",0,"No","No","No","Yes","No","No","No","No","N/A","Yes","No","Date of publication","No"]
["2020-05-06","Andile","",{"$f":"IFERROR(SEARCH('1. Searching Hubs'!$E$14, E29)+ROW()/100000,\"\")","v":""},"Chinese Center for Disease Control and Prevention","http://www.chinacdc.cn/en/COVID19/","This site has guidelines which will be continuously adjusted and improved to better protect the lives and health of the general public.","No geographical scope","N/A","N/A","N/A","N/A","N/A","N/A","N/A","N/A","N/A","N/A","Yes","Yes","First category (at least one: having documents, epi info, or government responses)","Include","N/A","Governments and public institutions","N/A","Private not for profit",0,0,0,0,0,0,0,0,0,0,0,0,0,"No","No","No","No","No","No","No","No","N/A","No","No","No","No","No",0,0,0,0,0,0,0,0,0,"No","No","No","21/04/2020","2020-05-06","20 Resources","English","English, French",0,"No","No","No","Yes","No","No","No","No","N/A","Yes","No","Date of publication","No","40mins"]
["2020-09-06","Promise","",{"$f":"IFERROR(SEARCH('1. Searching Hubs'!$E$14, E30)+ROW()/100000,\"\")","v":""},"CIAT/IOTA/OECD Tax Response","https://read.oecd-ilibrary.org/view/?ref=126_126478-29c4rprb3y&title=Tax_administration_responses_to_COVID-9_Measures_taken_to_support_taxpayers","he COVID-19 emergency will affect the lives of many people around the globe and governments  worldwide  are  taking  multifaceted  actions  to  support  their  citizens,  businesses and the provision of vital public services.  Among these actions are measures being taken by tax administrations to ease the burdens  on  taxpayers  and  to support  businesses  and  individuals  with  cash  flow  problems,  with difficulties  in  meeting  tax  reporting  or  payment  obligations  or otherwise facing  hardship.  This  reference  document  provides  an  overview  of  measures currently being undertaken by a number of tax administrations. It   is a joint document of the OECD Forum on Tax Administration, the Inter-American Center of Tax   Administrations   (CIAT)   and   the   Intra-European   Organisation   of   Tax   Administrations (IOTA) and has been produced by the respective Secretariats frominput from tax administrations and internet research and may not be accurate in all cases nor complete. Tax administrations may wish to contact their peers for further information on any of the measures outlined in this reference document.","Global ","Yes","No","Yes","Yes","No","Yes","No","Yes","Yes","Yes","Yes","Yes","First category (at least one: having documents, epi info, or government responses)","Include","N/A","International Organization","N/A","Public",0,0,0,0,0,0,0,0,0,0,0,0,0,"No","No","No","Yes","No","No","No","No","N/A","No","No","No","No","No",0,0,0,0,0,0,0,0,0,"N/A","N/A","N/A","21/04/2020","2020-09-06","1 government responses tracker document","English","English",0,"Yes","No","No","Yes","No","No","No","No","N/A","Yes","No","Date of publication","No","27 mins"]
["2020-09-06","Nkuli","",{"$f":"IFERROR(SEARCH('1. Searching Hubs'!$E$14, E31)+ROW()/100000,\"\")","v":""},"Civic Space Watch: Solidarity amid the COVID-19 crisis","http://civicspacewatch.eu/solidarity-amid-covid-19-crisis/","As the planet faces the Covid-19 emergency, we are all asked to act responsibly as individuals and as a community. We have to change our life to protect ourselves and others. \n\nCivil society too is adapting to these circumstances. Many were forced to close their centres and stop their activities. Many have found creative ways to be useful to their communities, to offer social and cultural tools against isolation, to volunteer for providing support to the weak and vulnerable which often happen to be the poorest.\n\nWe can collectively be proud of it. At this moment, we feel more united wherever we live than ever before, even at a distance. We know that “solidarity with all” is the message that has to be transmitted in all our communities if we want tomorrow to be better than yesterday was.\n\nOur thoughts and active solidarity also go to the vulnerable people: the precarious workers, the homeless, the migrants – both undocumented and legally recognised – and asylum seekers, all the people constrained in collective spaces deprived of the best possibility to protect themselves from contagion. We are sure that everyone of us will do its utmost not to leave anyone alone inside the crisis. We wish all of us courage, hope and positive energy. We must respect the distance today. But we will overcome the crisis more united than ever before.\n\nThe European Civic Forum will work to give visibility to civil society’s actions concerning the present crisis and to support their demands in front of the European institutions.","Global ","No","No","Yes","No","No","No","Yes","Yes","Yes","Yes","Yes","Yes","First category (at least one: having documents, epi info, or government responses)","Include","N/A","NGO","N/A","Public",0,0,0,0,0,0,0,0,0,0,0,0,0,"No","Yes","No","Yes","No","No","No","No","N/A","No","No","No","Yes","Yes",0,0,0,0,0,0,0,0,0,"N/A","N/A","N/A","Unclear","2020-09-06","Unclear","English","English, Italian",0,"Yes","No","Yes","No","No","No","No","External links_Resource","N/A","Yes","Yes","None of them","No","55 mins"]
["28/05/2020","Irvine","",{"$f":"IFERROR(SEARCH('1. Searching Hubs'!$E$14, E32)+ROW()/100000,\"\")","v":""},"Cochrane  Covid 19 Pregnancy and Fertility","https://cgf.cochrane.org/news/covid-19-coronavirus-disease-fertility-and-pregnancy","Here we have gathered important resources, guidance and advice statements from international organizations and societies related to COVID-19, fertility and pregnancy. We are working on updating the information below as soon as new guidelines become available.  \n\n","No geographical scope","No","No","No","Yes","Yes","Yes","N/A","N/A","N/A","N/A","Yes","Yes","Second category (at least two: having expert opinions or others)","Include","N/A","International Organization","N/A","Private not for profit","Yes","Yes",0,0,0,0,0,0,0,0,0,0,0,"Yes","Yes","Yes","Yes","Yes","Yes","Yes",0,"N/A","Yes","Yes","Yes","No","No",0,0,0,0,0,0,0,0,0,"Yes","Yes","No","27/05/2020","28/05/2020","Unclear","English","English",0,"No","No","Yes","Yes","No","Yes","Yes","External links_Resource","N/A","Yes","No","Date of publication","Yes"]
[null,"Nkuli","",{"$f":"IFERROR(SEARCH('1. Searching Hubs'!$E$14, E33)+ROW()/100000,\"\")","v":""},"Cochrane Clinical Answers","https://www.cochrane.org/news/cochrane-clinical-answers-related-covid-19","Cochrane Clinical Answers (CCAs) provide a readable, digestible, clinically-focused entry point to rigorous research from Cochrane Reviews. They are designed to be actionable and to inform point-of-care decision-making. Each CCA contains a clinical question, a short answer, and data for the outcomes from the Cochrane Review deemed most relevant to practising healthcare professionals. The evidence is displayed in a user-friendly tabulated format that includes narratives, data, and links to graphics.","No geographical scope","Yes","Yes","Yes","Yes","Yes","Yes","N/A","N/A","N/A","N/A","Yes","Yes","First category (at least one: having documents, epi info, or government responses)","Include","N/A","International Organization","N/A","Private not for profit","Yes","No","No","No","Yes","Yes","No","No","No","No","Yes","No",0,"No","No","No","No","No","No","No",0,"N/A","Yes","Yes","Yes","No","No","No","No","No","No","No","Yes","No","No","Yes","No","No","No","20/05/2020","26/05/2020","65: 65 rapid reviews and evidence summaries","English","English","Health","No","No","Yes","No","No","No","No","No","N/A","Yes","No","Date of publication","Yes","29 mins"]
["27/05/2020","Andile","",{"$f":"IFERROR(SEARCH('1. Searching Hubs'!$E$14, E34)+ROW()/100000,\"\")","v":""},"Cochrane COVID Rapid Reviews","https://covidrapidreviews.cochrane.org/","The Cochrane COVID Rapid Reviews website and Question Bank have three main objectives:\n1. To list reviews that are underway in Cochrane and elsewhere to help front-line medical staff, policy makers, and consumers find the answers they need.\n2. To reduce duplication of effort by showing researchers where reviews are being addressed by other teams, and maintaining a list of questions submitted by stakeholders.\n3. To support the production of high-quality rapid reviews by providing protocol and review templates and methods guidance.","No geographical scope","Yes","Yes","Yes","Yes","Yes","Yes","N/A","N/A","N/A","N/A","Yes","Yes","First category (at least one: having documents, epi info, or government responses)","Include","N/A","International Organization","N/A","Private not for profit","Yes","No",0,0,0,0,0,0,0,0,0,0,0,"No","No","No","No","No","No","No",0,"N/A","No","No","Yes","No","No",0,0,0,0,0,0,0,0,0,"No","No","No","Unclear","27/05/2020","Unclear","English","English",0,"No","No","Yes","Yes","No","No","No","No","N/A","Yes","No","Date of publication","No"]
["29/05/2020","Irvine","",{"$f":"IFERROR(SEARCH('1. Searching Hubs'!$E$14, E35)+ROW()/100000,\"\")","v":""},"Cochrane Covid-19 Study register","https://covid-19.cochrane.org/","This is a COVID 19 related studies compliled by Cochrane","No geographical scope","Yes","Yes","Yes","Yes","Yes","Yes","N/A","N/A","N/A","N/A","Yes","Yes","First category (at least one: having documents, epi info, or government responses)","Include","N/A","International Organization","N/A","Private not for profit",0,0,0,0,0,0,0,0,0,0,0,0,0,"Yes","Yes","Yes","No","No","Yes","No","No","N/A","Yes","Yes","Yes","Yes","Yes",0,0,0,0,0,0,0,0,0,"Yes","Yes","Yes","28/05/2020","29/05/2020","6361 Studies","English","English",0,"No","No","Yes","Yes","No","No","Yes","External links_Resource","N/A","Yes","No","Date of publication","No"]
[null,"Nkuli","",{"$f":"IFERROR(SEARCH('1. Searching Hubs'!$E$14, E36)+ROW()/100000,\"\")","v":""},"Cochrane Effective Practise and Organisation of Care: Task Shifting","https://epoc.cochrane.org/our-reviews/summaries-our-reviews/covid-19-relevant-summaries","The hub provides summarised versions of Cochrane Reviews from EPOC and other groups that may be of particular relevance in pandemic situations such as COVID-19 in various languages. The evidence summaries are related to the organisation and practice of care.","No geographical scope","Yes","Yes","Yes","Yes","Yes","Yes","N/A","N/A","N/A","N/A","Yes","Yes","First category (at least one: having documents, epi info, or government responses)","Include","N/A","International Organization","N/A","Private not for profit","Yes","No","Yes","No","Yes","Yes","No","No","No","No","No","No",0,"No","No","No","No","No","No","No",0,"N/A","No","No","Yes","No","No","No","No","No","No","No","No","No","No","Yes","No","No","No","26/05/2020","26/05/2020","7: 1 evidence summary, 5 SRs, 1 rapid review","English","English, Portuguese, Norwegian, Spanish, French","Health","No","No","No","Yes","No","No","No","No","N/A","Yes","No","Date of publication","Yes","30 mins"]
["2020-03-06","Promise","",{"$f":"IFERROR(SEARCH('1. Searching Hubs'!$E$14, E37)+ROW()/100000,\"\")","v":""},"Cochrane ENT, Hearing & Balance","ccoronavirus-disease-ent-hearing-balance","Here we have gathered important resources, guidance and advice statements from international organizations and societies related to COVID-19, and the management of patients with ENT, hearing and balance problems by ENT and Audiology professionals. We are working on updating the information below as soon as new guidelines become available.  ","No geographical scope","Yes","Yes","Yes","Yes","Yes","No","N/A","N/A","N/A","N/A","Yes","Yes","First category (at least one: having documents, epi info, or government responses)","Include","N/A","International Organization","N/A","Private not for profit",0,0,0,0,0,0,0,0,0,0,0,0,0,"No","No","No","No","No","No","No","No","N/A","No","No","No","Yes","No",0,0,0,0,0,0,0,0,0,"No","N/A","N/A","Unclear","2020-03-06","92: 30 single studies in  an excel sheet of papers with ear, nose and throat outcomes in COVID-19 infection, 62 links to guidance and advice statements from international organizations and societies related to COVID-19.","English","English",0,"No","No","Yes","Yes","No","No","No","External links_Other hubs & Resources ","N/A","Yes","No","Date of publication","No"]
[null,"Promise","",{"$f":"IFERROR(SEARCH('1. Searching Hubs'!$E$14, E38)+ROW()/100000,\"\")","v":""},"Cochrane Library","https://www.cochranelibrary.com/covid-19","Cochrane Reviews and related content from the Cochrane Library relating to the COVID-19 pandemic:","No geographical scope","Yes","Yes","Yes","Yes","Yes","Yes","N/A","N/A","N/A","N/A","Yes","Yes","First category (at least one: having documents, epi info, or government responses)","Include","N/A","International Organization","N/A","Private not for profit","No","No",0,0,0,0,0,0,0,0,0,0,0,"No","No","No","No","No","No","No",0,"N/A","No","No","Yes","No","No",0,0,0,0,0,0,0,0,0,"No","No","No","Unclear","26/05/2020","21: 5 published rapid reviews, 10 rapid reviews in progress, 1 published review, 5 systematic review protocols.","English","English, Spanish and Persian","Health","No","No","No","Yes","No","No","No","No","Links to internal Cochrane special collections","Yes","No","Date of publication","No","61 mins"]
["2020-02-06","Andile","",{"$f":"IFERROR(SEARCH('1. Searching Hubs'!$E$14, E39)+ROW()/100000,\"\")","v":""},"Cochrane Oral Health","https://oralhealth.cochrane.org/news/covid-19-coronavirus-resources-oral-and-dental-care-team","Cochrane Oral Health are collecting information and guidance from international professional dental bodies. At this time, it is more important than ever to work together and the Global Evidence Ecosystem for Oral Health (GEEOH) will continue to do this.","No geographical scope","Yes","Yes","Yes","Yes","Yes","Yes","N/A","N/A","N/A","N/A","Yes","Yes","First category (at least one: having documents, epi info, or government responses)","Include","N/A","International Organization","N/A","Private not for profit",0,0,0,0,0,0,0,0,0,0,0,0,0,"No","No","No","No","No","No","No",0,"N/A","No","No","No","No","No",0,0,0,0,0,0,0,0,0,"No","No","No","Unclear","2020-02-06","Unclear","English","Simplified Chinese, German, Farsi, French, Japanese, Bahasa Malaysia, Polish, Portuguese, Russian, Spanish, Malay",0,"No","No","Yes","Yes","Yes","Yes","No","External links_Other hubs","N/A","Yes","No","Date of publication","No"]
["2020-04-06","Andile","",{"$f":"IFERROR(SEARCH('1. Searching Hubs'!$E$14, E40)+ROW()/100000,\"\")","v":""},"Communication Initiative","https://www.comminit.com/covid/","The Network for Shared Knowledge and Active Dialogue in Support of Effective COVID-19 Action","Global ","Yes","Yes","Yes","Yes","Yes","Yes","Yes","Yes","Yes","Yes","Yes","Yes","First category (at least one: having documents, epi info, or government responses)","Include","N/A","Other","Network of organisations","Public",0,0,0,0,0,0,0,0,0,0,0,0,0,"No","No","No","No","No","No","No","No","N/A","No","No","No","No","No",0,0,0,0,0,0,0,0,0,"Yes","Yes","Yes","Unclear","2020-04-06","Unclear","English","English,Spanish",0,"No","No","Yes","Yes","No","No","No","External links_Other hubs","Blogs","Yes","No","Date of publication","No","50 mins"]
["2020-09-06","Andile","",{"$f":"IFERROR(SEARCH('1. Searching Hubs'!$E$14, E41)+ROW()/100000,\"\")","v":""},"Conflict and Covid-19 Resource Hub","https://www.politicalsettlements.org/covid-19/resources/","We are curating a of blogs and resources addressing the COVID-19 pandemic from the perspective of conflict-affected areas. This list is updated daily. ","Global ","Yes","Yes","Yes","Yes","Yes","Yes","Yes","Yes","Yes","Yes","Yes","Yes","First category (at least one: having documents, epi info, or government responses)","Include","N/A","Other","Research programme","Private not for profit",0,0,0,0,0,0,0,0,0,0,0,0,0,"No","No","No","Yes","No","No","No","No","N/A","No","No","No","No","No",0,0,0,0,0,0,0,0,0,"N/A","N/A","N/A","Unclear","2020-09-06","Unclear","English","English",0,"No","No","No","Yes","No","No","No","External links_Other hubs","Stories, Tweets","Yes","No","None of them","No"]
["2020-09-06","Andile","",{"$f":"IFERROR(SEARCH('1. Searching Hubs'!$E$14, E42)+ROW()/100000,\"\")","v":""},"Coronavirus Research Repository","https://coronavirus.1science.com/search","Elsevier Coronavirus Research Repository, presenting scholarly articles on COVID-19, SARS, MERS and other coronaviruses research. ","Global ","Yes","Yes","Yes","Yes","Yes","Yes","Yes","Yes","Yes","Yes","Yes","Yes","First category (at least one: having documents, epi info, or government responses)","Include","N/A","Other","Publisher","Private not for profit",0,0,0,0,0,0,0,0,0,0,0,0,0,"No","No","No","No","No","No","No","No","N/A","No","Yes","No","No","No",0,0,0,0,0,0,0,0,0,"No","Yes","No","Unclear","2020-09-06","66 565 Articles","English","English",0,"No","No","No","Yes","No","No","No","No","N/A","Yes","No","Date of publication","No"]
["29/05/2020","Promise","",{"$f":"IFERROR(SEARCH('1. Searching Hubs'!$E$14, E43)+ROW()/100000,\"\")","v":""},"Coronavirus Tech Handbook","https://coronavirustechhandbook.com","This handbook provides a library for technologists, civic organisations, public and private institutions, researchers, educators and specialists of all kinds to collaborate on an agile ad sophisticated response to the Coronavirus and subsequent impacts. It is a rapidly evolving resource with thousands of active expert contributors","Global ","Yes","Yes","Yes","Yes","Yes","Yes","Yes","Yes","Yes","Yes","Yes","Yes","First category (at least one: having documents, epi info, or government responses)","Include","N/A","Other","Unclear governance structure","Public",0,0,0,0,0,0,0,0,0,0,0,0,0,"No","No","Yes","Yes","Yes","No","Yes",0,"N/A","No","No","No","No","Yes",0,0,0,0,0,0,0,0,0,"No","No","N/A","Unclear","29/05/2020","Unclear","English","English",0,"Yes","No","No","No","No","No","No","External links_Other hubs","N/A","Yes","No","None of them","No","62 mins"]
["2020-09-06","Andile","",{"$f":"IFERROR(SEARCH('1. Searching Hubs'!$E$14, E44)+ROW()/100000,\"\")","v":""},"Coronavirus: prison fever","https://www.prison-insider.com/en/articles/coronavirus-la-fievre-des-prisons","What measures are taken to guarantee the safety of all prisoners and prison staff? What are the consequences of the pandemic on the living conditions in prisons? Here is an overview.","Global ","Yes","Yes","Yes","Yes","Yes","Yes","Yes","Yes","Yes","Yes","Yes","Yes","First category (at least one: having documents, epi info, or government responses)","Include","N/A","International Organization","N/A","Private not for profit",0,0,0,0,0,0,0,0,0,0,0,0,0,"No","No","No","Yes","No","No","No","No","N/A","Yes","No","No","No","No",0,0,0,0,0,0,0,0,0,"N/A","Yes","Yes",43927,"2020-09-06","Unclear","English","English",0,"No","No","Yes","No","No","No","No","External links_Other hubs & Resources ","N/A","Yes","No","None of them","No"]
["27/05/2020","Irvine","",{"$f":"IFERROR(SEARCH('1. Searching Hubs'!$E$14, E45)+ROW()/100000,\"\")","v":""},"COVID 19 Africa Data Research","https://www.covid19afrique.com","This site aims to present information relating to COVID 19 in some African countries. All data is checked and validated. Many are transmitted to us by our colleagues  who synthesize them from government press releases (thanks to them). It takes time to verify the sources and produce the maps, which explains the delay of a few days.","Regional","Yes","Yes","No","No","No","No","Yes","Yes","Yes","Yes","Yes","Yes","First category (at least one: having documents, epi info, or government responses)","Include","N/A","NGO","N/A","Private not for profit","No","No",0,0,0,0,0,0,0,0,0,0,0,"Yes","Yes","No","Yes","No","Yes","No",0,"N/A","Yes","No","No","No","No",0,0,0,0,0,0,0,0,0,"No","Yes","Yes","Unclear","27/05/2020","Unclear","English","English",0,"No","No","Yes","No","No","No","No","External links_Other hubs & Resources ","N/A","Yes","No","None of them","No"]
["2020-03-06","Irvine","",{"$f":"IFERROR(SEARCH('1. Searching Hubs'!$E$14, E46)+ROW()/100000,\"\")","v":""},"Covid 19 Africa Watch","https://covid19africawatch.org/global-response-monitor/","COVID-19 Africa Watch is monitoring global initiatives and financial support packages targeted toward COVID-19 preparation, response, and budgetary support and focused on the African region or specific African countries.Below we organize top-line numbers as available via public sources and vetted by our team. \n\n","Regional","Yes","No","No","No","No","No","No","No","No","No","Yes","Yes","First category (at least one: having documents, epi info, or government responses)","Include","N/A","NGO","N/A","Private not for profit",0,0,0,0,0,0,0,0,0,0,0,0,0,"No","No","No","Yes","Yes","No","No","No","N/A","No","No","No","No","No",0,0,0,0,0,0,0,0,0,"Yes","N/A","N/A","Unclear","2020-03-06","Unclear","English","English",0,"Yes","No","Yes","Yes","No","Yes","No","No","N/A","Yes","No","Date of publication","No"]
["2020-08-06","Nkuli","",{"$f":"IFERROR(SEARCH('1. Searching Hubs'!$E$14, E47)+ROW()/100000,\"\")","v":""},"COVID 19 Inequality Project","https://sites.google.com/view/covidinequality/home","Objectives of our project:\nWe are documenting the impact of the pandemic on workers. We are particularly interested in understanding how the outbreak of Covid-19 and government policies are impacting inequality across many dimensions, such as age, gender, occupation, work arrangements, and education.\n\nWe provide downloadable data and questionnaires in the Resources section.\nWe have already launched two survey waves collecting responses from large geographically representative samples in the US and UK and one survey wave in Germany. \n15% (UK) and 18% (US) of workers in our sample that were in employment four weeks ago have already lost their job due to COVID-19.  Individuals are worried about being able to pay their usual bills and expenses. 46% (US), 38% (UK) and 32% (Germany) already have struggled to pay their usual bills\nWe find a stark contrast between the US and the UK compared to Germany where only 5% have lost their job.\nLockdown measures in the US have a significant negative impact on women's mental health.\nOur goal is to inform the policy, academic, and public community about the impact of these dramatic developments and the recovery on different groups of society. ","Regional","No","No","Yes","Yes","No","No","No","No","No","Yes","Yes","Yes","Second category (at least two: having expert opinions or others)","Include","N/A","NGO","N/A","Public",0,0,0,0,0,0,0,0,0,0,0,0,0,"Yes","Yes","No","No","No","No","No","No","N/A","No","No","No","Yes","Yes",0,0,0,0,0,0,0,0,0,"Yes","No","No","Unclear","2020-08-06","11 data sheets, 7 graphs, 3 working papers","English","English",0,"Yes","No","Yes","Yes","No","No","Yes","No","N/A","Yes","No","None of them","No","37 mins"]
["2020-09-06","Irvine","",{"$f":"IFERROR(SEARCH('1. Searching Hubs'!$E$14, E48)+ROW()/100000,\"\")","v":""},"Covid 19 Research Explorer","https://covid19-research-explorer.appspot.com","This hub provides answers to complex scientific questions related to COVID-19 Based on 100,000+ scholarly articles from CORD-19","No geographical scope","Yes","Yes","Yes","Yes","Yes","Yes","Yes","Yes","Yes","Yes","Yes","Yes","Second category (at least two: having expert opinions or others)","Include","N/A","NGO","N/A","Public",0,0,0,0,0,0,0,0,0,0,0,0,0,"No","Yes","No","No","No","Yes","No","No","N/A","Yes","Yes","Yes","Yes","Yes",0,0,0,0,0,0,0,0,0,"Yes","No","No","Unclear","2020-09-06","Unclear","English","English",0,"No","No","Yes","Yes","No","No","No","No","N/A","Yes","No","Date of publication","No"]
["29/05/2020","Andile","",{"$f":"IFERROR(SEARCH('1. Searching Hubs'!$E$14, E49)+ROW()/100000,\"\")","v":""},"COVID 19 ZA Dashboard","https://datastudio.google.com/u/0/reporting/1b60bdc7-bec7-44c9-ba29-be0e043d8534/page/hrUIB","The Data Science for Social Impact Research Group division from the University of Pretoria, created a COVID 19 ZA South Africa Dashboard; which tracks the number of cases for the coronavirus. ","National","Yes","No","No","No","No","No","No","No","Yes","No","Yes","Yes","First category (at least one: having documents, epi info, or government responses)","Include","N/A","Academic institution","N/A","Public",0,0,0,0,0,0,0,0,0,0,0,0,0,"Yes","No","No","No","No","No","No",0,"N/A","Yes","No","No","No","No",0,0,0,0,0,0,0,0,0,"No","No","No","29/05/2020","29/05/2020","9: 6 Graphs, 2 Blogs, 1 Video","English","English",0,"No","No","No","No","Yes","No","Yes","No","Blog posts","Yes","No","None of them","No"]
["2020-09-06","Irvine","",{"$f":"IFERROR(SEARCH('1. Searching Hubs'!$E$14, E50)+ROW()/100000,\"\")","v":""},"Covid Prison Data","https://covidprisondata.com/","On April 10, a team of data scientists, criminologists, and law professors began a concerted effort to gather data to learn more about how incarcerated people and correctional staff are being affected by Covid-19. High-quality data are critical to provide transparency so advocates, experts, and government officials can be informed by the best information available. Here, data produced by states are integrated into one resource to facilitate access, a comparative perspective, and analysis. This is a work in progress and we appreciate feedback and suggestions.","National","No","No","No","Yes","No","No","No","No","No","Yes","Yes","Yes","First category (at least one: having documents, epi info, or government responses)","Include","N/A","Governments and public institutions","N/A","Public",0,0,0,0,0,0,0,0,0,0,0,0,0,"No","No","No","Yes","No","No","No","No","N/A","Yes","No","No","No","No",0,0,0,0,0,0,0,0,0,"Yes","Yes","Yes",43957,"2020-09-06","Unclear","English","English",0,"No","No","Yes","Yes","No","No","Yes","External links_Resource","N/A","Yes","No","None of them","No"]
["2020-08-06","Nkuli","",{"$f":"IFERROR(SEARCH('1. Searching Hubs'!$E$14, E51)+ROW()/100000,\"\")","v":""},"COVID Racial Data Tracker","https://covidtracking.com/race","The COVID Racial Data Tracker is a collaboration between the COVID Tracking Project and the Antiracist Research & Policy Center. Together, we're gathering the most complete race and ethnicity data on COVID-19 in the United States.","National","No","No","No","Yes","No","No","No","No","No","Yes","Yes","Yes","First category (at least one: having documents, epi info, or government responses)","Include","N/A","NGO","N/A","Public",0,0,0,0,0,0,0,0,0,0,0,0,0,"Yes","No","No","No","No","No","No","No","N/A","Yes","No","Yes","No","No",0,0,0,0,0,0,0,0,0,"No","No","No","Unclear","2020-08-06","3 infographic graphs (not interactive), 1 data sheet, 10 news article links","English","English",0,"No","No","Yes","Yes","No","No","Yes","External links_Resource","N/A","Yes","Yes","None of them","No","47 mins"]
["2020-08-06","Nkuli","",{"$f":"IFERROR(SEARCH('1. Searching Hubs'!$E$14, E52)+ROW()/100000,\"\")","v":""},"COVID Scholar","https://covidscholar.org/","The hub allows the user to search for COVID-19-related research that has been collated from different research journals since 2011. The site also offers basic article information such as title, abstract, author(s) and year.  There is a comprehensive filter function that relates mainly to document type, year and data source.\nThis website uses natural language processing (NLP) to power search on a set of research papers related to COVID-19. It was created by the team behind Matscholar, a research effort led by the HackingMaterials, Persson, and Ceder research groups at Lawrence Berkeley National Lab.\nThis work is currently funded by a Laboratory Directed Research and Development grant at the Lawrence Berkeley National Laboratory of the US Department of Energy. It was assisted by funding for the development of NLP tools in Materials Science from the Energy Biosciences Institute at UC Berkeley, and from the National Science Foundation.","No geographical scope","N/A","N/A","N/A","N/A","N/A","N/A","N/A","N/A","N/A","N/A","Yes","Yes","First category (at least one: having documents, epi info, or government responses)","Include","N/A","NGO","N/A","Public",0,0,0,0,0,0,0,0,0,0,0,0,0,"Yes","No","No","Yes","No","Yes","No","Yes","N/A","Yes","Yes","Yes","Yes","Yes",0,0,0,0,0,0,0,0,0,"Yes","Yes","No",44018,"2020-08-06","Unclear","English","English",0,"Yes","No","Yes","No","No","No","No","External links_Other hubs & Resources ","N/A","Yes","No","Date of publication","No","30 mins"]
["27/05/2020","Irvine","",{"$f":"IFERROR(SEARCH('1. Searching Hubs'!$E$14, E53)+ROW()/100000,\"\")","v":""},"COVID-19 and Citizen Science","https://www.citizenscience.org/covid-19//","This is a selection of resources related to the current COVID19 pandemic. It contains links to citizen science and crowdsourcing projects","Global ","Yes","Yes","Yes","Yes","Yes","Yes","Yes","Yes","Yes","Yes","Yes","Yes","First category (at least one: having documents, epi info, or government responses)","Include","N/A","NGO","N/A","Public","Yes","Yes",0,0,0,0,0,0,0,0,0,0,0,"No","No","No","Yes","No","Yes","Yes",0,"N/A","Yes","Yes","Yes",0,0,0,0,0,0,0,0,0,0,0,"Yes","No","No","Unclear","27/05/2020","Unclear","English","English",0,"Yes","No","Yes","Yes","No","No","No","External links_Resource","N/A","Yes","Yes","None of them","No"]
["2020-09-06","Nkuli","",{"$f":"IFERROR(SEARCH('1. Searching Hubs'!$E$14, E54)+ROW()/100000,\"\")","v":""},"Covid19 Behaviour Tracker\n","https://github.com/YouGov-Data/covid-19-tracker","This is the data repository for the Imperial College London YouGov Covid 19 Behaviour Tracker Data Hub.\n\nYouGov has partnered with the Institute of Global Health Innovation (IGHI) at Imperial College London to gather global insights on people’s behaviours in response to COVID-19. The research will cover 29 countries, interviewing around 21,000 people each week.\n\nIt is designed to provide behavioural analysis on how different populations are responding to the pandemic, helping public health bodies in their efforts to limit the impact of the disease. Anonymised respondent level data will be available for all public health and academic institutions globally.\n\nThe questions in the survey, led by IGHI, cover data on testing, symptoms, self-isolating in response to symptoms and the ability and willingness to self-isolate if needed. It also looks at behaviours, including going outdoors, working outside the home, contact with others, hand washing and the extent of compliance with 20 common preventative measures.\n\nIGHI has built a publicly available dashboard to visualise the data.","Global ","No","Yes","Yes","Yes","Yes","Yes","No","Yes","Yes","Yes","Yes","Yes","Second category (at least two: having expert opinions or others)","Include","N/A","Academic institution","N/A","Public",0,0,0,0,0,0,0,0,0,0,0,0,0,"Yes","No","No","No","No","No","No","No","N/A","No","No","Yes","Yes","Yes",0,0,0,0,0,0,0,0,0,"No","No","No",43957,"2020-09-06","1 interactive graph, 1 data sheet","English","English",0,"Yes","No","Yes","No","No","No","Yes","External links_Other hubs","N/A","Yes","No","Last update of the document","No","45 mins"]
["28/05/2020","Andile","",{"$f":"IFERROR(SEARCH('1. Searching Hubs'!$E$14, E55)+ROW()/100000,\"\")","v":""},"COVID-19 CoronaVirus South African Resource Portal","https://sacoronavirus.co.za/","South Africa`s official Coronavirus (Covid-19) online news and information portal. ","National","Yes","No","No","No","No","No","No","No","Yes","No","Yes","Yes","First category (at least one: having documents, epi info, or government responses)","Include","N/A","Governments and public institutions","N/A","Public","No","No",0,0,0,0,0,0,0,0,0,0,0,"No","Yes","No","Yes","No","No","No",0,"N/A","Yes","No","No","No","No",0,0,0,0,0,0,0,0,0,"Yes","No","No","Unclear","28/05/2020","Unclear","English","English",0,"No","No","Yes","Yes","Yes","Yes","Yes","No","Press release, Diaries, Lockdown fitness tutorials","Yes","Yes","Date of publication","No"]
["2020-09-06","Promise","",{"$f":"IFERROR(SEARCH('1. Searching Hubs'!$E$14, E56)+ROW()/100000,\"\")","v":""},"COVID-19 Disorder Tracker (CDT)","https://acleddata.com/analysis/covid-19-disorder-tracker/","The COVID-19 Disorder Tracker (CDT) provides special coverage of the pandemic’s impact on political violence and protest around the world, monitoring changes in demonstration activity, state repression, mob attacks, overall rates of armed conflict, and more.","Global ","Yes","Yes","Yes","Yes","Yes","Yes","Yes","Yes","Yes","Yes","Yes","Yes","First category (at least one: having documents, epi info, or government responses)","Include","N/A","NGO","N/A","Public",0,0,0,0,0,0,0,0,0,0,0,0,0,"Yes","No","No","Yes","No","No","No","No","N/A","No","No","No","Yes","No",0,0,0,0,0,0,0,0,0,"Yes","N/A","N/A",43927,"2020-09-06","Unclear","English","English",0,"No","No","Yes","No","No","No","Yes","No","N/A","Yes","No","None of them","No"]
["2020-01-06","Promise","",{"$f":"IFERROR(SEARCH('1. Searching Hubs'!$E$14, E57)+ROW()/100000,\"\")","v":""},"COVID-19 Economic Stimulus Index","http://web.boun.edu.tr/elgin/COVID.htm","A comprehensive review of different economic policy measures adopted by 166 countries as a response to COVID-19 pandemic and create a large database\nincluding fiscal, monetary and exchange rate measures. Next, using the principle component analysis (PCA), we construct a COVID-19 Economic Stimulus Index (CESI) that combines all adopted fiscal, monetary, and exchange rate measures. This index standardizes the economic responses taken by governments, thus allows to study cross-country differences inpolicies.","Global ","Yes","Yes","Yes","Yes","Yes","Yes","Yes","Yes","Yes","Yes","Yes","Yes","First category (at least one: having documents, epi info, or government responses)","Include","N/A","Academic institution","N/A","Private not for profit",0,0,0,0,0,0,0,0,0,0,0,0,0,"Yes","No","No","No","No","No","No","No","N/A","No","No","No","No","No",0,0,0,0,0,0,0,0,0,"No","N/A","N/A","Unclear","2020-01-05","1  excel database of country responses and the stimulux index and 1 pdf paper of the index","English","English",0,"Yes","No","No","Yes","No","Yes","Yes","No","N/A","Yes","No","None of them","No"]
["29/05/2020","Promise","",{"$f":"IFERROR(SEARCH('1. Searching Hubs'!$E$14, E58)+ROW()/100000,\"\")","v":""},"Covid-19 Innovations","https://covid19innovations.org","Our key objective is to celebrate, source, and supply innovations across 12 COVID-19 categories (i.e. response areas). The growing list of 750+ featured innovations includes those that are ready to deploy, plus innovations that could be adapted for COVID-19 responses, or inspire new, much-needed solutions. A smaller list is identified as COVID-19 Recognized Innovations for their response efforts so others can more easily find and use them. We are also actively sourcing new innovations designed in response to COVID-19.","Global ","Yes","Yes","Yes","Yes","Yes","Yes","Yes","Yes","Yes","Yes","Yes","Yes","First category (at least one: having documents, epi info, or government responses)","Include","N/A","NGO","N/A","Public",0,0,0,0,0,0,0,0,0,0,0,0,0,"No","No","No","No","No","No","No","No","Collation of Covidm-19 innovations across the ","No","No","No","No","No",0,0,0,0,0,0,0,0,0,"Yes","Yes","No","Unclear","29/05/2020","802  innnovations across multiple sectors captured","English","English",0,"Yes","No","Yes","No","No","No","No","External links_Resource","N/A","Yes","No","None of them","No"]
["29/05/2020","Andile","",{"$f":"IFERROR(SEARCH('1. Searching Hubs'!$E$14, E59)+ROW()/100000,\"\")","v":""},"COVID-19 Open Research Dataset","https://www.semanticscholar.org/cord19/get-started","Our mission is to help scholars overcome information overload. We have built the following free, open resources for researchers working on the coronavirus pandemic.","Global ","Yes","Yes","Yes","Yes","Yes","Yes","Yes","Yes","Yes","Yes","Yes","Yes","First category (at least one: having documents, epi info, or government responses)","Include","N/A","Other","Search engine","Public",0,0,0,0,0,0,0,0,0,0,0,0,0,"No","No","No","No","No","No","No","No","N/A","No","Yes","No","No","No",0,0,0,0,0,0,0,0,0,"Yes","Yes","No","Unclear","2020-03-06","Unclear","English","English",0,"No","No","No","Yes","No","No","No","No","N/A","Yes","No","Date of publication","No"]
[null,"Andile","",{"$f":"IFERROR(SEARCH('1. Searching Hubs'!$E$14, E60)+ROW()/100000,\"\")","v":""},"COVID-19 Research Project Tracker by UKCDR & GloPID-R","https://www.ukcdr.org.uk/funding-landscape/covid-19-research-project-tracker/?utm_source=UK+Collaborative+on+Development+Research+List&utm_campaign=3a984dcdee-EMAIL_CAMPAIGN_2018_06_28_10_51_COPY_01&utm_medium=email&utm_term=0_ebeb154498-3a984dcdee-708959857","UKCDR and GloPID-R have developed a live database of funded research projects on COVID-19 that will help funders and researchers identify gaps and opportunities and inform future research investments or coordination needs.","Global ","Yes","Yes","Yes","Yes","Yes","Yes","Yes","Yes","Yes","Yes","Yes","Yes","First category (at least one: having documents, epi info, or government responses)","Include","N/A","Other","Government and research funders","Public","No","No",0,0,0,0,0,0,0,0,0,0,0,"Yes","No","No","No","Yes","No","No","Yes","N/A","No","Yes","No","No","No",0,0,0,0,0,0,0,0,0,"No","No","No","13/05/2020","2020-03-06","1 Excel Sheet ","English","English",0,"No","No","No","Yes","No","No","Yes","No","N/A","Yes","No","Last update of the document","No"]
[null,"Irvine","",{"$f":"IFERROR(SEARCH('1. Searching Hubs'!$E$14, E61)+ROW()/100000,\"\")","v":""},"Covidbase","https://covidbase.com/7d1a6f8ef0b9434b87e68cbe05d8a9d6?v=1d23e01e433147edb0ee7b49474734eb","COVIDbase is a curated list of projects and resources related to COVID-19. The goal of COVIDbase is to link people who have skills to relevant projects and to inspire new ideas. We created COVIDbase after seeing a lot of various efforts happening in different places and wanted to see all the projects in one spot.","Global ","Yes","Yes","Yes","Yes","Yes","Yes","Yes","Yes","Yes","Yes","Yes","Yes","First category (at least one: having documents, epi info, or government responses)","Include","N/A","Other","BBMRI-ERIC","Private for profit","Yes","Yes",0,0,0,0,0,0,0,0,0,0,0,"Yes","Yes","Yes","Yes","Yes","No","Yes","No","N/A","Yes","Yes","Yes","Yes","Yes",0,0,0,0,0,0,0,0,0,"Yes","No","No","Unclear","30/04/2020","N/A","English","English","Economic development and growth","Yes","No","Yes","Yes","Yes","No","Yes","External links_Other hubs","N/A","Yes","No","None of them","No"]
["28/05/2020","Irvine","",{"$f":"IFERROR(SEARCH('1. Searching Hubs'!$E$14, E62)+ROW()/100000,\"\")","v":""},"Development aid","https://www.developmentaid.org/#!/grants/search?showAdvancedFilters=0&sectors=11&sectorsisstrict=0&locationisstrict=0&statuses=3&all=1&ownPosts=0","Access publicly available funding and grants to fight the COVID 19 Pandemic","Global ","Yes","Yes","Yes","Yes","Yes","Yes","Yes","Yes","Yes","Yes","Yes","Yes","Second category (at least two: having expert opinions or others)","Include","N/A","NGO","N/A","Private not for profit","No","No",0,0,0,0,0,0,0,0,0,0,0,"No","No","No","No","Yes","No","No",0,"N/A","No","No","No","No","No",0,0,0,0,0,0,0,0,0,"Yes","Yes","No","Unclear","28/05/2020","Unclear","English","English",0,"Yes","No","Yes","No","No","No","No","External links_Resource","N/A","Yes","No","Date of publication","No"]
["2020-08-06","Andile","",{"$f":"IFERROR(SEARCH('1. Searching Hubs'!$E$14, E63)+ROW()/100000,\"\")","v":""},"Dimensions COVID-19","https://dimensions.figshare.com/articles/Dimensions_COVID-19_publications_datasets_and_clinical_trials/11961063","This file contains all relevant publications, datasets and clinical trials from Dimensions that are related to COVID-19.","Global ","Yes","Yes","Yes","Yes","Yes","Yes","Yes","Yes","Yes","Yes","Yes","Yes","First category (at least one: having documents, epi info, or government responses)","Include","N/A","Other","Research grant database","Public",0,0,0,0,0,0,0,0,0,0,0,0,0,"No","No","No","No","Yes","No","No","No","N/A","No","Yes","No","No","No",0,0,0,0,0,0,0,0,0,"No","No","No","26/05/2020","2020-08-06","1 Excel sheet","English","English, French",0,"No","No","No","Yes","No","No","No","No","N/A","Yes","No","Last update of the document","No"]
["2020-05-06","Irvine","",{"$f":"IFERROR(SEARCH('1. Searching Hubs'!$E$14, E64)+ROW()/100000,\"\")","v":""},"Distiller SR : Evidence Summary ","https://www.evidencepartners.com/resources/covid-19-resources/#download-reference-sets","We are sharing the results of our DistillerSR AI-powered screening with the research community in the hopes that it will help accelerate the important work being done to combat COV","No geographical scope","Yes","Yes","Yes","Yes","Yes","Yes","Yes","Yes","Yes","Yes","Yes","Yes","First category (at least one: having documents, epi info, or government responses)","Include","N/A","NGO","N/A","Public",0,0,0,0,0,0,0,0,0,0,0,0,0,"Yes","Yes","Yes",0,"No","No","No","Yes","N/A","Yes","Yes","Yes","Yes","Yes",0,0,0,0,0,0,0,0,0,"Yes","No","No",43927,"2020-05-06","Unclear","English","English",0,"No","No","Yes","Yes","Yes","Yes","Yes","External links_Resource","N/A","Yes","No","Date of publication","No","65 min"]
["2020-04-06","Andile","",{"$f":"IFERROR(SEARCH('1. Searching Hubs'!$E$14, E65)+ROW()/100000,\"\")","v":""},"DynaMed","https://www.dynamed.com/condition/covid-19-novel-coronavirus#GUID-9F4FF2A8-42A9-4FE5-AF41-5A9274470A90","DynaMed's official COVID-19 information portal. The site has general information of the pandemic, epidemiology, management and guidelines. ","Global ","Yes","Yes","Yes","Yes","Yes","Yes","Yes","Yes","Yes","Yes","Yes","Yes","First category (at least one: having documents, epi info, or government responses)","Include","N/A","Other","Pharmaceuticals","Private for profit",0,0,0,0,0,0,0,0,0,0,0,0,0,"No","No","No","Yes","No","No","No","No","N/A","Yes","Yes","No","No","No",0,0,0,0,0,0,0,0,0,"No","No","No",43896,"2020-04-06","Unclear","English","Māori, New Zealand Sign Language, Arabic, Bengali, Simplified Chinese, Cook Islands Māori ,Dari, Farsi, Fijian, Hindi, Indonesian, Japanese, Kiribati, Korean, Niuean, Pashto, Punjabi, Rotuman, Samoan, Somali, Spanish, Tagalog, Thai, Tokelauan, Tongan, Tuvaluan, Urdu, Vietnamese ",0,"No","No","Yes","Yes","No","No","No","External links_Other hubs & Resources ","N/A","Yes","No","Date of publication","No","50 mins"]
["2020-09-06","Nkuli","",{"$f":"IFERROR(SEARCH('1. Searching Hubs'!$E$14, E66)+ROW()/100000,\"\")","v":""},"EBSCO Medical","https://covid-19.ebscomedical.com/","Peace Impact has assembled resources on Covid 19 Pandemic and how it affects Society, Justice and Peace","Global ","Yes","Yes","Yes","Yes","Yes","Yes","Yes","Yes","Yes","Yes","Yes","Yes","First category (at least one: having documents, epi info, or government responses)","Include","N/A","Other","Private company","Private for profit",0,0,0,0,0,0,0,0,0,0,0,0,0,"Yes","No","Yes","Yes","Yes","No","Yes","Yes","N/A","Yes","Yes","Yes","No","No",0,0,0,0,0,0,0,0,0,"Yes","Yes","Yes","Unclear","2020-09-06","Unclear","English","English, Dutch, French",0,"No","No","Yes","No","No","No","No","External links_Resource","FAQs","Yes","Yes","None of them","No","65 mins"]
["2020-01-06","Irvine",{"$f":"IFERROR(RANK(D67,D:D,1),\"\")","v":""},{"$f":"IFERROR(SEARCH('1. Searching Hubs'!$E$14, E67)+ROW()/100000,\"\")","v":""},"eCancer","https://ecancer.org/en/news/17527-covid-19-resources","In these difficult times it is more important than ever to keep information flowing about the latest research and we will keep an updated list on COVID-19 related resources available on this page.\nWe are prioritising video, news and journal content related to COVID-19. If you have something to share, please email news@ecancer.org.Thank you to everyone fighting this pandemic. We are truly grateful.","No geographical scope","Yes","Yes","Yes","Yes","Yes","Yes","Yes","Yes","Yes","Yes","Yes","Yes","Second category (at least two: having expert opinions or others)","Include","N/A","NGO","N/A","Private not for profit",0,0,0,0,0,0,0,0,0,0,0,0,0,"Yes","Yes","Yes","Yes","No","Yes","Yes","No","N/A","No","No","Yes","No","No",0,0,0,0,0,0,0,0,0,"Yes","Yes","Yes","30/05/2020","2020-01-05","Unclear","English","English",0,"No","No","Yes","Yes","No","No","Yes","External links_Resource","N/A","Yes","Yes","Date of publication","Yes"]
["2020-09-06","Nkuli","",{"$f":"IFERROR(SEARCH('1. Searching Hubs'!$E$14, E68)+ROW()/100000,\"\")","v":""},"Economic Relief Around the World","https://taxfoundation.org/coronavirus-country-by-country-responses/","Countries around the world continue to implement emergency tax measures to support their economies during the coronavirus (COVID-19) crisis.\nProviding tax relief to the people and companies that are most affected, until the emergency abates, is welcome. Countries should consider tax relief measures because the health issue is creating a substantial economic shock. Taxes that require regular payments will impact the liquidity of businesses and households.\nTherefore, governments should consider fiscal relief as a way of minimizing the economic impact from the health crisis.\nThe hub summarises country-specific tax interventions to mitigate the economic impact of COVID-19.","Global ","Yes","Yes","Yes","Yes","Yes","Yes","Yes","Yes","Yes","Yes","Yes","Yes","First category (at least one: having documents, epi info, or government responses)","Include","N/A","Other","Think tank","Public",0,0,0,0,0,0,0,0,0,0,0,0,0,"No","No","No","Yes","No","No","No","No","N/A","No","No","No","No","Yes",0,0,0,0,0,0,0,0,0,"N/A","N/A","N/A",43987,"2020-09-06","1 webpage","English","English",0,"Yes","No","Yes","No","No","No","No","External links_Resource","N/A","Yes","No","Last update of the document","No","33 mins"]
["28/05/2020","Andile","",{"$f":"IFERROR(SEARCH('1. Searching Hubs'!$E$14, E69)+ROW()/100000,\"\")","v":""},"Economics for Inclusive Prosperity (Econflip)","https://econfip.org/","A network of academic economists committed to an inclusive economy and society.\nOur members develop and discuss policy ideas based on sound scholarship. Economics for inclusive prosperity is producing policy briefs related to the corona virus pandemic. ","Global ","Yes","Yes","Yes","Yes","Yes","Yes","Yes","Yes","Yes","Yes","Yes","Yes","First category (at least one: having documents, epi info, or government responses)","Include","N/A","Other","Network of academic economists","Public","No","No",0,0,0,0,0,0,0,0,0,0,0,"No","No","No","No","No","No","No",0,"N/A","No","No","No","No","No",0,0,0,0,0,0,0,0,0,"N/A","No","No","Unclear","28/05/2020","18 Policy briefs","English","English",0,"No","No","Yes","Yes","No","No","No","No","N/A","Yes","No","Date of publication","No"]
["2020-04-06","Andile","",{"$f":"IFERROR(SEARCH('1. Searching Hubs'!$E$14, E70)+ROW()/100000,\"\")","v":""},"ECRI Guidelines Trust COVID-19 Resource Center","https://www.ecri.org/coronavirus-covid-19-outbreak-preparedness-center","Visit this COVID-19 Resource Center often for the latest information and life-saving resources. ECRI stands ready to assist your organization in the battle against COVID-19, whether or not you are a current member.","Global ","Yes","Yes","Yes","Yes","Yes","Yes","Yes","Yes","Yes","Yes","Yes","Yes","First category (at least one: having documents, epi info, or government responses)","Include","N/A","NGO","N/A","Public",0,0,0,0,0,0,0,0,0,0,0,0,0,"No","No","No","No","No","No","No","No","N/A","Yes","Yes","No","No","No",0,0,0,0,0,0,0,0,0,"No","No","No",43836,"2020-04-06","Unclear","English","English",0,"No","No","Yes","Yes","No","No","No","External links_Other hubs","N/A","Yes","Yes","Date of publication","No","50mins"]
["2020-09-06","Nkuli","",{"$f":"IFERROR(SEARCH('1. Searching Hubs'!$E$14, E71)+ROW()/100000,\"\")","v":""},"Education Endowment Foundation","https://educationendowmentfoundation.org.uk/covid-19-resources/","In response to the unprecedented closure of schools to most pupils, the EEF has produced a set of resources designed to be used by schools and parents/carers to support home learning. These are all based on the evidence-based recommendations of our Guidance Reports.\n\nFor schools, there are helpful planning prompts and other practical tools. There are also useful resources for schools to share with parents who are looking to support their children’s learning - from establishing home learning routines to shared reading help, to handy tips for supporting maths in the home.","No geographical scope","N/A","N/A","N/A","N/A","N/A","N/A","N/A","N/A","N/A","N/A","Yes","Yes","First category (at least one: having documents, epi info, or government responses)","Include","N/A","Other","N/A","Public",0,0,0,0,0,0,0,0,0,0,0,0,0,"No","No","Yes","No","No","No","No","No","N/A","No","No","No","Yes","No",0,0,0,0,0,0,0,0,0,"No","Yes","No",43867,"2020-09-06","29: 22 guidance, 2 videos, 5 blog posts","English","English",0,"Yes","No","No","Yes","Yes","No","No","External links_Resource","Blogs","Yes","No","Last update of the document","No","43 mins"]
["28/05/2020","Andile","",{"$f":"IFERROR(SEARCH('1. Searching Hubs'!$E$14, E72)+ROW()/100000,\"\")","v":""},"Elrha","https://www.elrha.org/funding-support/covid-19/","A selection of resources to support humanitarian innovators and researchers responding to Coronavirus (COVID-19).","Global ","Yes","Yes","Yes","Yes","Yes","Yes","Yes","Yes","Yes","Yes","Yes","Yes","First category (at least one: having documents, epi info, or government responses)","Include","N/A","International Organization","N/A","Public","Yes","No",0,0,0,0,0,0,0,0,0,0,0,"No","No","No","No","Yes","Yes","No",0,"N/A","No","No","No","No","No",0,0,0,0,0,0,0,0,0,"No","Yes","Yes","Unclear","28/05/2020","5: 1 article, 2 Reports, 2 Tools","English","English",0,"No","No","Yes","Yes","No","No","No","External links_Other hubs","N/A","Yes","No","Date of publication","No"]
["2020-04-06","Irvine","",{"$f":"IFERROR(SEARCH('1. Searching Hubs'!$E$14, E73)+ROW()/100000,\"\")","v":""},"Elsevier Novel Coronavirus Information Center","https://www.elsevier.com/connect/coronavirus-information-center","Welcome to Elsevier's Novel Coronavirus Information Center. Here you will find expert, curated information for the research and health community on SARS-CoV-2 (the novel coronavirus) and COVID-19 (the disease).\n\nAll resources are free to access and include guidelines for clinicians and patients.","Global ","Yes",0,"Yes",0,"Yes","Yes","Yes","Yes","Yes","Yes","Yes","Yes","Second category (at least two: having expert opinions or others)","Include","N/A","NGO","N/A","Private not for profit",0,0,0,0,0,0,0,0,0,0,0,0,0,"Yes","Yes","Yes","No","No","Yes","Yes","No","N/A","Yes","Yes","Yes","Yes","No",0,0,0,0,0,0,0,0,0,"Yes","Yes","No","Unclear","2020-04-06","28000 + articles","English","English, Arabic & Chinese",0,"No","No","Yes","Yes","Yes","Yes","Yes","External links_Resource","N/A","Yes","No","Date of publication","Yes"]
["27/05/2020","Promise","",{"$f":"IFERROR(SEARCH('1. Searching Hubs'!$E$14, E74)+ROW()/100000,\"\")","v":""},"EPI-WIN (WHO Information for Network for Epidemics)","https://www.who.int/teams/risk-communication","EPI-WIN seeks to give everyone access to timely, accurate, and easy-to-understand advice and information from trusted sources on public health events and outbreaks: currently the COVID-19 public health emergency.","Global ","Yes","Yes","Yes","Yes","Yes","Yes","Yes","Yes","Yes","Yes","Yes","Yes","First category (at least one: having documents, epi info, or government responses)","Include","N/A","International Organization","N/A","Public","No","Yes",0,0,0,0,0,0,0,0,0,0,0,"No","No","No","No","No","No","No",0,"N/A","No","Yes","No","No","No",0,0,0,0,0,0,0,0,0,"No","No","No","Unclear","27/05/2020","9 Guidance documents, 27 updates on  coded topics to manage the pandemic,23 myth busters(visual tools), 4 videos, 4 posters","English","English",0,"No","No","Yes","Yes","Yes","No","Yes","No","N/A","Yes","No","Date of publication","No","35 mins"]
["28/05/2020","Andile","",{"$f":"IFERROR(SEARCH('1. Searching Hubs'!$E$14, E75)+ROW()/100000,\"\")","v":""},"EPPI Mega evidence map","http://eppi.ioe.ac.uk/COVID19_MAP/covid_map_v9.html","This map consists of studies on COVID-19, identified in MEDLINE and Embase, and published in 2019 or later.","No geographical scope","Yes","Yes","Yes","Yes","Yes","Yes","Yes","Yes","Yes","Yes","Yes","Yes","First category (at least one: having documents, epi info, or government responses)","Include","N/A","Academic institution","N/A","Public","Yes","No",0,0,0,0,0,0,0,0,0,0,0,"No","No","No","No","No","Yes","No",0,"N/A","No","Yes","Yes","Yes","Yes",0,0,0,0,0,0,0,0,0,"N/A","No","No","Unclear","28/05/2020","2462 Studies","English","English",0,"No","No","No","Yes","No","No","Yes","No","N/A","Yes","No","Date of publication","No"]
["2020-08-06","Nkuli","",{"$f":"IFERROR(SEARCH('1. Searching Hubs'!$E$14, E76)+ROW()/100000,\"\")","v":""},"ETUC Briefing Notes on national measures","https://www.etuc.org/en/publication/covid-19-watch-etuc-briefing-notes","The ETUC launches a series of ‘COVID-19 Watch’ briefing notes.\n\nThey focus on developments providing critical information on the impacts of COVID-19 on labour markets, workers and citizens across Europe.\n\nThese Briefing Notes are produced by the ETUC with the support of the ETUI and ETUC affiliated organisations. While every effort has been made to make them accurate at the date of publication, new agreements and measures are being announced daily. The current briefings will be updated periodically, and new ones produced on other topics.","Regional","No","No","Yes","No","No","No","No","Yes","Yes","Yes","Yes","Yes","First category (at least one: having documents, epi info, or government responses)","Include","N/A","NGO","N/A","Public",0,0,0,0,0,0,0,0,0,0,0,0,0,"No","No","No","Yes","No","No","No","No","N/A","No","No","Yes","Yes","Yes",0,0,0,0,0,0,0,0,0,"No","No","No","Unclear","2020-08-06","26 briefing notes","English","English",0,"Yes","No","No","Yes","No","No","No","No","N/A","Yes","No","Date of publication","No","45 mins"]
["2020-03-06","Irvine","",{"$f":"IFERROR(SEARCH('1. Searching Hubs'!$E$14, E77)+ROW()/100000,\"\")","v":""},"EUI Covid Knowledge Hub","https://cadmus.eui.eu/handle/1814/66672","The EUI Library has created this new special collection in Cadmus entitled ‘COVID-19 Pandemic’. It belongs to a new community ‘EUI Public Commentary’.This is part of our joint efforts to make research more accessible to society. The collection can contain any contribution by EUI members on COVID-19.\n","Regional","No","No","Yes","No","No","No","No","No","No","Yes","Yes","Yes","Second category (at least two: having expert opinions or others)","Include","N/A","Academic institution","Journal","Public",0,0,0,0,0,0,0,0,0,0,0,0,0,"Yes","Yes","No","No","No","Yes","No",0,"N/A","Yes","Yes","Yes","Yes","Yes",0,0,0,0,0,0,0,0,0,"Yes","N/A","N/A","Unclear","2020-03-06","Unclear","English","English",0,"Yes","No","Yes","Yes","No","No","No","No","N/A","Yes","No","Date of publication","No"]
["29/05/2020","Andile","",{"$f":"IFERROR(SEARCH('1. Searching Hubs'!$E$14, E78)+ROW()/100000,\"\")","v":""},"European Research Area (ERA) Corona Platform","https://ec.europa.eu/info/funding-tenders/opportunities/portal/screen/covid-19","The platform is a one-stop shop providing comprehensive information about funding opportunities in relation to Coronavirus at European Union and national level.\n\nIt offers continuously updated information about Horizon 2020 call deadline extensions, specific or related to Coronavirus funded and ongoing projects, FAQs and other useful links. In cooperation with country correspondents, the platform maintains a dedicated section for national activities, funding opportunities, initiatives and projects in the Member States and other European countries.","Regional","No","No","Yes","No","No","No","No","No","No","Yes","Yes","Yes","First category (at least one: having documents, epi info, or government responses)","Include","N/A","Other","Regional Organisation","Public",0,0,0,0,0,0,0,0,0,0,0,0,0,"No","No","No","No","Yes","No","No","Yes","N/A","No","No","No","Yes","Yes",0,0,0,0,0,0,0,0,0,"No","No","No",43896,"2020-03-06","Unclear","English","English",0,"No","No","Yes","Yes","No","No","No","External links_Other hubs","N/A","Yes","No","Date of publication","No"]
["2020-05-06","Andile","",{"$f":"IFERROR(SEARCH('1. Searching Hubs'!$E$14, E79)+ROW()/100000,\"\")","v":""},"European Respiratory Society","https://www.ersnet.org/covid-19-guidelines-and-recommendations-directory","This page contains an international directory of guidelines and best practice recommendations documents for the care and management of COVID-19. The documents have been prepared by health professionals from the European Respiratory Society (ERS) partner societies and are intended to help share COVID-19 expertise with colleagues around the world. ERS is not responsible for the accuracy of documents prepared by external sources.","Global ","Yes","Yes","Yes","Yes","Yes","Yes","Yes","Yes","Yes","Yes","Yes","Yes","First category (at least one: having documents, epi info, or government responses)","Include","N/A","Other","Publisher","Private not for profit",0,0,0,0,0,0,0,0,0,0,0,0,0,"No","No","No","No","No","No","No","No","N/A","No","Yes","No","No","No",0,0,0,0,0,0,0,0,0,"No","Yes","Yes","Unclear","2020-05-06","90 Guidelines","English","English, Spanish, German, Portuguese, Greek, Italian, Lithuanian, Norweigian, Turkish, Russian ",0,"No","No","No","Yes","No","No","No","No","N/A","Yes","No","Date of publication","No","50mins"]
["2020-08-06","Irvine","",{"$f":"IFERROR(SEARCH('1. Searching Hubs'!$E$14, E80)+ROW()/100000,\"\")","v":""},"European Society of Intensive Care Medicine","https://www.esicm.org/resources/coronavirus-public-health-emergency/","With the outbreak now present in Europe, and likely to affect many more areas over the coming months, we at ESICM have decided to help ICU professionals around the world by providing information that may make a vital contribution in the battle to contain the infection, treat the patients and to protect the frontline workers.","Global ","Yes","Yes","Yes","Yes","Yes","Yes","Yes","Yes","Yes","Yes","Yes","Yes","First category (at least one: having documents, epi info, or government responses)","Include","N/A","International Organization","N/A","Public",0,0,0,0,0,0,0,0,0,0,0,0,0,"Yes","Yes","Yes","No","No","No","Yes","No","N/A","No","Yes","Yes","Yes","No",0,0,0,0,0,0,0,0,0,"No","Yes","Yes","Unclear","2020-08-06","Unclear","English","English",0,"No","No","Yes","Yes","Yes","Yes","Yes","External links_Resource","N/A","Yes","Yes","Date of publication","No"]
[null,"Andile","",{"$f":"IFERROR(SEARCH('1. Searching Hubs'!$E$14, E81)+ROW()/100000,\"\")","v":""},"Evidence aid","https://www.evidenceaid.org/coronavirus-covid-19-evidence-collection/","Evidence Aid is preparing summaries of relevant research, which are available below in English with links to translations in other languages. A ‘NEW’ flag will appear on each review as it is added and remain for 48-72 hours.\n\nThis collection includes summaries of systematic reviews that might be relevant to the direct impact of COVID-19 (including reviews of emerging research, as well as existing reviews of relevant interventions) on health and other outcomes, the impact of the COVID-19 response on other conditions, and issues to consider for the recovery period after COVID-19.","No geographical scope","N/A","N/A","N/A","N/A","N/A","N/A","N/A","N/A","N/A","N/A","Yes","Yes","First category (at least one: having documents, epi info, or government responses)","Include","N/A","NGO","N/A","Public","Yes","No",0,0,0,0,0,0,0,0,0,0,0,"No","No","No","No","No","No","No",0,"N/A","No","Yes","No","No","No",0,0,0,0,0,0,0,0,0,"No","No","No","14/05/2020","26/05/2020","Unclear","English","English, Arabic, French, Spanish, Portuguese, Chinese Simplified, Chinese traditional, ",0,"No","No","No","Yes","No","No","No","External links_Other hubs","N/A","Yes","No","Date of publication","No"]
["2020-08-06","Promise","",{"$f":"IFERROR(SEARCH('1. Searching Hubs'!$E$14, E82)+ROW()/100000,\"\")","v":""},"EY COVID-19 Global Trade Considerations tracker ","https://www.ey.com/en_lu/tax/how-covid-19-is-affecting-customs-and-excise-taxes-a-trade-track","This regularly updated tracker monitors how governments are changing global trade rules in response to the COVID-19 pandemic.\nThe regularly updated EY COVID-19 Global Trade Considerations tracker helps you monitor rapidly emerging government trade policy responses to COVID-19. Governments around the world are changing trade policies to eliminate import tariffs on COVID-19 critical goods such as personal protective equipment (PPE), ventilators and soap, introducing export restrictions of similar goods, and relaxing regulatory requirements to help business respond quicker and more efficiently.","Global ","Yes","No","Yes","Yes","No","No","Yes","Yes","Yes","Yes","Yes","Yes","First category (at least one: having documents, epi info, or government responses)","Include","N/A","Other","Private compacy: Accounting","Private for profit",0,0,0,0,0,0,0,0,0,0,0,0,0,"No","No","No","Yes","No","No","No","No","N/A","No","No","No","No","No",0,0,0,0,0,0,0,0,0,"N/A","N/A","N/A","23/04/2020","2020-08-06","1 government responses tracker document","English","English",0,"Yes","No","No","Yes","No","No","No","No","N/A","Yes","No","Date of publication","No","25 mins"]
["28/05/2020","Irvine","",{"$f":"IFERROR(SEARCH('1. Searching Hubs'!$E$14, E83)+ROW()/100000,\"\")","v":""},"Fasken Covid 19 Knowledge","https://www.fasken.com/en/knowledge/covid-19","Like you, we are continuously monitoring information from official health organizations and planning and adjusting for business continuity in changing scenarios. To help our clients and business partners navigate this situation, we are centralizing all our COVID-19 related materials here into one information hub. ","National","No","No","No","Yes","No","No","No","No","No","Yes","Yes","Yes","Second category (at least two: having expert opinions or others)","Include","N/A","NGO","N/A","Private for profit","No","Yes",0,0,0,0,0,0,0,0,0,0,0,"No","No","No","No","No","No","Yes",0,"N/A","No","No","No","Yes","Yes",0,0,0,0,0,0,0,0,0,"Yes","Yes","No","Unclear","28/05/2020","Unclear","English","English",0,"No","No","Yes","No","No","No","No","External links_Resource","N/A","Yes","Yes","Date of publication","No"]
["2020-04-06","Promise","",{"$f":"IFERROR(SEARCH('1. Searching Hubs'!$E$14, E84)+ROW()/100000,\"\")","v":""},"Frontiers Coronavirus Knowledge Hub","https://coronavirus.frontiersin.org/","The Frontiers Coronavirus Knowledge Hub provides an up-to-date source of trusted information and analysis on COVID-19 and coronaviruses, including the latest research articles, information, and commentary from our world-class scientific community.\n\nFrontiers has also waived Article Processing Charges (APCs) until 31 July 2020 for manuscripts submitted in response to the COVID-19 pandemic and established a priority peer-review process. This will further help ensure robust scientific research becomes openly available as soon as possible, for other researchers to build on and to enable evidence-based and factual decision-making for public authorities worldwide.","No geographical scope","N/A","N/A","N/A","N/A","N/A","N/A","N/A","N/A","N/A","N/A","Yes","Yes","Second category (at least two: having expert opinions or others)","Include","N/A","Academic institution","N/A","Public",0,0,0,0,0,0,0,0,0,0,0,0,0,"No","Yes","Yes","Yes","Yes","No","No","No","N/A","No","Yes","Yes","Yes","Yes",0,0,0,0,0,0,0,0,0,"No","No","No","Unclear","2020-04-06","211 research articles, 4 Webinars, 23 expert commentaries","English","English",0,"Yes","No","Yes","Yes","Yes","No",0,"No","N/A","Yes","No","Date of publication","No","70 mins"]
["2020-05-06","Andile","",{"$f":"IFERROR(SEARCH('1. Searching Hubs'!$E$14, E85)+ROW()/100000,\"\")","v":""},"George Institute","https://www.georgeinstitute.org/covid-19","The George Institute for Global Health is a global medical research institute that focuses on non-communicable diseases and injury.  With centres in four countries (Australia, China, India and the UK) and offices and staff in many others, we are monitoring the evolving COVID-19 situation. ","Global ","Yes","Yes","Yes","Yes","Yes","Yes","Yes","Yes","Yes","Yes","Yes","Yes","First category (at least one: having documents, epi info, or government responses)","Include","N/A","International Organization","N/A","Public",0,0,0,0,0,0,0,0,0,0,0,0,0,"No","No","No","No","No","No","No","No","N/A","No","Yes","No","No","No",0,0,0,0,0,0,0,0,0,"No","No","No","Unclear","2020-05-06","31:4 Related Publications, 2 Related resources, 25 News and opinions","English","English",0,"No","No","Yes","Yes","Yes","No","No","No","N/A","Yes","Yes","Date of publication","No","45 mins"]
["29/05/2020","Promise","",{"$f":"IFERROR(SEARCH('1. Searching Hubs'!$E$14, E86)+ROW()/100000,\"\")","v":""},"Ghana government","https://ghcovid19-statsghana.hub.arcgis.com/","A government hub hosted by Statistical service Ghana that tracks national cases of pandemic at regional(provincial) and district level, analysis of morbidity patterns and a business tracker","National","Yes","No","No","No","No","No","No","Yes","No","No","Yes","Yes","First category (at least one: having documents, epi info, or government responses)","Include","N/A","Governments and public institutions","N/A","Public",0,0,0,0,0,0,0,0,0,0,0,0,0,"No","No","No","No","No","No","No",0,"N/A","Yes","No","No","No","Yes",0,0,0,0,0,0,0,0,0,"No","No","Yes","29/05/2020","29/05/2020","1 map of cases, 2 mobility analysis documents and a business tracker survey","English","English",0,"No","No","No","Yes","No","No","Yes","No","N/A","Yes","No","None of them","No","45 mins"]
["2020-08-06","Andile","",{"$f":"IFERROR(SEARCH('1. Searching Hubs'!$E$14, E87)+ROW()/100000,\"\")","v":""},"Global Health 5050 COVID-19 sex-disaggregated data tracker","https://globalhealth5050.org/covid19/","Tracking differences in COVID-19 illness and death among women and men\nFrom the first reports of the novel coronavirus, COVID-19, there has been consistent evidence of a gendered impact on health outcomes.","Global ","Yes","Yes","Yes","Yes","Yes","Yes","Yes","Yes","Yes","Yes","Yes","Yes","First category (at least one: having documents, epi info, or government responses)","Include","N/A","Academic institution","N/A","Public",0,0,0,0,0,0,0,0,0,0,0,0,0,"No","No","No","No","No","No","No","No","N/A","Yes","No","No","No","No",0,0,0,0,0,0,0,0,0,"Yes","Yes","Yes",43927,"2020-08-06","Unclear","English","English",0,"No","No","Yes","No","No","No","Yes","No","N/A","Yes","No","None of them","No"]
["2020-09-06","Promise","",{"$f":"IFERROR(SEARCH('1. Searching Hubs'!$E$14, E88)+ROW()/100000,\"\")","v":""},"Global Health Network Covid-19 Research Implementation Hub","https://coronavirus.tghn.org/","Implementing research within this pandemic is critical, both for understanding how to combat this disease, but also to learn for future outbreaks. Different questions need to be asked in different settings and we need all types of studies to be undertaken. Click on each topic below to find guidance, open access protocols, tools and resources; all aiming to support rapid research implementation in every type of healthcare setting, and whatever your previous experience.   ","Global ","Yes","Yes","Yes","Yes","Yes","Yes","Yes","Yes","Yes","Yes","Yes","Yes","First category (at least one: having documents, epi info, or government responses)","Include","N/A","Other","Global Network ","Private not for profit",0,0,0,0,0,0,0,0,0,0,0,0,0,"No","No","Yes","No","No","No","Yes","No","N/A","No","No","No","No","No",0,0,0,0,0,0,0,0,0,"No","Yes","No","Unclear","2020-09-06","Unclear","English","Engliash ans training resorurces are available in Albanian , Arabic ,Bengali , Chinese , English , French, Indonesian, Macedonian, Portuguese , Russian , Spanish ",0,"No","No","Yes","Yes","Yes","No","No","External links_Other hubs & Resources ","N/A","Yes","No","None of them","No"]
["2020-09-06","Andile","",{"$f":"IFERROR(SEARCH('1. Searching Hubs'!$E$14, E89)+ROW()/100000,\"\")","v":""},"Global overview of COVID-19: Impact on elections","https://www.idea.int/news-media/multimedia-reports/global-overview-covid-19-impact-elections","Elections postponed due to the outbreak of COVID-19 (coronavirus disease) span the globe. Here is a list of the current elections schedule and plans, as reported by electoral management bodies and news media.","Global ","Yes","Yes","Yes","Yes","Yes","Yes","Yes","Yes","Yes","Yes","Yes","Yes","First category (at least one: having documents, epi info, or government responses)","Include","N/A","International Organization","N/A","Public",0,0,0,0,0,0,0,0,0,0,0,0,0,"Yes","No","No","Yes","No","No","No","No","N/A","No","No","No","No","No",0,0,0,0,0,0,0,0,0,"No","No","No",44049,"2020-09-06","Unclear","English, Spanish","English, Spanish, Rusian, Indonesian, Arabic",0,"Yes","No","Yes","Yes","No","No","Yes","No","N/A","Yes","No","Date of publication","No"]
["2020-09-06","Nkuli","",{"$f":"IFERROR(SEARCH('1. Searching Hubs'!$E$14, E90)+ROW()/100000,\"\")","v":""},"Global Policy Responses – Developed Markets ","https://www.iif.com/Portals/0/Files/Databases/COVID-19_responses.pdf?ver=2020-04-24-173749-083","The hub logs fiscla and monetary measures that are being undertaken by developed economies. The responses are logged on a national and affiliatory basis with institution such as the IMF and country groups such as the G20 jointly taking decisions/implementing measures.","Regional","Yes","Yes","Yes","Yes","No","Yes","Yes","Yes","Yes","Yes","Yes","Yes","First category (at least one: having documents, epi info, or government responses)","Include","N/A","International Organization","N/A","Public",0,0,0,0,0,0,0,0,0,0,0,0,0,"No","No","No","Yes","No","No","No","No","N/A","No","No","No","No","Yes",0,0,0,0,0,0,0,0,0,"N/A","N/A","N/A",43957,"2020-09-05","1 PDF document of policy responses","English","English",0,"Yes","No","No","Yes","No","No","No","External links_Resource","N/A","Yes","No","Last update of the document","No","49 mins"]
["2020-09-06","Nkuli","",{"$f":"IFERROR(SEARCH('1. Searching Hubs'!$E$14, E91)+ROW()/100000,\"\")","v":""},"Google Covid-19 Community Mobility Reports","https://www.google.com/covid19/mobility/","As global communities respond to COVID-19, we've heard from public health officials that the same type of aggregated, anonymized insights we use in products such as Google Maps could be helpful as they make critical decisions to combat COVID-19.\n\nThese Community Mobility Reports aim to provide insights into what has changed in response to policies aimed at combating COVID-19. The reports chart movement trends over time by geography, across different categories of places such as retail and recreation, groceries and pharmacies, parks, transit stations, workplaces, and residential.","Global ","Yes","Yes","Yes","Yes","Yes","Yes","Yes","Yes","Yes","Yes","Yes","No","First category (at least one: having documents, epi info, or government responses)","Include","N/A","Other","Private company","Private for profit",0,0,0,0,0,0,0,0,0,0,0,0,0,"Yes","No","No","No","No","No","No","No","N/A","No","No","No","Yes","No",0,0,0,0,0,0,0,0,0,"Yes","Yes","Yes","Unclear","2020-09-06","Unclear","English","English",0,"Yes","No","No","Yes","No","No","Yes","No","N/A","Yes","No","Date of publication","No","41 mins"]
["2020-01-06","Andile","",{"$f":"IFERROR(SEARCH('1. Searching Hubs'!$E$14, E92)+ROW()/100000,\"\")","v":""},"Government of Canada","https://www.canada.ca/en/public-health/services/diseases/coronavirus-disease-covid-19.html","The Government of Canada's official Coronavirus (Covid-19) information portal.","National","No","No","No","Yes","No","No","No","No","No","Yes","Yes","Yes","First category (at least one: having documents, epi info, or government responses)","Include","N/A","Governments and public institutions","N/A","Public",0,0,0,0,0,0,0,0,0,0,0,0,0,"No","No","No","Yes","No","No","Yes",0,"N/A","Yes","No","No","No","No",0,0,0,0,0,0,0,0,0,"No","No","No","28/05/2020","2020-01-06","Unclear","English","English",0,"No","No","Yes","Yes","Yes","No","Yes","No","N/A","Yes","No","None of them","No"]
["2020-08-06","Nkuli","",{"$f":"IFERROR(SEARCH('1. Searching Hubs'!$E$14, E93)+ROW()/100000,\"\")","v":""},"GovPredict Federal, State, and Local Responses to the Coronavirus\nFocus","https://www.govpredict.com/corona-virus-resource-center","This hub tracks and compares what governments are doing at the city, county, state, and federal level to combat the coronavirus and COVID-19.","National","No","No","No","Yes","No","No","No","No","No","Yes","Yes","Yes","First category (at least one: having documents, epi info, or government responses)","Include","N/A","NGO","N/A","Public",0,0,0,0,0,0,0,0,0,0,0,0,0,"No","No","No","Yes","No","No","No","No","N/A","No","No","No","No","No",0,0,0,0,0,0,0,0,0,"N/A","N/A","N/A",44049,"2020-08-06","Unclear","English","English",0,"Yes","No","No","Yes","No","No","No","External links_Resource","N/A","Yes","No","None of them","No","65 mins"]
["2020-04-06","Andile","",{"$f":"IFERROR(SEARCH('1. Searching Hubs'!$E$14, E94)+ROW()/100000,\"\")","v":""},"Guidelines Network International","https://g-i-n.net/library/covid-19","We aim to make this a comprehensive source of information for guideline developers. The page contains links to material from our member organisations, our partners and other trusted sources and is being constantly updated.","Global ","Yes","Yes","Yes","Yes","Yes","Yes","Yes","Yes","Yes","Yes","Yes","Yes","First category (at least one: having documents, epi info, or government responses)","Include","N/A","International Organization","N/A","Public",0,0,0,0,0,0,0,0,0,0,0,0,0,"No","No","No","No","No","No","No","No","N/A","No","No","No","No","No",0,0,0,0,0,0,0,0,0,"No","No","No","Unclear","2020-04-06","101 External links: 35 Evidence resources, 66 Guideline resources","English","English",0,"No","No","No","No","No","No","No","External links_Other hubs","N/A","Yes","No","None of them","No","45 mins"]
["2020-05-06","Andile","",{"$f":"IFERROR(SEARCH('1. Searching Hubs'!$E$14, E95)+ROW()/100000,\"\")","v":""},"Gulag Echoes project","https://blogs.helsinki.fi/gulagechoes/2020/04/01/coronavirus-in-prisons-a-global-perspective-tracking-policy-responses-releases-and-riots/#more-311","This is the first post in a series of reports on coronavirus in prisons by researchers on the Gulag Echoes research page. In the post, Olga Zeveleva takes a look at how the coronavirus crisis is playing out in the prison systems of different countries.","Global ","Yes","Yes","Yes","Yes","Yes","Yes","Yes","Yes","Yes","Yes","Yes","Yes","First category (at least one: having documents, epi info, or government responses)","Include","N/A","Academic institution","N/A","Public",0,0,0,0,0,0,0,0,0,0,0,0,0,"Yes","No","No","Yes","No","No","No","No","N/A","No","No","No","No","No",0,0,0,0,0,0,0,0,0,"No","No","No",43834,"2020-05-06","Unclear","English","English",0,"Yes","No","Yes","No","No","No","Yes","No","N/A","Yes","No","None of them","No"]
["2020-04-06","Irvine","",{"$f":"IFERROR(SEARCH('1. Searching Hubs'!$E$14, E96)+ROW()/100000,\"\")","v":""},"Havard Dataverse","https://dataverse.harvard.edu/dataverse/Covid19researchandevaluation","Partnering with national health ministries and other government agencies in sub-Saharan Africa, South Asia, and Latin America, Population Council global and in-country scientists are conducting COVID-19 public health and social science research to produce relevant and timely evidence to support policymakers in controlling the spread of coronavirus, evaluating the effectiveness of prevention and mitigation measures, and assessing longer-term health, social and economic effects of the pandemic.","Global ","Yes","Yes","Yes","Yes","Yes","Yes","Yes","Yes","Yes","Yes","Yes","Yes","First category (at least one: having documents, epi info, or government responses)","Include","N/A","Academic institution","N/A","Private not for profit",0,0,0,0,0,0,0,0,0,0,0,0,0,"Yes","No","No","No","No","Yes","No","No","N/A","Yes","Yes","Yes","Yes","Yes",0,0,0,0,0,0,0,0,0,"Yes","Yes","Yes","28/05/2020","2020-04-06","Unclear","English","English",0,"No","No","Yes","Yes","No","No","No","External links_Resource","N/A","Yes","No","Date of publication","Yes"]
["2020-08-06","Irvine","",{"$f":"IFERROR(SEARCH('1. Searching Hubs'!$E$14, E97)+ROW()/100000,\"\")","v":""},"Health Data Research UK","https://www.hdruk.ac.uk/covid-19/","Our strategy in responding to the COVID-19 pandemic is to mobilise talent and partnerships across the UK to:Co-ordinate and connect national data science driven research efforts related to COVID-19\nAccelerate access to UK-wide priority data relevant to COVID-19 for research\nLeverage the best of the UK’s health data science capability to address the wider impact of the COVID-19 pandemic, supporting vulnerable groups that will be hardest hit","Global ","Yes","Yes","Yes","Yes","Yes","Yes","Yes","Yes","Yes","Yes","Yes","Yes","First category (at least one: having documents, epi info, or government responses)","Include","N/A","NGO","N/A","Public",0,0,0,0,0,0,0,0,0,0,0,0,0,"Yes","Yes","Yes","No","No","Yes","Yes","No","N/A","Yes","Yes","Yes","Yes","Yes",0,0,0,0,0,0,0,0,0,"Yes","Yes","Yes","Unclear","2020-08-06","1 Risk calculator, 1 matchmaker, 1 Q&A facility",0,"English",0,"No","No","Yes","Yes","Yes","Yes","Yes","External links_Resource","N/A","Yes","No","Date of publication","No"]
["29/05/2020","Promise","",{"$f":"IFERROR(SEARCH('1. Searching Hubs'!$E$14, E98)+ROW()/100000,\"\")","v":""},"Health Economics, Policy and Law blog series on country responses","https://www.cambridge.org/core/blog/tag/country-responses-to-the-covid19-pandemic/","A blog series of country Responses to the Covid19 Pandemic","Global ","No","Yes","Yes","Yes","Yes","Yes","No","No","Yes","Yes","Yes","Yes","First category (at least one: having documents, epi info, or government responses)","Include","N/A","Academic institution","N/A","Public",0,0,0,0,0,0,0,0,0,0,0,0,0,"No","No","No","Yes","No","No","No",0,"N/A","No","No","No","No","No",0,0,0,0,0,0,0,0,0,"N/A","N/A","N/A","21/05/2020","29/05/2020","51 country responses","English","English",0,"Yes","No","Yes","No","No","No","No","No","N/A","Yes","No","Last update of the document","No","30 mins"]
["2020-03-06","Andile ","",{"$f":"IFERROR(SEARCH('1. Searching Hubs'!$E$14, E99)+ROW()/100000,\"\")","v":""},"Health Information and Quality Authority","https://www.hiqa.ie/reports-and-publications/health-technology-assessments?tid_1=All&field_hta_topics_target_id=112","HIQA’s HTA team has COVID-19 publications, aimed at supporting the National Public Health Emergency Team in its response to COVID-19.","National","Yes","Yes","Yes","Yes","Yes","Yes","Yes","Yes","Yes","Yes","Yes","Yes","First category (at least one: having documents, epi info, or government responses)","Include","N/A","Other","Publisher","Public",0,0,0,0,0,0,0,0,0,0,0,0,0,"No","No","No","Yes","No","No","No",0,"N/A","No","Yes","No","No","No",0,0,0,0,0,0,0,0,0,"No","No","No","Unclear","2020-03-06","15 Publications ","English","English",0,"No","No","No","Yes","No","No","No","No","N/A","Yes","No","Date of publication","No"]
["28/05/2020","Irvine","",{"$f":"IFERROR(SEARCH('1. Searching Hubs'!$E$14, E100)+ROW()/100000,\"\")","v":""},"Hewlett Foundation","https://hewlett.org/covid-19-nonprofit-resources/","We are compiling resources that may be helpful to our nonprofit partners during this difficult time. Below you will find funding opportunities, information on how to navigate federal benefits, non-financial guidance, and summaries of relevant economic relief legislation. Resources that are focused outside the U.S. are marked with a double asterisk (**). We will update this list as new information becomes available. Please send suggestions for resources to include to covidresources@hewlett.org.","Global ","Yes","Yes","Yes","Yes","Yes","Yes","Yes","Yes","Yes","Yes","Yes","Yes","First category (at least one: having documents, epi info, or government responses)","Include","N/A","NGO","N/A","Private not for profit","No","Yes",0,0,0,0,0,0,0,0,0,0,0,"No","No","Yes","No","Yes","No","No",0,"N/A","No","No","No","No","No",0,0,0,0,0,0,0,0,0,"Yes","No","No",44108,"28/05/2020","Unclear","English","English",0,"Yes","No","Yes","No","No","No","No","External links_Resource","N/A","Yes","No","Date of publication","No"]
["29/05/2020","Promise","",{"$f":"IFERROR(SEARCH('1. Searching Hubs'!$E$14, E101)+ROW()/100000,\"\")","v":""},"Homelesseness impact","https://www.homelessnessimpact.org/covid-19","COVID-19 response\nResources to support communities to help people who are homeless or at risk to stay safe and healthy during the COVID-19 outbreak.","National","No","No","Yes","No","No","No","No","No","No","Yes","Yes","Yes","First category (at least one: having documents, epi info, or government responses)","Include","N/A","Other","Private company","Private for profit",0,0,0,0,0,0,0,0,0,0,0,0,0,"Yes","No","Yes","No","No","No","No",0,"N/A","No","No","No","Yes","No",0,0,0,0,0,0,0,0,0,"No","No","No","Unclear","29/05/2020","1 housing calculator, 1 upcoming event advert, 1 document collating government guidance from across the UK, 1 homelessess index document,  3 blog posts","English","English",0,"Yes","No","Yes","Yes","Yes","No","No","No","N/A","Yes","No","None of them","No","60 minis"]
["27/05/2020","Irvine","",{"$f":"IFERROR(SEARCH('1. Searching Hubs'!$E$14, E102)+ROW()/100000,\"\")","v":""},"IDS K4D Covid resource","https://www.ids.ac.uk/projects/k4d-covid-19-resource-hub","K4D has created this COVID-19 Resource Hub to bring together learning across DFID and the UK Government to support their fight against COVID-19 and its consequences.","National","No","No","No","No","No","No","No","No","No","Yes","Yes","Yes","First category (at least one: having documents, epi info, or government responses)","Include","N/A","International Organization","N/A","Public","Yes","No",0,0,0,0,0,0,0,0,0,0,0,"Yes","Yes","Yes","Yes","No","Yes","Yes",0,"N/A","Yes","Yes",0,0,0,0,0,0,0,0,0,0,0,0,"Yes","No","No","Unclear","27/05/2020","Unclear","English","English",0,"Yes","No","Yes","No","No","No","Yes","External links_Resource","N/A","Yes","No","Date of publication","No"]
["2020-09-06","Promise","",{"$f":"IFERROR(SEARCH('1. Searching Hubs'!$E$14, E103)+ROW()/100000,\"\")","v":""},"IFPRI Covid 19 Food Trade Policy Tracker","https://www.ifpri.org/project/covid-19-food-trade-policy-tracker","n the current COVID-19 crisis, there has been a movement of some national governments to restrict food exports. This behavior can, in aggregate, have dire unintended consequences for vulnerable people in food-importing countries, increasing prices and exacerbating issues of food insecurity already inflamed by the COVID-19 pandemic. It may also negatively affect producers in the export-restricting countries. We recall the dangerous policies that contributed to the 2007-2008 food price crisis; may history not repeat itself.\n\nSince March 2020, we have been tracking food export restrictions and documenting their impact.  As of 28 April 2020, 15 countries have active binding export restrictions on food. These policies are shown in the Map of Food Export Restrictions below.","Global ","Yes","Yes","Yes","Yes","No","Yes","No","Yes","Yes","Yes","Yes","Yes","First category (at least one: having documents, epi info, or government responses)","Include","N/A","International Organization","N/A","Public",0,0,0,0,0,0,0,0,0,0,0,0,0,"No","No","No","Yes","No","No","No","No","N/A","No","No","No","No","No",0,0,0,0,0,0,0,0,0,"N/A","N/A","N/A",44049,"2020-09-06","2 visual maps and 1 downloadable document of government responses","English","English",0,"Yes","No","Yes","Yes","No","No","Yes","No","N/A","Yes","No","None of them","No","20 mins"]
["29/05/2020","Andile","",{"$f":"IFERROR(SEARCH('1. Searching Hubs'!$E$14, E104)+ROW()/100000,\"\")","v":""},"iHealthFacts","https://ihealthfacts.ie/","iHealthFacts is a resource where the public can quickly and easily check the reliability of a health claim circulated by social media. We hope this information will help people think critically about health claims and make well-informed choices.","No geographical scope","N/A","N/A","N/A","N/A","N/A","N/A","N/A","N/A","N/A","N/A","Yes","Yes","Second category (at least two: having expert opinions or others)","Include","N/A","Other","Network of research organisations","Private not for profit",0,0,0,0,0,0,0,0,0,0,0,0,0,"No","Yes","No","No","No","Yes","No",0,"N/A","No","Yes","No","No","No",0,0,0,0,0,0,0,0,0,"No","No","No","Unclear","29/05/2020","19 Questions answered ","English","English",0,"No","No","Yes","No","No","No","No","External links_Resource","Links to false reports, Downloadable images","Yes","No","None of them","No"]
["2020-08-06","Nkuli","",{"$f":"IFERROR(SEARCH('1. Searching Hubs'!$E$14, E105)+ROW()/100000,\"\")","v":""},"IIASA COVID-19 : Visualizing regional socioeconomic indicators for Europe","https://covid19.iiasa.ac.at/interactive/","This is an interactive map of socioeconomic indicators across Europe during the COVID-19 pandemic. The comprehensive map of indicators includes infected population numbers, adequate access to healthcare and mortality rate.","Regional","No","No","Yes","No","No","No","No","Yes","Yes","Yes","Yes","Yes","First category (at least one: having documents, epi info, or government responses)","Include","N/A","NGO","N/A","Public",0,0,0,0,0,0,0,0,0,0,0,0,0,"No","No","No","No","No","No","No","No","N/A","Yes","No","Yes","Yes","Yes",0,0,0,0,0,0,0,0,0,"No","No","No",44049,"2020-08-06","1 interactive map","English","English",0,"Yes","No","Yes","No","No","No","Yes","No","N/A","Yes","No","None of them","No","55 mins"]
["2020-08-06","Andile","",{"$f":"IFERROR(SEARCH('1. Searching Hubs'!$E$14, E106)+ROW()/100000,\"\")","v":""},"ILO Social Protection Monitor","https://www.social-protection.org/gimi/RessourcePDF.action?id=56024","This note summarizes the results of the Social Protection Monitor that tracks announcements\nof social protection measures responding to the possible impacts of the COVID-19 crisis.\nWe will update this note as new data and information become available in this rapidly evolving\nsituation.","Global ","Yes","Yes","Yes","Yes","Yes","Yes","Yes","Yes","Yes","Yes","Yes","Yes","First category (at least one: having documents, epi info, or government responses)","Include","N/A","International Organization","N/A","Public",0,0,0,0,0,0,0,0,0,0,0,0,0,"Yes","No","No","Yes","No","No","No","No","N/A","No","No","No","No","No",0,0,0,0,0,0,0,0,0,"No","No","No",43986,"2020-08-06","1 Document","English","English",0,"Yes","No","No","Yes","No","No","Yes","No","N/A","Yes","No","Date of publication","No"]
["2020-09-06","Irvine","",{"$f":"IFERROR(SEARCH('1. Searching Hubs'!$E$14, E107)+ROW()/100000,\"\")","v":""},"Impact Peace Resources on Covid","https://docs.google.com/document/d/1QMEOe7NC1wpSx3jLDBohxXja-cN4M5A8ctg8fbLrOcs/edit",0,"Global ","Yes","Yes","Yes","Yes","Yes","Yes",0,"Yes","Yes","Yes","Yes","Yes","First category (at least one: having documents, epi info, or government responses)","Include","N/A","Academic institution","N/A","Public",0,0,0,0,0,0,0,0,0,0,0,0,0,"Yes","Yes","No","Yes","No","Yes","Yes","No","N/A",0,"Yes","Yes","Yes","Yes",0,0,0,0,0,0,0,0,0,"Yes","No","No",43867,"2020-09-06","1 Google Sheet","English","English",0,"Yes","No","Yes","No","No","No","No","External links_Resource","N/A","Yes","No","Last update of the document","Yes"]
["2020-05-06","Andile","",{"$f":"IFERROR(SEARCH('1. Searching Hubs'!$E$14, E108)+ROW()/100000,\"\")","v":""},"Institut national d’excellence en santé et en services sociaux","https://www.inesss.qc.ca/covid-19.html","Experts from INSPQ, Université Laval (Research group in mathematical modeling and health economics related to infectious diseases), McGill University modeling group, and INESSS produced projections the likely evolution of the epidemic according to scenarios of relaxation of physical distancing and confinement measures as well as projections allowing to estimate its repercussions on hospital admissions and on the occupation of regular and intensive care beds.","Sub-national","No","No","No","Yes","No","No","No","No","No","Yes","Yes","Yes","First category (at least one: having documents, epi info, or government responses)","Include","N/A","Governments and public institutions","N/A","Public",0,0,0,0,0,0,0,0,0,0,0,0,0,"No","No","No","No","No","Yes","No","No","N/A","No","No","No","No","No",0,0,0,0,0,0,0,0,0,"No","No","No","28/05/2020","2020-05-06","73: 2 Projections, 67 Quick responses (PDF), 2 Orders, 2 External links","French, English","French, English",0,"No","No","Yes","Yes","No","No","Yes","External links_Other hubs","N/A","Yes","No","Last update of the document","No"]
[null,"Nkuli","",{"$f":"IFERROR(SEARCH('1. Searching Hubs'!$E$14, E109)+ROW()/100000,\"\")","v":""},"Institute for Health Metrics and Evaluation (IHME)","http://www.healthdata.org/covid","IHME's COVID-19 projections were developed in response to requests from the University of Washington School of Medicine and other US hospital systems and state governments working to determine when COVID-19 would overwhelm their ability to care for patients. The forecasts also show daily and cumulative COVID-19 deaths, social distancing mandate information, as well as infections and testing.\n\nOur aim is to release updates as frequently as possible. We will be working to make sure the model reflects what we're learning each day about the pandemic and that our forecast reflects the most up-to-date information available from all locations we track. ","Global ","Yes","Yes","Yes","Yes","Yes","Yes","Yes","Yes","Yes","Yes","Yes","Yes","First category (at least one: having documents, epi info, or government responses)","Include","N/A","NGO","N/A","Public","No","Yes","No","No","No","No","No","No","No","No","No","No",0,"Yes","No","No","No","No","No","No",0,"N/A","Yes","No","No","No","No","No","Yes","No","No","No","No","Yes","No","No","No","Yes","Yes","25/05/2020","26/05/2020","141: 12 press releases, 125 blogs, 4 research articles","English","English",0,"Yes","No","Yes","Yes","No","No","No","No","N/A","Yes","No","Date of publication","No","46 mins"]
[null,"Nkuli","",{"$f":"IFERROR(SEARCH('1. Searching Hubs'!$E$14, E110)+ROW()/100000,\"\")","v":""},"Inter-American Development Bank","https://www.iadb.org/en/coronavirus","At the IDB Group, we know that, in addition to our financial support, what our member countries value most is the knowledge and technical advice we provide to help design and implement effective public policies. For this reason, with the support of our Board of Directors and contributions from our specialists at headquarters and in the field, we have created this platform.\n\nHere you will find resources not only from the IDB Group, but from institutions at the forefront of the global fight against the virus. We hope they will help generate solutions that will allow us to regain health and growth in all of our societies.\n\nTogether, in collaboration with all of you, we will be more effective in meeting this great challenge.\n\nTogether, we will continue improving lives.","Regional","No","No","No","Yes","No","No","No","No","Yes","Yes","Yes","Yes","Second category (at least two: having expert opinions or others)","Include","N/A","Other","Financing institution","Public","No","Yes","No","No","No","No","No","No","No","No","No","No",0,"No","Yes","Yes","No","No","No","No",0,"N/A","No","No","Yes","Yes","Yes","No","No","No","No","Yes","Yes","No","No","No","No","No","No","Unclear","26/05/2020","Unclear","English","English, Spanish","Health","Yes","No","Yes","Yes","No","No","No","No","News articles, blogs","Yes","No","Date of publication","No","65 mins"]
["2020-04-06","Irvine","",{"$f":"IFERROR(SEARCH('1. Searching Hubs'!$E$14, E111)+ROW()/100000,\"\")","v":""},"International Centre for not-for-profit law","https://www.icnl.org/covid19tracker/","This tracker monitors government responses to the pandemic that affect civic freedoms and human rights, focusing on emergency laws. For information about our methodology, click here.","Global ","Yes","Yes","Yes","Yes","Yes","Yes","Yes","Yes","Yes","Yes","Yes","Yes","First category (at least one: having documents, epi info, or government responses)","Include","N/A","International Organization","N/A","Public",0,0,0,0,0,0,0,0,0,0,0,0,0,"No","No","No","Yes","No","No","No","No","N/A","No","No","No","Yes","No",0,0,0,0,0,0,0,0,0,"Yes","Yes","Yes","Unclear","2020-04-06","Unclear","English","English",0,"No","No","Yes","No","No","Yes","Yes","No","N/A","Yes","No","None of them","No"]
["2020-08-06","Irvine","",{"$f":"IFERROR(SEARCH('1. Searching Hubs'!$E$14, E112)+ROW()/100000,\"\")","v":""},"International Growth Centre(ICG)","https://www.theigc.org/covid-19/tracker/","The IGC COVID-19 tracker records policy interventions aimed at addressing the pandemic across the developing world. Click here to see the full tracker in a new tab and email Anna Twum if you have any questions, corrections or submissions.\n\n","Regional","Yes","Yes","No","No","Yes","Yes","Yes","Yes","Yes","No","Yes","Yes","First category (at least one: having documents, epi info, or government responses)","Include","N/A","International Organization","N/A","Public",0,0,0,0,0,0,0,0,0,0,0,0,0,"No","Yes","No","Yes","No","No","No","No","N/A","Yes","No","No","No","Yes",0,0,0,0,0,0,0,0,0,"N/A","N/A","N/A",43867,"2020-08-06","Unclear","English","English",0,"Yes","No","Yes","Yes","No","No","Yes","External links_Other hubs & Resources ","N/A","Yes","No","Last update of the document","No"]
["2020-04-06","Promise","",{"$f":"IFERROR(SEARCH('1. Searching Hubs'!$E$14, E113)+ROW()/100000,\"\")","v":""},"International Long Term Care Policy Network","https://ltccovid.org/","LTCcovid aims to:\nDocument the impact of COVID-19 on people who rely on long-term care (including unpaid care) and those who provide it\nShare information about policy and practice measures to mitigate the impact of COVID-19 in long-term care and gather evidence about their success or otherwise.\nAnalyse the long-term implications of this pandemic for long-term care policy.","Global ","Yes","Yes","Yes","Yes","Yes","Yes","Yes","Yes","Yes","Yes","Yes","Yes","First category (at least one: having documents, epi info, or government responses)","Include","N/A","Academic institution","N/A","Private not for profit",0,0,0,0,0,0,0,0,0,0,0,0,0,"No","No","No","Yes","No","No","Yes","No","N/A","No","No","Yes","No","No",0,0,0,0,0,0,0,0,0,"No","No","No","Unclear","2020-04-06","25 country reports, 6 international reports, 9 summaries, ","English","English",0,"No","No","Yes","Yes","No",0,"No","External links_Resource","N/A","Yes","No","Date of publication","No","40 mins"]
[null,"Andile","",{"$f":"IFERROR(SEARCH('1. Searching Hubs'!$E$14, E114)+ROW()/100000,\"\")","v":""},"International Monetary Fund (IMF)","https://www.imf.org/en/Topics/imf-and-covid19/Policy-Responses-to-COVID-19","This policy tracker summarizes the key economic responses governments are taking to limit the human and economic impact of the COVID-19 pandemic. The tracker includes 193 economies","Global ","Yes","Yes","Yes","Yes","Yes","Yes","Yes","Yes","Yes","Yes","Yes","Yes","First category (at least one: having documents, epi info, or government responses)","Include","N/A","International Organization","N/A","Public","No","No",0,0,0,0,0,0,0,0,0,0,0,"No","No","No","Yes","No","No","Yes","No","N/A","Yes","No","No","No","No",0,0,0,0,0,0,0,0,0,"N/A","N/A","N/A","22/05/2020","26/05/2020","Unclear","English","English",0,"Yes","No","Yes","No","Yes","No","No","No","Publications, Externalinks, Factsheet, Blog","Yes","Yes","None of them","No"]
["2020-05-06","Andile","",{"$f":"IFERROR(SEARCH('1. Searching Hubs'!$E$14, E115)+ROW()/100000,\"\")","v":""},"International Network for Government Science Advice (INGSA)","https://www.ingsa.org/covid/policymaking-tracker/","Our goal is to mobilise the INGSA network to help keep track of  HOW policy interventions are being made by various national and sub-national (state, province, etc.) governments across the world. We are interested in the advice, evidence or other justifications that underpin governments’ decisions as the crisis unfolds.","Global ","Yes","Yes","Yes","Yes","Yes","Yes","Yes","Yes","Yes","Yes","Yes","Yes","First category (at least one: having documents, epi info, or government responses)","Include","N/A","International Organization","N/A","Public",0,0,0,0,0,0,0,0,0,0,0,0,0,"No","No","No","Yes","No","No","No","No","N/A","No","No","No","No","No",0,0,0,0,0,0,0,0,0,"No","Yes","Yes","Unclear","2020-05-06","Unclear","English","English",0,"No","No","Yes","No","No","No","Yes","External links_Resource","N/A","Yes","No","None of them","No"]
["2020-04-06","Promise","",{"$f":"IFERROR(SEARCH('1. Searching Hubs'!$E$14, E116)+ROW()/100000,\"\")","v":""},"International trade centre","https://macmap.org/covid19","This page monitors temporary trade measures enacted by government authorities in relation to the COVID-19 pandemic, which is rapidly spreading across the world.\n\nGovernments are swiftly enacting temporary trade measures that aim to restrict exports of vital medical supplies and to liberalize imports of vital medical supplies.\n\nDue to the rapid development of this extraordinary situation, we are providing a global daily update of enacted COVID-19 trade measures. We urge users to take these measures into account when consulting market access information throughout Market Access Map. The objective of this initiative is to improve transparency in international trade and market access in line with the mission of Market Access Map.","Global ","Yes","Yes","Yes","Yes","Yes","Yes","Yes","Yes","Yes","Yes","Yes","Yes","First category (at least one: having documents, epi info, or government responses)","Include","N/A","International Organization","N/A","Public",0,0,0,0,0,0,0,0,0,0,0,0,0,"No","No","No","Yes","No","No","No","No","N/A","No","No","No","No","No",0,0,0,0,0,0,0,0,0,"N/A","N/A","N/A",43896,"2020-04-06","1 global map overview of enacted measures","English","English",0,"Yes","No","Yes","No","No","No","Yes","No","N/A","Yes","No","None of them","No","30 mins"]
["2020-03-06","Andile","",{"$f":"IFERROR(SEARCH('1. Searching Hubs'!$E$14, E117)+ROW()/100000,\"\")","v":""},"Irish Longitudinal Study on Ageing","https://tilda.tcd.ie/","To assist with planning for COVID-19 we have analysed the following to identify numbers in at-risk cohorts based on extant international data for at-risk groups i.e. frailty, pre frailty; cardiovascular and chronic conditions; comorbidities; possible at- risk CVD and anti-inflammatory medications*; and living/household circumstances (social isolation) including grandparenting; community social care and health service utilisation. We have also produced a report on nursing homes to inform COVID-19 responses for our most vulnerable, and highlight the prevalence of internet access and use in adults over 50.","National","No","No","Yes","No","No","No","No","No","No","Yes","Yes","Yes","First category (at least one: having documents, epi info, or government responses)","Include","N/A","Academic institution","N/A","Public",0,0,0,0,0,0,0,0,0,0,0,0,0,"No","No","No","No","No","No","No","No","N/A","No","No","No","No","No",0,0,0,0,0,0,0,0,0,"No","No","No","Unclear","2020-03-06","9: 8 reports, 1 leaflet","English","English",0,"No","No","No","Yes","No","No","No","No","N/A","Yes","Yes","Date of publication","No"]
["29/05/2020","Irvine","",{"$f":"IFERROR(SEARCH('1. Searching Hubs'!$E$14, E118)+ROW()/100000,\"\")","v":""},"Johanna Briggs Institute","https://jbi.global/ebp/covid-19#professionals","The JBI COVID-19 Special Collection provides health professionals and health organisations with free access to premier evidence-based point of care resources to inform and guide healthcare decision making with a focus on infection prevention and control measures, and mental health and well-being","No geographical scope","Yes","Yes","Yes","Yes","Yes","Yes","Yes","Yes","Yes","Yes","Yes","Yes","Second category (at least two: having expert opinions or others)","Include","N/A","NGO","N/A","Private not for profit",0,0,0,0,0,0,0,0,0,0,0,0,0,"Yes","Yes","Yes","No","No","Yes","Yes","No","N/A","Yes","Yes","Yes","Yes","Yes",0,0,0,0,0,0,0,0,0,"Yes","No","No","Unclear","29/05/2020","Unclear","English","English",0,"No","No","Yes","Yes","Yes","Yes","Yes","External links_Resource","N/A","Yes","No","Date of publication","Yes"]
["2020-09-06","Promise","",{"$f":"IFERROR(SEARCH('1. Searching Hubs'!$E$14, E119)+ROW()/100000,\"\")","v":""},"John Hopkins Bloomberg School of Public Health","https://ncrc.jhsph.edu/","Our teams rapidly curate and assess emerging research on SARS-CoV-2 and COVID-19. We prioritize original, high-quality research for public health action and papers receiving significant attention, regardless of quality.","No geographical scope","N/A","N/A","N/A","N/A","N/A","N/A","N/A","N/A","N/A","N/A","N/A","Yes","First category (at least one: having documents, epi info, or government responses)","Include","N/A","Academic institution","N/A","Public",0,0,0,0,0,0,0,0,0,0,0,0,0,"Yes","No","No","Yes","No","No","No","No","N/A","No","No","Yes","No","No",0,0,0,0,0,0,0,0,0,"No","No","No","Unclear","2020-09-06","6 articles","English","English",0,"No","No","Yes","Yes","No","No","No","No","N/A","Yes","No","None of them","No"]
["27/05/2020","Andile","",{"$f":"IFERROR(SEARCH('1. Searching Hubs'!$E$14, E120)+ROW()/100000,\"\")","v":""},"Johns Hopkins Medicine POC-IT Guide","https://www.hopkinsguides.com/hopkins/view/Johns_Hopkins_ABX_Guide/540747/all/Coronavirus_COVID_19__SARS_CoV_2_?utm_source=link.cep.health&utm_medium=urlshortener&utm_campaign=covid","Johns Hopkins Medicine POC-IT Guide is a document detailing different aspects of the corona virus pandemic. Namely, microbiology, clinical, site of infection and treatment.","National","No","No","No","Yes","No","No","No","No","No","Yes","Yes","Yes","First category (at least one: having documents, epi info, or government responses)","Include","N/A","Academic institution","N/A","Public","No","No",0,0,0,0,0,0,0,0,0,0,0,"No","No","No","No","No","No","No",0,"N/A","No","No","No","No","No",0,0,0,0,0,0,0,0,0,"No","No","No","23/05/2020","27/05/2020","Unclear","English","English",0,"No","No","Yes","No","Yes","No","Yes","External links_Other hubs & Resources ","Cross links, Related topics","Yes","No","Last update of the document","No"]
["27/05/2020","Andile","",{"$f":"IFERROR(SEARCH('1. Searching Hubs'!$E$14, E121)+ROW()/100000,\"\")","v":""},"Johns Hopkins University and Medicine Coronavirus Resource Center","https://coronavirus.jhu.edu/","Johns Hopkins experts in global public health, infectious disease, and emergency preparedness have been at the forefront of the international response to COVID-19.\nThis website is a resource to help advance the understanding of the virus, inform the public, and brief policymakers in order to guide a response, improve care, and save lives.","Global ","Yes","Yes","Yes","Yes","Yes","Yes","Yes","Yes","Yes","Yes","Yes","Yes","First category (at least one: having documents, epi info, or government responses)","Include","N/A","Academic institution","N/A","Public","No","No",0,0,0,0,0,0,0,0,0,0,0,"Yes","Yes","Yes","No","No","No","No",0,"N/A","Yes","No","No","No","No",0,0,0,0,0,0,0,0,0,"No","No","No","Unclear","27/05/2020","Unclear","English","English",0,"No","No","Yes","Yes","No","No","Yes","External links_Other hubs","Online courses, External links","Yes","Yes","None of them","No"]
["2020-03-06","Promise","",{"$f":"IFERROR(SEARCH('1. Searching Hubs'!$E$14, E122)+ROW()/100000,\"\")","v":""},"Journal of the American College of Cardiology","http://www.onlinejacc.org/content/covid-19-clinical-guidance-global-cardiovascular-clinicians","As you work together on the front lines to best serve the cardiovascular patient community and lead COVID-19 response planning for our institutions, the JACC Journals and the ACC are working to provide COVID-19 clinical guidance for global cardiovascular clinicians. Below are the recently accepted manuscripts that the JACC Journals’ Editors hope will best inform your care decision-making.","No geographical scope","N/A","N/A","N/A","N/A","N/A","N/A","N/A","N/A","N/A","N/A","Yes","Yes","First category (at least one: having documents, epi info, or government responses)","Include","N/A","NGO","N/A","Public",0,0,0,0,0,0,0,0,0,0,0,0,0,"No","No","No","No","No","No","No",0,"N/A","No","No","No","No","No",0,0,0,0,0,0,0,0,0,"No","N/A","N/A","Unclear","2020-03-06","63 articles","English","English",0,"No","No","No","Yes","No","No","No","No","N/A","Yes","No","Date of publication","No","46 mins"]
["2020-09-06","Irvine","",{"$f":"IFERROR(SEARCH('1. Searching Hubs'!$E$14, E123)+ROW()/100000,\"\")","v":""},"Kaggle","https://www.kaggle.com/covid-19-contributions","The goal of this page is to bring together the most useful contributions from the Kaggle community's COVID-19 work into a single place.","Global ","Yes","Yes","Yes","Yes","Yes","Yes","Yes","Yes","Yes","Yes","Yes","Yes","Second category (at least two: having expert opinions or others)","Include","N/A","Governments and public institutions","N/A","Public",0,0,0,0,0,0,0,0,0,0,0,0,0,"Yes","Yes","No","No","No","No","No","No","N/A","Yes","Yes","Yes","Yes","No",0,0,0,0,0,0,0,0,0,"Yes","No","No","Unclear","2020-09-06","Unclear","English","English",0,"No","No","Yes","Yes","No","No","No","No","N/A","Yes","No","Date of publication","No"]
["27/05/2020","Irvine","",{"$f":"IFERROR(SEARCH('1. Searching Hubs'!$E$14, E124)+ROW()/100000,\"\")","v":""},"Kentucky’s response to COVID-19","https://govstatus.egov.com/kycovid19","The following table shows the actions taken by Governor Beshear since the first case of novel coronavirus disease 2019 (COVID-19) was confirmed in Kentucky. Actions are listed by date from newest to oldest.\n ","Sub-national","No","No","No","No","No","No","No","No","No","Yes","Yes","Yes","First category (at least one: having documents, epi info, or government responses)","Include","N/A","Governments and public institutions","N/A","Public","No","Yes",0,0,0,0,0,0,0,0,0,0,0,"No","Yes","No","Yes","No","No","No",0,"N/A","Yes","No","Yes","Yes","Yes",0,0,0,0,0,0,0,0,0,"No","No","No","22/05/2020","27/05/2020","Unclear","English","English",0,"Yes","No","Yes","No","No","No","No","External links_Resource","N/A","Yes","No","Date of publication","No"]
["28/05/2020","Irvine","",{"$f":"IFERROR(SEARCH('1. Searching Hubs'!$E$14, E125)+ROW()/100000,\"\")","v":""},"Kenyan government","http://www.health.go.ke/covid-19/","Kenyan Government COVID 19  Response Archive","National","Yes","No","No","No","No","No","No","Yes","No","No","Yes","Yes","Second category (at least two: having expert opinions or others)","Include","N/A","Governments and public institutions","N/A","Public","No","Yes",0,0,0,0,0,0,0,0,0,0,0,"No","Yes","Yes","Yes","No","No","Yes",0,"N/A","Yes","Yes","Yes","Yes","Yes",0,0,0,0,0,0,0,0,0,"No","No","No","Unclear","28/05/2020","Unclear","English","English",0,"Yes","No","Yes","Yes","Yes","No","No","External links_Resource","N/A","Yes","Yes","Date of publication","No"]
["2020-04-06","Promise","",{"$f":"IFERROR(SEARCH('1. Searching Hubs'!$E$14, E126)+ROW()/100000,\"\")","v":""},"Knowledge to Policy Center, American University of Beirut","https://www.aub.edu.lb/k2p/Pages/K2PCOVID19.aspx","K2P Rapid Response responds to urgent requests from policymakers and stakeholders by delivering optimally packaged, relevant and high-quality evidence for decision-making in short periods of time.","National","N/A","N/A","N/A","N/A","N/A","N/A","N/A","N/A","N/A","N/A","Yes","Yes","First category (at least one: having documents, epi info, or government responses)","Include","N/A","Academic institution","N/A","Public",0,0,0,0,0,0,0,0,0,0,0,0,0,"No","No","No","No","No","No","No","No","N/A","No","No","No","No","No",0,0,0,0,0,0,0,0,0,"No","No","No","Unclear ","2020-04-06","11 rapid responses","English","English, Arabic",0,"No","No","No","Yes","No","No","No","No","N/A","Yes","No","Date of publication","No","45 mins"]
["2020-03-07","Promise","",{"$f":"IFERROR(SEARCH('1. Searching Hubs'!$E$14, E127)+ROW()/100000,\"\")","v":""},"LANCET COVID-19 Resource Centre","https://www.thelancet.com/coronavirus","To assist health workers and researchers working under challenging conditions to bring this outbreak to a close, The Lancet has created a Coronavirus Resource Centre. This resource brings together new 2019 novel coronavirus disease (COVID-19) content from across The Lancet journals as it is published. All of our COVID-19 content is free to access","No geographical scope","N/A","N/A","N/A","N/A","N/A","N/A","N/A","N/A","N/A","N/A","Yes","Yes","First category (at least one: having documents, epi info, or government responses)","Include","N/A","NGO","N/A","Public",0,0,0,0,0,0,0,0,0,0,0,0,0,"No","No","No","No","No","No","No",0,"N/A","No","No","Yes","No","No",0,0,0,0,0,0,0,0,0,"Yes","Yes","No","Unclear","2020-03-06","769 articles","English","English",0,"No","No","Yes","Yes","No","No","No","No","N/A","Yes","No","Date of publication","No"]
["29/05/2020","Andile","",{"$f":"IFERROR(SEARCH('1. Searching Hubs'!$E$14, E128)+ROW()/100000,\"\")","v":""},"LitCovid","https://www.ncbi.nlm.nih.gov/research/coronavirus/","LitCovid is a curated literature hub for tracking up-to-date scientific information about the 2019 novel Coronavirus. It is the most comprehensive resource on the subject, providing a central access to 16945 (and growing) relevant articles in PubMed.","Global ","Yes","Yes","Yes","Yes","Yes","Yes","Yes","Yes","Yes","Yes","Yes","Yes","First category (at least one: having documents, epi info, or government responses)","Include","N/A","Other","Publisher","Public",0,0,0,0,0,0,0,0,0,0,0,0,0,"No","No","No","No","No","No","No","No","N/A","No","Yes","No","No","No",0,0,0,0,0,0,0,0,0,"No","No","Yes","Unclear","29/05/2020","16945 Articles","English","English",0,"No","No","No","Yes","No","No","Yes","No","N/A","Yes","No","Date of publication","No"]
["2020-05-07","Promise","",{"$f":"IFERROR(SEARCH('1. Searching Hubs'!$E$14, E129)+ROW()/100000,\"\")","v":""},"Love Platform","https://app.iloveevidence.com/loves/5e6fdb9669c00e4ac072701d","In order to respond to the COVID-19 emergency, we have adapted our L·OVE platform to include not only the existing systematic reviews but also other types of evidence synthesis (e.g. guidelines) and primary studies, published or ongoing, of any design.\nThe details about the search sources and strategies, artificial intelligence algorithms, validation by the network of collaborators and other methods of this special L·OVE are described here.","No geographical scope","N/A","N/A","N/A","N/A","N/A","N/A","N/A","N/A","N/A","N/A","Yes","Yes","First category (at least one: having documents, epi info, or government responses)","Include","N/A","NGO","N/A","Public",0,0,0,0,0,0,0,0,0,0,0,0,0,"No","No","No","No","No","No","No","No","N/A","No","No","Yes","No","Yes",0,0,0,0,0,0,0,0,0,"No","Yes","No","Unclear","2020-05-06","5597 as relevant for decision-making, including: 526 systematic reviews\n5071 primary studies (772 RCTs). 918 primary studies report data (56 RCTs) and 4153 do not report data yet (e.g. ongoing trials)","English","English",0,"No","No","No","Yes","No","No","No","No","N/A","Yes","No","Date of publication","No","65 mins"]
["2020-04-06","Andile","",{"$f":"IFERROR(SEARCH('1. Searching Hubs'!$E$14, E130)+ROW()/100000,\"\")","v":""},"MAGICapp","https://app.magicapp.org/#/guidelines","A digital authoring and publication platform for the evidence ecosystem, by MAGIC Evidence Ecosystem Foundation; which has guidelines related to COVID 19. ","Regional","No","No","Yes","No","No","No","No","No","No","Yes","Yes","Yes","First category (at least one: having documents, epi info, or government responses)","Include","N/A","Other","Publisher","Private not for profit",0,0,0,0,0,0,0,0,0,0,0,0,0,"No","No","No","No","No","No","No","No","N/A","No","No","No","No","No",0,0,0,0,0,0,0,0,0,"Yes","Yes","No","Unclear","2020-04-06","128 Guidelines","English, Spanish, French, Danish, Dutch, Svenska","English, Spanish, French, Danish, Dutch, Svenska",0,"No","No","No","No","No","No","No","No","N/A","Yes","No","Date of publication","No","40 min"]
["2020-03-07","Irvine",{"$f":"IFERROR(RANK(D131,D:D,1),\"\")","v":""},{"$f":"IFERROR(SEARCH('1. Searching Hubs'!$E$14, E131)+ROW()/100000,\"\")","v":""},"Makerere University","https://coronavirus.mak.ac.ug/resources","This website is a resource to help advance the understanding of the virus, inform the public, and brief policymakers in order to guide a response, improve care, and save lives. Get in touch with us press@coronavirus.mak.ac.ug  ","No geographical scope","N/A","N/A","N/A","N/A","N/A","N/A","N/A","N/A","N/A","N/A","Yes","Yes","Second category (at least two: having expert opinions or others)","Include","N/A","Academic institution","N/A","Public",0,0,0,0,0,0,0,0,0,0,0,0,0,"No","Yes","No","No","No","No","No",0,"N/A","Yes","Yes","Yes","Yes","Yes",0,0,0,0,0,0,0,0,0,"Yes","No","No",43867,"2020-03-06","Unclear","English","English",0,"Yes","No","Yes","Yes","No","No","Yes","External links_Resource","N/A","Yes","No","Date of publication","No","48 min"]
["2020-08-06","Andile","",{"$f":"IFERROR(SEARCH('1. Searching Hubs'!$E$14, E132)+ROW()/100000,\"\")","v":""},"Malcolm Wiener Centre for Social Policy Monitoring the Covid-19 Employment Response: Policy Approaches Across Countries","https://www.hks.harvard.edu/centers/wiener/programs/project-on-workforce/covid-19-employment-response","This collection of different policies from across the globe demonstrates the wide range of responses adopted, often at unprecedented speed. ","Global ","Yes","No","Yes","Yes","No","Yes","No","Yes","Yes","Yes","Yes","Yes","First category (at least one: having documents, epi info, or government responses)","Include","N/A","Academic institution","N/A","Public",0,0,0,0,0,0,0,0,0,0,0,0,0,"No","No","No","Yes","No","No","No","No","N/A","No","No","No","No","No",0,0,0,0,0,0,0,0,0,"No","Yes","Yes",43956,"2020-08-06","Responses from 16 countries ","English","English",0,"No","No","Yes","No","No","No","No","No","N/A","Yes","No","None of them","No"]
["27/05/2020","Andile","",{"$f":"IFERROR(SEARCH('1. Searching Hubs'!$E$14, E133)+ROW()/100000,\"\")","v":""},"McMaster COVID-19 evidence","https://www.mcmasterforum.org/find-evidence/guide-to-covid-19-evidence-sources","To help health- and social-system leaders as they respond to unprecedented challenges related to the COVID-19 pandemic, the Forum has developed a new rapid-response model to support decision-makers with very short turn-around times.","Global ","Yes","Yes","Yes","Yes","Yes","Yes","Yes","Yes","Yes","Yes","Yes","Yes","First category (at least one: having documents, epi info, or government responses)","Include","N/A","Academic institution","N/A","Public","Yes","No",0,0,0,0,0,0,0,0,0,0,0,"No","No","No","Yes","No","Yes","No",0,"N/A","No","No","No","No","No",0,0,0,0,0,0,0,0,0,"No","No","No","Unclear","27/05/2020","10 Reviews","English","English",0,"No","No","No","Yes","No","No","No","No","N/A","Yes","No","Date of publication","No"]
[null,"Nkuli","",{"$f":"IFERROR(SEARCH('1. Searching Hubs'!$E$14, E134)+ROW()/100000,\"\")","v":""},"McMaster Daily News","https://covid19.mcmaster.ca/","This website provides important updates and the latest information for students, faculty and staff at McMaster to help navigate the dynamic situation and the many impacts on the university’s operations and policies.","National","No","No","No","Yes","No","No","No","No","No","Yes","Yes","No","Second category (at least two: having expert opinions or others)","Include","N/A","Academic institution","N/A","Public","No","No","No","No","No","No","No","No","No","No","No","No",0,"No","Yes","No","No","Yes","No","No",0,"N/A","No","No","No","Yes","No","Yes","No","No","No","No","Yes","Yes","No","Yes","No","No","No","26/05/2020","26/05/2020","45: 36 news articles, 9 videos","English","English","Education","Yes","No","Yes","No","Yes","No","No","No","N/A","Yes","No","None of them","No","42 mins"]
["27/05/2020","Irvine","",{"$f":"IFERROR(SEARCH('1. Searching Hubs'!$E$14, E135)+ROW()/100000,\"\")","v":""},"MCMaster National Collaborating Centre for Methods and Tools : Canada","https://www.nccmt.ca/knowledge-repositories/covid-19-evidence-reviews","It is critical for public health organizations to work together across jurisdictions during this challenging time and share our efforts in response to COVID-19. To minimize duplication of efforts and facilitate collaboration within public health across Canada, the National Collaborating Centre for Methods and Tools has collected research questions for rapid evidence reviews currently in development.","National","No","No","No","Yes","No","No","No","No","No","Yes","Yes","No","First category (at least one: having documents, epi info, or government responses)","Include","N/A","Governments and public institutions","N/A","Public","Yes","Yes",0,0,0,0,0,0,0,0,0,0,0,"Yes","Yes","No","No","No","Yes","No",0,"N/A","Yes","Yes","Yes","Yes","Yes",0,0,0,0,0,0,0,0,0,"No","Yes","Yes","Unclear","27/05/2020","Unclear","English","English",0,"Yes","No","Yes","Yes","Yes","No","No","External links_Other hubs & Resources ","N/A","Yes","Yes","Date of publication","No"]
["2020-03-06","Irvine","",{"$f":"IFERROR(SEARCH('1. Searching Hubs'!$E$14, E136)+ROW()/100000,\"\")","v":""},"McMasterer Plus","https://plus.mcmaster.ca/COVID-19","COVID-19 Evidence Alerts alerts users to current best evidence for clinical care of people with threatened, suspected or confirmed COVID-19 infection. It is updated every weekday as evidence reports are published in all journals included in MEDLINE. Reports are critically appraised for scientific merit, and those with acceptable scientific merit are appraised for relevance and importance by frontline clinicians.","No geographical scope","N/A","N/A","N/A","N/A","N/A","N/A","N/A","N/A","N/A","N/A","Yes","Yes","First category (at least one: having documents, epi info, or government responses)","Include","N/A","NGO","N/A","Private not for profit",0,0,0,0,0,0,0,0,0,0,0,0,0,"Yes","Yes","No","No","No","No","No","No","N/A","Yes","Yes","Yes","Yes","No",0,0,0,0,0,0,0,0,0,"Yes","No","No","02/06/2020","2020-03-06","Unclear","English","English","English",0,"No","No","Yes","No","No","No","External links_Resource","N/A","Yes","No","Date of publication","Yes"]
["29/05/2020","Andile","",{"$f":"IFERROR(SEARCH('1. Searching Hubs'!$E$14, E137)+ROW()/100000,\"\")","v":""},"Mental Health Commission of Canada","https://www.mentalhealthcommission.ca/English/covid19","At the Mental Health Commission of Canada, our commitment is to share credible information and resources about maintaining mental health during this time of crisis, and supporting people managing a mental illness in this new context.","National","No","No","No","Yes","No","No","No","No","No","Yes","Yes","Yes","First category (at least one: having documents, epi info, or government responses)","Include","N/A","Governments and public institutions","N/A","Public",0,0,0,0,0,0,0,0,0,0,0,0,0,"No","Yes","No","No","No","No","No",0,"N/A","No","No","No","No","No",0,0,0,0,0,0,0,0,0,"No","No","No","Unclear","29/05/2020","Unclear","English","English",0,"No","No","No","Yes","Yes","No","No","External links_Resource","N/A","Yes","Yes","Date of publication","No"]
["2020-08-06","Promise","",{"$f":"IFERROR(SEARCH('1. Searching Hubs'!$E$14, E138)+ROW()/100000,\"\")","v":""},"National COVID-19 Living Evidence Task Force","https://covid19evidence.net.au/","Supporting Australia’s healthcare professionals with continually updated, evidence-based clinical guidelines","National","No","No","No","No","No","Yes","No","No","No","Yes","Yes","Yes","First category (at least one: having documents, epi info, or government responses)","Include","N/A","Other","Taskforce","Public",0,0,0,0,0,0,0,0,0,0,0,0,0,"No","No","No","No","No","No","No","No","N/A","No","No","No","No","No",0,0,0,0,0,0,0,0,0,"No","N/A","N/A","Unclear","2020-08-06","8 guidelines, 5 clinical flow charts","English","English",0,"No","Yes","Yes","Yes","No","No","No","No","N/A","Yes","No","None of them","No","45 mins"]
[null,"Nkuli","",{"$f":"IFERROR(SEARCH('1. Searching Hubs'!$E$14, E139)+ROW()/100000,\"\")","v":""},"National Institute for Health and Care Excellence","https://www.nice.org.uk/covid-19","We're supporting the NHS and social care to respond quickly to the challenges of the coronavirus pandemic. We've brought together information that may help you.","No geographical scope","Yes","Yes","Yes","Yes","Yes","Yes","Yes","Yes","Yes","Yes","Yes","Yes","First category (at least one: having documents, epi info, or government responses)","Include","N/A","NGO","N/A","Public","Yes","No","No","No","Yes","Yes","No","No","No","No","No","No",0,"No","No","No","No","No","No","No",0,"N/A","No","Yes","Yes","No","No","No","Yes","Yes","No","No","No","No","Yes","Yes","No","No","No","26/05/2020","26/05/2020","26: 19 rapid guidelines, 4 rapid evidence summaries, 3 briefings","English","English","Health","No","Yes","Yes","Yes","No","No","No","External links_Other hubs","N/A","Yes","No","Date of publication","No","50 mins"]
["2020-08-06","Promise","",{"$f":"IFERROR(SEARCH('1. Searching Hubs'!$E$14, E140)+ROW()/100000,\"\")","v":""},"National Institutes of Health treatment guidelines","https://covid19treatmentguidelines.nih.gov/introduction/","These Treatment Guidelines have been developed to inform clinicians how to care for patients with COVID-19. Because clinical information about the optimal management of COVID-19 is evolving quickly, these Guidelines will be updated frequently as published data and other authoritative information becomes available.\n\nThe recommendations in these Guidelines are based on scientific evidence and expert opinion. Each recommendation includes two ratings: a letter (A, B, or C) that indicates the strength of the recommendation and a Roman numeral (I, II, or III) that indicates the quality of the evidence that supports the recommendation (see Table 1).","No geographical scope","N/A","N/A","N/A","N/A","N/A","N/A","N/A","N/A","N/A","N/A","Yes","Yes","First category (at least one: having documents, epi info, or government responses)","Include","N/A","Governments and public institutions","N/A","Public",0,0,0,0,0,0,0,0,0,0,0,0,0,"No","No","No","No","No","No","No","No","N/A","No","No","No","No","No",0,0,0,0,0,0,0,0,0,"No","No","No",44170,"2020-08-06","Unclear","English","English",0,"No","No","Yes","Yes","No","No","No","No","N/A","Yes","No","Last update of the document","Yes"]
["2020-03-06","Promise","",{"$f":"IFERROR(SEARCH('1. Searching Hubs'!$E$14, E141)+ROW()/100000,\"\")","v":""},"New England Journal of Medicine","https://www.nejm.org/coronavirus?query=RP","A collection of articles and other resources on the Coronavirus (Covid-19) outbreak, including clinical reports, management guidelines, and commentary.","No geographical scope","N/A","N/A","N/A","N/A","N/A","N/A","N/A","N/A","N/A","N/A","Yes","Yes","First category (at least one: having documents, epi info, or government responses)","Include","N/A","NGO","N/A","Public",0,0,0,0,0,0,0,0,0,0,0,0,0,"Yes","No","No","No","No","No","No",0,"Commentaries","No","No","No","No","No",0,0,0,0,0,0,0,0,0,"N/A","N/A","N/A",43864,"2020-03-06","Unclear","English","English",0,"No","No","Yes","Yes","No","No","No","No","N/A","Yes","No","Date of publication","No","60 mins"]
["28/05/2020","Irvine","",{"$f":"IFERROR(SEARCH('1. Searching Hubs'!$E$14, E142)+ROW()/100000,\"\")","v":""},"NICD","https://www.nicd.ac.za/diseases-a-z-index/covid-19/","This is the National Institute of Communicable Disease Covid 19 Response archive.The NICD aims to keep you updated with relevant and current information concerning COVID-19, ranging from frequently asked questions, providing technical resources and guidelines, information on prevention, an updated list of countries that are affected, advice for returning travellers and communication resources that can be utilised across settings. ","National","Yes","No","No","No","No","No","No","No","Yes","No","Yes","Yes","Second category (at least two: having expert opinions or others)","Include","N/A","Governments and public institutions","N/A","Public","Yes","Yes",0,0,0,0,0,0,0,0,0,0,0,"Yes","Yes","Yes","Yes","No","No","Yes",0,"Detailed FAQ","Yes","Yes","Yes","Yes","No",0,0,0,0,0,0,0,0,0,"Yes","Yes","No","Unclear","28/05/2020","Unclear","English","English",0,"No","No","Yes","Yes","No","No","Yes","External links_Resource","N/A","Yes","No","Last update of the document","No"]
["2020-01-06","Promise","",{"$f":"IFERROR(SEARCH('1. Searching Hubs'!$E$14, E143)+ROW()/100000,\"\")","v":""},"Nigerian government","https://covid19.ncdc.gov.ng/","A national hub that tracks cases and updates on Covid-19 related guidelines","National","Yes","No","No","No","No","No","No","Yes","Yes","No","Yes","Yes","First category (at least one: having documents, epi info, or government responses)","Include","N/A","Governments and public institutions","N/A","Public",0,0,0,0,0,0,0,0,0,0,0,0,0,"No","No","No","No","No","No","No",0,"N/A","Yes","No","No","No","No",0,0,0,0,0,0,0,0,0,"No","N/A","N/A",43836,"2020-01-06","1 dashboard of cases and 6 updates pdfs","English","English",0,"No","No","Yes","Yes","Yes","No","Yes","No","N/A","Yes","No","None of them","No","35 mins"]
["27/05/2020","Promise","",{"$f":"IFERROR(SEARCH('1. Searching Hubs'!$E$14, E144)+ROW()/100000,\"\")","v":""},"NMA","https://covid-nma.com","A Living mapping and living systematic review of Covid-19 studies","Global ","Yes","Yes","Yes","Yes","Yes","Yes","Yes","Yes","Yes","Yes","Yes","Yes","First category (at least one: having documents, epi info, or government responses)","Include","N/A","Other","A network of international collaboators ","Private not for profit","Yes","No",0,0,0,0,0,0,0,0,0,0,0,"No","No","No","No","No","No","No",0,"N/A","No","No","No","No","No",0,0,0,0,0,0,0,0,0,"No","No","No","27/05/2020","27/05/2020","10: 1 research map, 8 forest plots of main treatment comparisons,  and 1 living mapping of studies registered","English","English",0,"No","No","Yes","No","No","No","Yes","No","N/A","Yes","No","Last update of the document","No"]
[null,"Andile ","",{"$f":"IFERROR(SEARCH('1. Searching Hubs'!$E$14, E145)+ROW()/100000,\"\")","v":""},"Norwegian Institute of Public Health","https://www.fhi.no/en/qk/systematic-reviews-hta/map/","A live map of COVID-19 evidence. A growing number of studies and reports are being published on COVID-19 and the pandemic. This project will help decision makers and researchers navigate the research.","No geographical scope","Yes","Yes","Yes","Yes","Yes","Yes","Yes","Yes","Yes","Yes","Yes","Yes","First category (at least one: having documents, epi info, or government responses)","Include","N/A","Other","Government agency and research institute","Public","Yes","No","Yes","Yes","No","No","Yes","No","No","No","No","No",0,"No","Yes","No","No","No","Yes","No",0,"N/A","No","Yes","No","No","No","No","No","No","No","No","No","No","Yes","Yes","No","Yes","No","13/05/2020","26/05/2020","1,779 publications","English","English ",0,"No","No","No","No","No","No","Yes","No","N/A","Yes","No","Date of publication","No","80mins"]
["2020-08-06","Nkuli","",{"$f":"IFERROR(SEARCH('1. Searching Hubs'!$E$14, E146)+ROW()/100000,\"\")","v":""},"OECD Cities responses","https://read.oecd-ilibrary.org/view/?ref=126_126769-yen45847kf&title=Coronavirus-COVID-19-Cities-Policy-Responses","This note was developed by the OECD Centre for Entrepreneurship, SMEs, Regions and Cities (CFE) in collaboration with the OECD Working Party for Urban Policy and the OECD Champion Mayors Initiative for Inclusive Growth. It  is  an  update  of  the  version  released  on 27 March,  which  expands  the examples of measures taken by cities to respond to COVID-19 and provides analysis  on  issues  related  to  the  economic  impact,  density,  resilience  and collaboration with national governments. Short and medium term responses provided by cities are clustered around six categories: i) social distancing; ii) workplace and commuting; iii) vulnerable groups; iv) local service delivery; v) support  to  business;  and  vi)  communication,  awareness  raising  and  digital tools. The note also includes new information on how cities are progressively exiting the lockdown andon lessons learned in terms of density, mobility and digitalisation. Itconcludes with action-oriented guidance to build back better cities, building on previous work on urban resilience. Annex A provides more detailed information on the inventoried city initiatives. Annex B maps efforts from selected organisations and city networks to collect city responses and foster  knowledge  and  experience  sharing.  This  is  a  working  and  living document, whosenext versionwill be released by the endofJune.11More information is available at www.oecd.org/coronavirus.Cities Policy Responses\n","Global ","Yes","Yes","Yes","Yes","Yes","Yes","Yes","Yes","Yes","Yes","Yes","Yes","First category (at least one: having documents, epi info, or government responses)","Include","N/A","International Organization","N/A","Public",0,0,0,0,0,0,0,0,0,0,0,0,0,"No","No","No","Yes","No","No","No","No","N/A","No","Yes","Yes","Yes","Yes",0,0,0,0,0,0,0,0,0,"N/A","N/A","N/A","13/05/2020","2020-08-06","1 living document","English","English",0,"Yes","No","No","Yes","No","No","No","External links_Resource","N/A","Yes","No","Last update of the document","No","60 mins"]
[null,"Promise","",{"$f":"IFERROR(SEARCH('1. Searching Hubs'!$E$14, E147)+ROW()/100000,\"\")","v":""},"OECD Country Policy Tracker","https://oecd.github.io/OECD-covid-action-map/","What are countries doing to contain the spread of the coronavirus? How are countries helping people, small businesses and the economy to weather the crisis and beyond? This Country Policy Tracker helps you to navigate the global response.\n","Global ","Yes","Yes","Yes","Yes","Yes","Yes","Yes","Yes","Yes","Yes","Yes","Yes","First category (at least one: having documents, epi info, or government responses)","Include","N/A","International Organization","N/A","Public","No","Yes",0,0,0,0,0,0,0,0,0,0,0,"No","No","No","Yes","No","No","No",0,"N/A","No","No","No","No","No",0,0,0,0,0,0,0,0,0,"N/A","N/A","N/A","26/05/2020","26/05/2020","1: A country response map of country 96 ountry respones","English","English",0,"Yes","No","Yes","No","No","No","Yes","No","N/A","Yes","No","Last update of the document","No","30 mins"]
[null,"Promise","",{"$f":"IFERROR(SEARCH('1. Searching Hubs'!$E$14, E148)+ROW()/100000,\"\")","v":""},"OECD Employment & Social policy responses by country","http://www.oecd.org/social/Covid-19-Employment-and-Social-Policy-Responses-by-Country.xlsx","The information in this file has been compiled by the Employment, Labour and Social Affairs Directorate of the OECD building on the information collected by the country desks of the Economics Department and other sources. This table provides a summary of the social and employment policy measures that countries have taken (or announced) to help workers and companies weather the effect of Covid-19. The information may not be complete and readers are invited to provide corrections or complementary information to ELS.Contact@oecd.org. The table will be regularly updated.","Global ","Yes","Yes","Yes","Yes","Yes","Yes","Yes","Yes","Yes","Yes","Yes","Yes","First category (at least one: having documents, epi info, or government responses)","Include","N/A","International Organization","N/A","Public","No","No",0,0,0,0,0,0,0,0,0,0,0,"No","No","No","Yes","No","No","No",0,"N/A","No","No","No","No","No",0,0,0,0,0,0,0,0,0,"N/A","N/A","N/A","26/05/2020","26/05/2020","1: An excel sheet detailing government employment and social  responses to COVID 19 pandemic","English","English",0,"Yes","No","No","Yes","No","No","No","No","N/A","Yes","No","Last update of the document","Yes","28 mins"]
[null,"Nkuli","",{"$f":"IFERROR(SEARCH('1. Searching Hubs'!$E$14, E149)+ROW()/100000,\"\")","v":""},"OECD Health System Response Tracker","http://www.oecd.org/health/COVID19-OECD-Health-System-Response-Tracker.xlsx","This hub contains country-by-country information on the health system responses that countries continue to adopt amid the COVID 19 pandemic. In addition to this, the tracker provides information on general public health initiatives based on the fiscal support that is being provided by government.","Global ","Yes","Yes","Yes","Yes","Yes","Yes","Yes","Yes","Yes","Yes","Yes","Yes","First category (at least one: having documents, epi info, or government responses)","Include","N/A","International Organization","N/A","Public","No","Yes","No","No","No","No","No","No","No","No","No","No",0,"No","No","No","Yes","No","No","No",0,"N/A","No","No","Yes","No","No","Yes","Yes","Yes","Yes","Yes","Yes","No","Yes","Yes","N/A","N/A","N/A","20/05/2020","26/05/2020","1: An excel sheet detailing government health sector responses to COVID 19 pandemic","English","English","Health","Yes","No","No","Yes","No","No","No","External links_Other hubs & Resources ","N/A","Yes","No","Last update of the document","No","30 mins"]
["27/05/2020","Irvine","",{"$f":"IFERROR(SEARCH('1. Searching Hubs'!$E$14, E150)+ROW()/100000,\"\")","v":""},"OECD Knowledge Hub","https://www.oecd.org/coronavirus/en/","What are the impacts and consequences of the coronavirus pandemic on our lives and our societies – and what are some of the solutions we can find to boost our healthcare systems, secure our businesses, maintain our jobs and education, and stabilise financial markets and economies?","Global ","Yes","Yes","Yes","Yes","Yes","Yes","Yes","Yes","Yes","Yes","Yes","Yes","First category (at least one: having documents, epi info, or government responses)","Include","N/A","International Organization","N/A","Public","No","No",0,0,0,0,0,0,0,0,0,0,0,"Yes","Yes","Yes","Yes","No","No","No",0,"N/A","Yes","Yes","Yes","Yes","Yes",0,0,0,0,0,0,0,0,0,"Yes","No","No","22/05/2020","27/05/2020","Unclear","English","English",0,"Yes","No","Yes","No","Yes",0,"No","External links_Other hubs & Resources ","N/A","Yes","Yes","Date of publication","No"]
["2020-08-06","Andile","",{"$f":"IFERROR(SEARCH('1. Searching Hubs'!$E$14, E151)+ROW()/100000,\"\")","v":""},"OECD Multilevel Governance","https://read.oecd-ilibrary.org/view/?ref=128_128287-5agkkojaaa&title=The-territorial-impact-of-covid-19-managing-the-crisis-across-levels-of-government","This paper is developed by the OECD Centre for Entrepreneurship, SMEs, Regions and Cities (CFE). It focuses on the territorial dimension of the COVID-19 crisis andthe importance of the integrated response to the crisis across levels of government. ","Regional","No","No","Yes","Yes","No","Yes","No","No","Yes","Yes","Yes","Yes","First category (at least one: having documents, epi info, or government responses)","Include","N/A","International Organization","N/A","Public",0,0,0,0,0,0,0,0,0,0,0,0,0,"Yes","No","No","Yes","No","No","No","No","N/A","No","No","No","No","Yes",0,0,0,0,0,0,0,0,0,"N/A","N/A","N/A",43894,"2020-08-06","1 Document","English","English",0,"No","No","No","Yes","No","No","Yes","No","N/A","Yes","No","Last update of the document","No"]
["2020-01-06","Promise","",{"$f":"IFERROR(SEARCH('1. Searching Hubs'!$E$14, E152)+ROW()/100000,\"\")","v":""},"OECD Science and innovation policy responses by country","https://stip.oecd.org/Covid.html","Science and innovation (S&I) policies have crucial roles to play in our responses to the Covid-19 crisis, with countries introducing new S&I policy measures on an almost daily basis across the OECD.\n\nThere is considerable variety in the types of S&I policy measures and arrangements countries are using to respond to the Covid-19 crisis. This monitor seeks to collect information on these, to provide a cross-country information service that S&I policy makers can use when designing their own policies.","Global ","Yes","No","Yes","Yes","No","Yes","No","No","Yes","Yes","Yes","Yes","First category (at least one: having documents, epi info, or government responses)","Include","N/A","International Organization","N/A","Public",0,0,0,0,0,0,0,0,0,0,0,0,0,"No","No","No","Yes","No","No","No",0,"N/A","No","No","No","No","No",0,0,0,0,0,0,0,0,0,"N/A","N/A","N/A","Unclear","2020-01-05","52 country STI responses in the form of survey questions","English","English",0,"Yes","No","Yes","No","No","No","No","No","N/A","Yes","No","None of them","No","40 mins"]
["2020-09-06","Andile","",{"$f":"IFERROR(SEARCH('1. Searching Hubs'!$E$14, E153)+ROW()/100000,\"\")","v":""},"OECD SME Policy Responses","https://read.oecd-ilibrary.org/view/?ref=119_119680-di6h3qgi4x&title=Covid-19_SME_Policy_Responses","This note discusses how SMEs are affected by the current COVID-19 pandemic, reports on early evidence and estimates about the impact, and provides aninventory of country responses tofoster SME resilience. ","Global ","Yes","Yes","Yes","Yes","Yes","Yes","Yes","Yes","Yes","Yes","Yes","Yes","First category (at least one: having documents, epi info, or government responses)","Include","N/A","International Organization","N/A","Public",0,0,0,0,0,0,0,0,0,0,0,0,0,"Yes","No","No","Yes","No","No","No","No","N/A","No","No","No","No","Yes",0,0,0,0,0,0,0,0,0,"N/A","N/A","N/A","19/05/2020","2020-09-06","1 Document","English","English",0,"Yes","No","No","Yes","No","No","Yes","External links_Resource","N/A","Yes","No","Last update of the document","No"]
["2020-09-06","Irvine","",{"$f":"IFERROR(SEARCH('1. Searching Hubs'!$E$14, E154)+ROW()/100000,\"\")","v":""},"OECD SME Policy Responses","https://read.oecd-ilibrary.org/view/?ref=119_119680-di6h3qgi4x&title=Covid-19_SME_Policy_Responses","This note discusses how SMEs are affected by the current COVID-19 pandemic, reports on early evidence and estimates about the impact, and provides aninventory of country responses tofoster SME resilience. ","Global ","Yes","Yes","Yes","Yes","Yes","Yes","Yes","Yes","Yes","Yes","Yes","Yes","First category (at least one: having documents, epi info, or government responses)","Include","N/A","International Organization","N/A","Public",0,0,0,0,0,0,0,0,0,0,0,0,0,"Yes","No","No","Yes","No","No","No","No","N/A","No","No","No","No","Yes",0,0,0,0,0,0,0,0,0,"N/A","N/A","N/A","19/05/2020","2020-09-06","1 Document","English","English",0,"Yes","No","No","Yes","No","No","Yes","External links_Resource","N/A","Yes","No","Last update of the document","No","45 min"]
[null,"Andile","",{"$f":"IFERROR(SEARCH('1. Searching Hubs'!$E$14, E155)+ROW()/100000,\"\")","v":""},"OECD Tax policy responses by country","http://www.oecd.org/tax/covid-19-tax-policy-and-other-measures.xlsm","The excel table provides an overview of the tax policy measures that countries have implemented in response to the Covid-19 pandemic.                                                                                                                      In addition to tax policy measures, the table lists measures that are relevant to tax policy, such as changes in benefits and benefit entitlements.                                                                                                                        \n                                                               \n","Global ","Yes","Yes","Yes","Yes","Yes","Yes","Yes","Yes",0,"Yes","Yes","Yes","First category (at least one: having documents, epi info, or government responses)","Include","N/A","International Organization","N/A","Public","No","No",0,0,0,0,0,0,0,0,0,0,0,"No","No","No","Yes","No","No","No",0,"N/A","No","No","No","No","No",0,0,0,0,0,0,0,0,0,"N/A","N/A","N/A","Unclear","26/05/2020","1 Excel Sheet","English","English ",0,"Yes","No","No","No","No","No","Yes","External links_Resource","N/A","Yes","No","Last update of the document","No"]
["2020-09-06","Nkuli","",{"$f":"IFERROR(SEARCH('1. Searching Hubs'!$E$14, E156)+ROW()/100000,\"\")","v":""},"OECD Tourism Summary","https://read.oecd-ilibrary.org/view/?ref=124_124984-7uf8nm95se&Title=Covid-19:%20Tourism%20Policy%20Responses","The  tourism  economy has  been  heavilyhit bythecoronavirus (COVID-19) pandemic,  and  measures  introduced  to  contain  its spread. Depending on the duration of the crisis, revised scenarios indicate  thatthe potential shock could  range  between a 60-80%decline  in  the  international  tourism  economyin  2020. Beyond immediatemeasures  to  support  the  tourism  sector,  countries  are also   shifting   to   developrecovery   measures. These   include considerations   on   lifting   travel   restrictions, restoring   traveller confidence and rethinkingthe tourism sector for the future.\nThis living document details responses by governments that are related to the tourism sector.","Global ","Yes","Yes","Yes","Yes","Yes","Yes","Yes","Yes","Yes","Yes","Yes","Yes","First category (at least one: having documents, epi info, or government responses)","Include","N/A","International Organization","N/A","Public",0,0,0,0,0,0,0,0,0,0,0,0,0,"No","No","No","Yes","No","No","No","No","N/A","No","No","No","Yes","Yes",0,0,0,0,0,0,0,0,0,"N/A","N/A","N/A","29/05/2020","2020-09-06","1 living document","English","English",0,"Yes","No","No","Yes","No","No","No","External links_Resource","N/A","Yes","No","Last update of the document","No","53 mins"]
["2020-05-06","Irvine","",{"$f":"IFERROR(SEARCH('1. Searching Hubs'!$E$14, E157)+ROW()/100000,\"\")","v":""},"Ontario Health’s Quality Business Unit","https://www.hqontario.ca/Evidence-to-Improve-Care/Health-Technology-Assessment/Other-Publications/Special-Reports","Special Reports\nRead Health Quality Ontario's reports and publications, covering a wide range of health issues.","Sub-national","No","No","No","Yes","No","No","No","No","No","No","No","No","Second category (at least two: having expert opinions or others)","Include","N/A","Governments and public institutions","N/A","Public",0,0,0,0,0,0,0,0,0,0,0,0,0,"Yes","Yes","Yes","No","No","No","Yes","No","N/A","No","Yes","Yes","No","No",0,0,0,0,0,0,0,0,0,"Yes","Yes","No",43927,"2020-05-06","Unclear","English","English",0,"No","No","Yes","Yes","Yes","No","No","No","N/A","Yes","No","Date of publication","Yes"]
["2020-02-06","Andile","",{"$f":"IFERROR(SEARCH('1. Searching Hubs'!$E$14, E158)+ROW()/100000,\"\")","v":""},"Ontario Hospital Association","https://www.oha.com/news/updates-on-the-novel-coronavirus","​The OHA developed this webpage to keep members apprised of recent Ministry of Health updates regarding the novel coronavirus, and to highlight relevant resources for members. I","Sub-national","No","No","No","Yes","No","No","No","No","No","Yes","Yes","Yes","First category (at least one: having documents, epi info, or government responses)","Include","N/A","Governments and public institutions","N/A","Public",0,0,0,0,0,0,0,0,0,0,0,0,0,"No","No","No","No","No","No","No",0,"N/A","Yes","No","No","No","No",0,0,0,0,0,0,0,0,0,"No","No","No",43836,"2020-02-06","Unclear","English","English, French",0,"No","No","Yes","Yes","Yes","No","No","External links_Other hubs","N/A","Yes","No","None of them","No"]
["27/05/2020","Andile","",{"$f":"IFERROR(SEARCH('1. Searching Hubs'!$E$14, E159)+ROW()/100000,\"\")","v":""},"Ontario Ministry of Health","https://www.ontario.ca/page/how-ontario-is-responding-covid-19","Learn about coronavirus (COVID-19) cases in Ontario and how the province is keeping people safe.","Sub-national","No","No","No","Yes","No","No","No","No","No","Yes","Yes","Yes","First category (at least one: having documents, epi info, or government responses)","Include","N/A","Governments and public institutions","N/A","Public","No","No",0,0,0,0,0,0,0,0,0,0,0,"No","No","No","Yes","No","No","No",0,"N/A","No","No","No","No","No",0,0,0,0,0,0,0,0,0,"N/A","N/A","N/A","26/05/2020","27/05/2020","Unclear","English","English",0,"No","No","Yes","No","No","No","Yes","No","N/A","Yes","No","Date of publication","No"]
["2020-01-06","Andile","",{"$f":"IFERROR(SEARCH('1. Searching Hubs'!$E$14, E160)+ROW()/100000,\"\")","v":""},"Ontario Ministry of Health ,Ministry of Long-Term Care","http://www.health.gov.on.ca/en/pro/programs/publichealth/coronavirus/2019_guidance.aspx","The Ontario Ministry of Health ,Ministry of Long-Term Care hub has guidance documents for the health sector and other sectors","Sub-national","No","No","No","Yes","No","No","No","No","No","Yes","Yes",0,"First category (at least one: having documents, epi info, or government responses)","Include","N/A","Governments and public institutions","N/A","Public",0,0,0,0,0,0,0,0,0,0,0,0,0,"No","No","No","Yes","No","No","No",0,"N/A","No","No","No","No","No",0,0,0,0,0,0,0,0,0,"No","No","No","28/05/2020","2020-01-06","31 Guideline documents: 14 health sector resources, 4 Long-Term Care Home / Retirement Homes Resources, 5 Symptoms, Screening, and Testing Resources, 2 Mental Health Resources, 6 Guidance for Other Sectors","English","English, French ",0,"No","No","No","Yes","No","No","No","No","N/A","Yes","No","Date of publication","No"]
["2020-09-06","Andile","",{"$f":"IFERROR(SEARCH('1. Searching Hubs'!$E$14, E161)+ROW()/100000,\"\")","v":""},"Open COVID-19 policy dataset","https://blog.overton.io/blog/2020/03/31/open-covid-19-policy-dataset/","The COVID-19 policy dataset is a zip file of policy documents from 2020 relating to the COVID-19 pandemic (the search strategy is documented below). The documents are in PDF format and have an accompanying JSON file explaining their provenance: where they were collected from, their publication date, original location etc.","No geographical scope","N/A","N/A","N/A","N/A","N/A","N/A","N/A","N/A","N/A","N/A","Yes","Yes","First category (at least one: having documents, epi info, or government responses)","Include","N/A","Other","Online digital repository","Private not for profit",0,0,0,0,0,0,0,0,0,0,0,0,0,"No","No","No","No","No","No","No","No","N/A","No","Yes","No","No","No",0,0,0,0,0,0,0,0,0,"Yes","No","No","31/03/2020","2020-09-06","Unclear","English","English",0,"No","No","No","Yes","No","No","Yes","No","N/A","Yes","No","Date of publication","No"]
["2020-04-06","Andile","",{"$f":"IFERROR(SEARCH('1. Searching Hubs'!$E$14, E162)+ROW()/100000,\"\")","v":""},"Open government partnership","https://www.opengovpartnership.org/collecting-open-government-approaches-to-covid-19/","We believe the best role for OGP right now is to help create an open space for the community to share where they see open government approaches to tackling COVID-19 being implemented, either by governments themselves or civil society, citizens or the private sector.","Global ","Yes","Yes","Yes","Yes","Yes","Yes","Yes","Yes","Yes","Yes","Yes","Yes","First category (at least one: having documents, epi info, or government responses)","Include","N/A","NGO","N/A","Public",0,0,0,0,0,0,0,0,0,0,0,0,0,"No","No","No","Yes","No","No","No","No","N/A","No","No","No","No","No",0,0,0,0,0,0,0,0,0,"N/A","N/A","N/A","14/04/2020","2020-04-06","1 Excel sheet","English","English",0,"Yes","No","Yes","Yes","No","No","No","External links_Resource","N/A","Yes","No","None of them","No","50 mins"]
["28/05/2020","Andile","",{"$f":"IFERROR(SEARCH('1. Searching Hubs'!$E$14, E163)+ROW()/100000,\"\")","v":""},"Our World in Data Coronavirus Disease (COVID-19)","https://ourworldindata.org/coronavirus#citation","Which countries are doing better and which are doing worse? We built 207 country profiles which allow you to explore the statistics on the coronavirus pandemic for every country in the world.","Global ","Yes","Yes","Yes","Yes","Yes","Yes","Yes","Yes","Yes","Yes","Yes","Yes","First category (at least one: having documents, epi info, or government responses)","Include","N/A","Academic institution","N/A","Public","No","Yes",0,0,0,0,0,0,0,0,0,0,0,"Yes","No","No","No","No","No","No",0,"N/A","Yes","No","No","No","No",0,0,0,0,0,0,0,0,0,"No","Yes","Yes","27/05/2020","28/05/2020","Unclear","English","English",0,"No","No","Yes","Yes","Yes","No","Yes","No","N/A","Yes","No","Last update of the document","No"]
["2020-08-06","Irvine","",{"$f":"IFERROR(SEARCH('1. Searching Hubs'!$E$14, E164)+ROW()/100000,\"\")","v":""},"Our World In data Policy Responses to the Coronavirus Pandemic","https://ourworldindata.org/policy-responses-covid","Policy Responses to the Coronavirus Pandemic\n","Global ","Yes","Yes","Yes","Yes","Yes","Yes","Yes","Yes","Yes","Yes","Yes","Yes","First category (at least one: having documents, epi info, or government responses)","Include","N/A","NGO","N/A","Public",0,0,0,0,0,0,0,0,0,0,0,0,0,"No","Yes","No","Yes","No","No","Yes","No","N/A","Yes","Yes","Yes","Yes","Yes",0,0,0,0,0,0,0,0,0,"Yes","Yes","Yes","Unclear","2020-08-06","Unclear","English","English",0,"No","No","Yes","Yes","Yes","Yes","Yes","External links_Other hubs","N/A","Yes","No","Last update of the document","No"]
["2020-01-06","Irvine","",{"$f":"IFERROR(SEARCH('1. Searching Hubs'!$E$14, E165)+ROW()/100000,\"\")","v":""},"Oxford Evidence Service","https://www.cebm.net/covid-19/","Rapid evidence reviews, data analysis and thought-provoking writing relating to the coronavirus pandemic, updated regularly. The Centre for Evidence-Based Medicine thanks its major benefactors Maria and David Willetts for their generosity and support for the Oxford COVID-19 Evidence Service.","Global ","Yes","Yes","Yes","Yes","Yes","Yes","Yes","Yes","Yes","Yes","Yes","Yes","Second category (at least two: having expert opinions or others)","Include","N/A","Academic institution","N/A","Public",0,0,0,0,0,0,0,0,0,0,0,0,0,"Yes","Yes","Yes","No","No","Yes","Yes",0,"N/A","Yes","Yes","Yes","Yes","Yes",0,0,0,0,0,0,0,0,0,"Yes","Yes","No","30/05/2020","2020-01-05","Unclear","English","English",0,"No","No","Yes","Yes","Yes","Yes","No","External links_Resource","N/A","Yes","Yes","None of them","No"]
[null,"Andile","",{"$f":"IFERROR(SEARCH('1. Searching Hubs'!$E$14, E166)+ROW()/100000,\"\")","v":""},"Oxford Government response tracker","https://www.bsg.ox.ac.uk/research/research-projects/coronavirus-government-response-tracker","Governments are taking a wide range of measures in response to the COVID-19 outbreak. This tool aims to track and compare policy responses around the world, rigorously and consistently.","Global ","Yes","Yes","Yes","Yes","Yes","Yes","Yes","Yes","Yes","Yes","Yes","Yes","First category (at least one: having documents, epi info, or government responses)","Include","N/A","Academic institution","N/A","Public","No","No",0,0,0,0,0,0,0,0,0,0,0,"Yes","No","No","Yes","No","No","No",0,"N/A","No","No","No","No","No",0,0,0,0,0,0,0,0,0,"N/A","N/A","N/A","29/04/2019","26/05/2020","Unclear","English","English, Portuguese",0,"Yes","No","No","Yes","No","No","Yes","No","Press releases, Publication, Research update, In the media","Yes","Yes","None of them","No"]
["27/05/2020","Andile","",{"$f":"IFERROR(SEARCH('1. Searching Hubs'!$E$14, E167)+ROW()/100000,\"\")","v":""},"Pan American Health Organization","https://covid19-evidence.paho.org/?locale-attribute=en","This searchable database provides access to technical guidelines, scientific publications, and ongoing research protocols from the Americas and affected countries worldwide regarding the coronavirus disease (COVID-19) pandemic.\n\nRecommendations and guidance from the Pan American Health Organization and the World Health Organization are also included, making it a useful platform of trusted information for decision and policy-making authorities, researchers, health professionals, and individuals.\n\nThe literature is organized into three main categories: Save Lives, Protect Health Care Workers, and Slow the Spread. Other filters including subcategories, type of study, authorship, and language (English, Spanish, Portuguese, French, and others) are also available.","Regional","No","No","No","Yes","No","No","No","No","No","No","Yes","Yes","First category (at least one: having documents, epi info, or government responses)","Include","N/A","Other","Regional Organisation","Public","No","No",0,0,0,0,0,0,0,0,0,0,0,"No","No","No","No","No","No","No","No","N/A","No","Yes","No","No","No",0,0,0,0,0,0,0,0,0,"Yes","Yes","Yes","Unclear","2020-03-06","Unclear","English, Spanish, Portuguese(Brazil)","English, Spanish, Portuguese, French",0,"No","No","No","Yes","No","No","No","No","N/A","Yes","No","Date of publication","No"]
["2020-05-06","Nkuli","",{"$f":"IFERROR(SEARCH('1. Searching Hubs'!$E$14, E168)+ROW()/100000,\"\")","v":""},"Prison Policy Initiative","https://www.prisonpolicy.org/virus/virusresponse.html","On this page, we’re tracking which state and local governments are taking meaningful steps to protect people behind bars (and the general public). We’ve also published a detailed guide to what the criminal justice system should be doing, as well as several other resources about the coronavirus in prisons and jails.","National","No","No","No","Yes","No","No","No","No","No","Yes","Yes","Yes","Second category (at least two: having expert opinions or others)","Include","N/A","NGO","N/A","Public",0,0,0,0,0,0,0,0,0,0,0,0,0,"No","No","No","No","No","No","No","No","N/A","No","No","No","Yes","No",0,0,0,0,0,0,0,0,0,"No","No","No",43957,"2020-05-06","Unclear","English","English",0,"Yes","No","Yes","No","No","No","No","External links_Resource","N/A","Yes","Yes","None of them","No","44 mins"]
["2020-05-05","Irvine","",{"$f":"IFERROR(SEARCH('1. Searching Hubs'!$E$14, E169)+ROW()/100000,\"\")","v":""},"PROSPERO","https://www.crd.york.ac.uk/prospero/","PROSPERO accepts registrations for systematic reviews, rapid reviews and umbrella reviews. PROSPERO does not accept scoping reviews or literature scans. Sibling PROSPERO sites registers systematic reviews of human studies and systematic reviews of animal studies.","No geographical scope","N/A","N/A","N/A","N/A","N/A","N/A","N/A","N/A","N/A","N/A","Yes","Yes","First category (at least one: having documents, epi info, or government responses)","Include","N/A","Academic institution","N/A","Public",0,0,0,0,0,0,0,0,0,0,0,0,0,"Yes","No","No","No","No","Yes","No","No","N/A","Yes","Yes","Yes","Yes","No",0,0,0,0,0,0,0,0,0,"Yes","Yes","Yes","Unclear","2020-05-06","Unclear","English","English",0,"Yes","No","Yes","Yes","No","No","No","External links_Resource","N/A","Yes","No","Date of publication","No","50min"]
["2020-02-06","Andile","",{"$f":"IFERROR(SEARCH('1. Searching Hubs'!$E$14, E170)+ROW()/100000,\"\")","v":""},"Public Health England","https://phelibrary.koha-ptfs.co.uk/coronavirusinformation/","PHE Knowledge and Library Services (KLS) has produced this page to help those, working on the current coronavirus outbreak, to identify and access emerging evidence as it is published.","National","No","No","Yes","No","No","No","No","No","No","Yes","Yes","Yes","First category (at least one: having documents, epi info, or government responses)","Include","N/A","Governments and public institutions","N/A","Public",0,0,0,0,0,0,0,0,0,0,0,0,0,"No","No","Yes","No","No","No","No",0,"N/A","Yes","No","No","No","No",0,0,0,0,0,0,0,0,0,"No","No","No",43867,"2020-02-06","Unclear","English","English",0,"No","No","Yes","Yes","No","No","No","External links_Other hubs","N/A","Yes","No","None of them","No"]
["28/05/2020","Irvine","",{"$f":"IFERROR(SEARCH('1. Searching Hubs'!$E$14, E171)+ROW()/100000,\"\")","v":""},"Public Health Ontario","https://www.publichealthontario.ca/en/diseases-and-conditions/infectious-diseases/respiratory-diseases/novel-coronavirus","Since the outset, Public Health Ontario has been conducting laboratory testing and working with healthcare partners to expand testing capacity. We have also been working very closely with the Ministry of Health and local public health units to provide evidence and expertise to inform decisions and policy around surveillance, case and contact management, and infection control.","Sub-national","No","No","No","Yes","No","No","No","No","No","Yes","Yes","Yes","First category (at least one: having documents, epi info, or government responses)","Include","N/A","Governments and public institutions","N/A","Public",0,0,0,0,0,0,0,0,0,0,0,0,0,"Yes","Yes","Yes","Yes","Yes","Yes","Yes",0,"N/A",0,"Yes","Yes","Yes","Yes",0,0,0,0,0,0,0,0,0,"Yes","Yes","No","Unclear","28/05/2020","Unclear","English","English",0,"No","Yes","Yes","Yes","Yes","Yes","Yes","External links_Other hubs & Resources ","N/A","Yes","Yes","Last update of the document","No"]
["2020-03-06","Andile","",{"$f":"IFERROR(SEARCH('1. Searching Hubs'!$E$14, E172)+ROW()/100000,\"\")","v":""},"RCVS Knowledge","https://knowledge.rcvs.org.uk/covid-19/","This page provides clinical evidence, advice for professionals and employers, and infection control resources related to COVID-19, from a range of sources.","No geographical scope","N/A","N/A","N/A","N/A","N/A","N/A","N/A","N/A","N/A","N/A","Yes","Yes","First category (at least one: having documents, epi info, or government responses)","Include","N/A","Academic institution","N/A","Public",0,0,0,0,0,0,0,0,0,0,0,0,0,"No","No","No","No","No","No","No",0,"N/A","No","No","No","No","No",0,0,0,0,0,0,0,0,0,"No","No","No","Unclear","2020-03-06","Unclear","English","English",0,"No","No","Yes","Yes","Yes","No","No","External links_Other hubs","N/A","Yes","No","Last update of the document","No"]
["2020-04-06","Irvine","",{"$f":"IFERROR(SEARCH('1. Searching Hubs'!$E$14, E173)+ROW()/100000,\"\")","v":""},"Regional Educational Laboratories (RELs)","https://ies.ed.gov/ncee/edlabs/projects/covid-19/.","The U.S. Department of Education’s Institute of Education Sciences funds a network of 10 Regional Educational Laboratories (RELs). Each REL serves a designated region of the country and works with educators and policymakers to support a more evidence-based education system. In response to COVID-19, the RELs have collaborated to produce this series of evidence-based resources and guidance about teaching and learning in a remote environment, as well as other considerations brought by the pandemic.\n","National","No","No","No","Yes","Yes","No","No","No","No","Yes","Yes","Yes","Second category (at least two: having expert opinions or others)","Include","N/A","Governments and public institutions","N/A","Public",0,0,0,0,0,0,0,0,0,0,0,0,0,"No","Yes","Yes","No","Yes","No","Yes","No","N/A","No","No","No","Yes","No",0,0,0,0,0,0,0,0,0,"No","No","No","Unclear ","2020-04-06","Unclear","English","English",0,"Yes","No","Yes","Yes","Yes","Yes","Yes","No","N/A","Yes","Yes","None of them","No"]
["2020-02-06","Andile","",{"$f":"IFERROR(SEARCH('1. Searching Hubs'!$E$14, E174)+ROW()/100000,\"\")","v":""},"SAGE","https://journals.sagepub.com/coronavirus","SAGE believes in the power of the social and behavioral sciences to convert the best medical research into policies, practices, and procedures to improve – and even save – lives. This collection includes the latest medical research from SAGE related to the virus as well as top social and behavioral research to help individuals, communities, and leaders make the best decisions on dealing with the outbreak and its consequences.","No geographical scope","N/A","N/A","N/A","N/A","N/A","N/A","N/A","N/A","N/A","N/A","Yes","Yes","First category (at least one: having documents, epi info, or government responses)","Include","N/A","Other","Publisher","Public",0,0,0,0,0,0,0,0,0,0,0,0,0,"No","No","No","No","No","No","No",0,"N/A","No","No","No","No","No",0,0,0,0,0,0,0,0,0,"No","No","No","Unclear","2020-02-06","Unclear","English","English",0,"No","No","No","Yes","No","No","No","No","N/A","Yes","No","Date of publication","No"]
["2020-05-06","Nkuli","",{"$f":"IFERROR(SEARCH('1. Searching Hubs'!$E$14, E175)+ROW()/100000,\"\")","v":""},"Santé Public France","https://www.santepubliquefrance.fr/maladies-et-traumatismes/maladies-et-infections-respiratoires/infection-a-coronavirus/articles/covid-19-etat-des-connaissances-et-veille-documentaire","Find here all the current knowledge on COVID-19 through our daily documentary monitoring or our rapid syntheses of decision support produced in the context of progressive lifting of containment.\nKeep abreast of new knowledge related to COVID-19, its modes of transmission, its clinical forms, its contagiousness, its reproduction rate, but also effective protection measures, the impact of measures according to countries, etc. . to help the decision is a challenge.\nEvery day, in the fields of surveillance, prevention and health promotion alone, several hundred scientific articles are published, regardless of whether they are published according to conventional methods (i.e. in journals after peer review) or via uploading to open archives before this peer review. Gray literature from research institutes or national and international agencies is also exploding in these times of health crisis.\nPublic health France adapts to this context and to these needs of monitoring new knowledge in real time to meet its missions by carrying out:\n1. daily documentary monitoring;\n2. 'quick summaries' of knowledge.\nThis documentary watch and rapid syntheses of knowledge are made available on the website of Public Health France.","Global ","Yes","Yes","Yes","Yes","Yes","Yes","Yes","Yes","Yes","Yes","Yes","Yes","First category (at least one: having documents, epi info, or government responses)","Include","N/A","NGO","N/A","Public",0,0,0,0,0,0,0,0,0,0,0,0,0,"No","No","No","No","No","No","No","Yes","N/A","No","No","Yes","Yes","No",0,0,0,0,0,0,0,0,0,"No","No","No",43957,"2020-04-06","2 rapid reviews, 4 monthly lists of COVID-19 articles","French, English","French, English",0,"No","No","No","Yes","No","No","No","No","N/A","Yes","No","Date of publication","No","52 mins"]
["2020-04-06","Andile","",{"$f":"IFERROR(SEARCH('1. Searching Hubs'!$E$14, E176)+ROW()/100000,\"\")","v":""},"SocArxi Corona Net","https://coronanet-project.org/","The CoronaNet Research Project compiles a database on government responses to the corona virus. Our main focus is to collect as much information as we can about the various fine-grained actions governments are taking to defeat the coronavirus. This includes not only gathering information about which governments are responding to the coronavirus, but who they are targeting the policies toward (e.g. other countries), how they are doing it (e.g. travel restrictions, banning exports of masks) and when they are doing it.","Global ","Yes","Yes","Yes","Yes","Yes","Yes","Yes","Yes","Yes","Yes","Yes","Yes","First category (at least one: having documents, epi info, or government responses)","Include","N/A","Other","Preprint Server ","Private not for profit",0,0,0,0,0,0,0,0,0,0,0,0,0,"Yes","No","No","Yes","No","No","No","No","N/A","No","No","No","No","No",0,0,0,0,0,0,0,0,0,"No","Yes","Yes","Unclear","2020-04-06","Unclear","English","English",0,"No","No","Yes","Yes","No","No","Yes","No","N/A","Yes","No","None of them","No","40 mins"]
["27/05/2020","Irvine","",{"$f":"IFERROR(SEARCH('1. Searching Hubs'!$E$14, E177)+ROW()/100000,\"\")","v":""},"Social Science in Humanitarian Action","https://www.socialscienceinaction.org/update-novel-covid-19-outbreak/","This page collates resources and briefings on the ongoing COVID-19 outbreak. The Social Science in Humanitarian Action Platform is supporting response partners by mobilising networks of experts and through the production of evidence briefs highlighting key socio-cultural considerations relevant to the control of the disease.This page will be updated to include future briefs from both the Social Science in Humanitarian Action and other partners when available. We have also included links to other resource portals and relevant networks.","Global ","Yes","Yes","Yes","Yes","Yes","Yes","Yes","Yes","Yes","Yes","Yes","Yes","Second category (at least two: having expert opinions or others)","Include","N/A","International Organization","N/A","Public","Yes","Yes",0,0,0,0,0,0,0,0,0,0,0,"Yes","Yes","Yes","No","No","Yes","Yes",0,"N/A","Yes","Yes","Yes","Yes","Yes",0,0,0,0,0,0,0,0,0,"Yes","Yes","Yes","Unclear","27/05/2020","Unclear","English","English, Chinese and French",0,"Yes","No","Yes","Yes","No","No","No","External links_Resource","N/A","Yes","Yes","Date of publication","Yes"]
["2020-09-06","Promise","",{"$f":"IFERROR(SEARCH('1. Searching Hubs'!$E$14, E178)+ROW()/100000,\"\")","v":""},"Society of Critical Care Medicine","https://www.sccm.org/Disaster","The Society of Critical Care Medicine (SCCM) is rapidly developing and deploying resources to respond to coronavirus disease 2019 (COVID-19).. Thesse incude SCCM COVID-19 Journal Articles, CCM’s online courses, webcasts, guidelines and education specific to COVID-19. A registry of current hospital care patterns to evaluate the safety and observational effectiveness of COVID-19 practices and to determine the variations in practice across hospitals.","Global ","No","Yes","Yes","Yes","Yes","Yes","No","Yes","Yes","Yes","Yes","Yes","First category (at least one: having documents, epi info, or government responses)","Include","N/A","NGO","N/A","Public",0,0,0,0,0,0,0,0,0,0,0,0,0,"No","No","Yes","No","No","No","No","No","N/A","No","No","No","No","No",0,0,0,0,0,0,0,0,0,"No","No","No","Unclear","2020-09-06","Unclear","English","English.Some training resources are in Spanish, Portuguese, Japanese ",0,"No","No","No","Yes","Yes","Yes","Yes","No","N/A","Yes","No","Date of publication","No"]
["29/05/2020","Andile","",{"$f":"IFERROR(SEARCH('1. Searching Hubs'!$E$14, E179)+ROW()/100000,\"\")","v":""},"SPOR Evidence Alliance","https://sporevidencealliance.ca/","The SPOR Evidence Alliance is committed to promoting evidence-informed health policy, practice and service by providing context-sensitive and demand-driven up-to-date scientific evidence to decision-makers. This page showcases knowledge synthesis work being conducted by the Alliance researchers in response to decision-maker needs.","No geographical scope","Yes","Yes","Yes","Yes","Yes","Yes","Yes","Yes","Yes","Yes","Yes","Yes","First category (at least one: having documents, epi info, or government responses)","Include","N/A","Governments and public institutions","N/A","Private not for profit",0,0,0,0,0,0,0,0,0,0,0,0,0,"No","No","No","No","No","Yes","No",0,"N/A","No","No","No","No","No",0,0,0,0,0,0,0,0,0,"No","No","No","Unclear","29/05/2020","6 Rapid reviews","English","English",0,"No","No","No","Yes","No","No","No","No","N/A","Yes","No","None of them","No"]
["2020-09-06","Irvine","",{"$f":"IFERROR(SEARCH('1. Searching Hubs'!$E$14, E180)+ROW()/100000,\"\")","v":""},"Springer Nature","https://www.springernature.com/gp/researchers/campaigns/coronavirus?sap-outbound-id=EBFDEAFF51027DBB28A4802098ADB9B83D387595&mkt-key=005056B0331B1EE99CFA3FA6AE74CCB0","The need for continued access to research and learning has never been more important. We recognise our role in this and are working with global organisations, such as the World Health Organisation and the initiative from the White House Office of Science and Technology to make all relevant global research, and data, immediately available. We also continue to work directly with teachers, lecturers, librarians, students and institutions to support their work. See more from our CEO, Frank Vrancken Peeters.","No geographical scope","N/A","N/A","N/A","N/A","N/A","N/A","N/A","N/A","N/A","N/A","Yes","Yes","Second category (at least two: having expert opinions or others)","Include","N/A","Other","Journal","Public",0,0,0,0,0,0,0,0,0,0,0,0,0,"Yes","Yes","No","No","No","Yes","Yes","No","N/A","Yes","Yes","Yes","Yes","Yes",0,0,0,0,0,0,0,0,0,"Yes","No","No",43957,"2020-09-06","Uncertain","English","English",0,"No","No","Yes","Yes","No","Yes","Yes","External links_Resource","N/A","Yes","Yes","Date of publication","Yes"]
["29/05/2020","Promise","",{"$f":"IFERROR(SEARCH('1. Searching Hubs'!$E$14, E181)+ROW()/100000,\"\")","v":""},"SYREAF","http://www.syreaf.org/","A rapid review was undertaken for two questions of interest to veterinarians related to SARS-CoV-2, the virus associated with the disease COVID-19. As little evidence is available, we also assess other known human corona virus SARS and MERS. The full updated rapid review is available here. This is not peer reviewed.","Global ","Yes","Yes","Yes","Yes","Yes","Yes","Yes","Yes","Yes","Yes","Yes","Yes","First category (at least one: having documents, epi info, or government responses)","Include","N/A","Academic institution","N/A","Public",0,0,0,0,0,0,0,0,0,0,0,0,0,"No","No","No","No","No","No","No",0,"N/A","No","No","No","No","No",0,0,0,0,0,0,0,0,0,"No","No","N/A","29/04/2020","29/05/2020","1 rapid review","English","English",0,"No","No","No","Yes","No","No","No","No","N/A","Yes","No","Last update of the document","Yes","29 mins"]
["2020-04-06","Promise","",{"$f":"IFERROR(SEARCH('1. Searching Hubs'!$E$14, E182)+ROW()/100000,\"\")","v":""},"Tableau Public","https://public.tableau.com/profile/laborde6680#!/vizhome/ExportRestrictionsTracker/FoodExportRestrictionsTracker","An trade Tracker that indicates Products, Description, Statistics for binding measures and Number of HS4 restricted products where the country has a global market share (Kcal) above 5 percent.","Global ","Yes","Yes","Yes","Yes","Yes","Yes","Yes","Yes","Yes","Yes","Yes","Yes","First category (at least one: having documents, epi info, or government responses)","Include","N/A","Other","Private  company","Private for profit",0,0,0,0,0,0,0,0,0,0,0,0,0,"No","No","No","Yes","No","No","No","No","N/A","No","No","No","No","Yes",0,0,0,0,0,0,0,0,0,"N/A","N/A","N/A","28/05/2020","2020-04-06","Unclear","English","English",0,"Yes","No","Yes","No","No","No","Yes","No","N/A","Yes","No","Last update of the document","No"]
["2020-03-06","Andile","",{"$f":"IFERROR(SEARCH('1. Searching Hubs'!$E$14, E183)+ROW()/100000,\"\")","v":""},"TEPHINET Coronavirus Knowledge Hub","https://www.tephinet.org/tephinet-learning-center/coronavirus-knowledge-hub","Members of the FETP Learning Advisory Council (FLAC) have curated a list of reliable sources for learning on COVID-19 and related topics, relevant during an active infectious disease outbreak.","Global ","Yes","Yes","Yes","Yes","Yes","Yes","Yes","Yes","Yes","Yes","Yes","Yes","First category (at least one: having documents, epi info, or government responses)","Include","N/A","Other","Training program ","Public",0,0,0,0,0,0,0,0,0,0,0,0,0,"No","No","Yes","Yes","Yes","No","No",0,"N/A","No","No","No","No","No",0,0,0,0,0,0,0,0,0,"No","No","No","Unclear","2020-03-06","Unclear","English","English",0,"No","No","Yes","Yes","No","No","No","External links_Other hubs","N/A","Yes","No","Date of publication","No"]
["2020-05-06","Andile","",{"$f":"IFERROR(SEARCH('1. Searching Hubs'!$E$14, E184)+ROW()/100000,\"\")","v":""},"The Marshall Project Coronavirus Tracker","https://www.themarshallproject.org/2020/03/17/tracking-prisons-response-to-coronavirus","As COVID-19 spreads, states are suspending visits to prison facilities and limiting criminal court proceedings. We’re rounding up the changes as they occur. ","National","No","No","No","Yes","No","No","No","No","No","Yes","Yes","Yes","First category (at least one: having documents, epi info, or government responses)","Include","N/A","NGO","N/A","Public",0,0,0,0,0,0,0,0,0,0,0,0,0,"No","No","No","Yes","No","No","No","No","N/A","No","No","No","No","No",0,0,0,0,0,0,0,0,0,"No","No","No","18/05/2020","2020-05-06","Unclear","English","English",0,"Yes","No","Yes","No","No","No","Yes","External links_Resource","N/A","Yes","Yes","None of them","No"]
["2020-05-05","Promise","",{"$f":"IFERROR(SEARCH('1. Searching Hubs'!$E$14, E185)+ROW()/100000,\"\")","v":""},"Turning Research Into Practice (TRIP)","https://www.tripdatabase.com/search?criteria=covid-19+or+%22novel+coronavirus%22","A database or medical search engine showing  results for different type of resources using pre-defined search term covid-19 or \"novel coronavirus\"  ","No geographical scope","N/A","N/A","N/A","N/A","N/A","N/A","N/A","N/A","N/A","N/A","Yes","Yes","First category (at least one: having documents, epi info, or government responses)","Include","N/A","NGO","N/A","Public",0,0,0,0,0,0,0,0,0,0,0,0,0,"No","Yes","No","No","No","No","No","No","N/A","No","Yes","No","No","No",0,0,0,0,0,0,0,0,0,"Yes","Yes","Yes","Unclear","2020-05-06","1,514  articles","English","English",0,"No","No","Yes","Yes","Yes","No","No","External links_Other hubs & Resources ","N/A","Yes","No","None of them","Yes","60 mnins"]
["2020-01-06","Andile","",{"$f":"IFERROR(SEARCH('1. Searching Hubs'!$E$14, E186)+ROW()/100000,\"\")","v":""},"U.S. National Institutes of Health","https://www.nih.gov/health-information/coronavirus","US National Institutes of health's  official Coronavirus (Covid-19) online news and information portal.","National","No","No","No","Yes","No","No","No","No","No","Yes","Yes","Yes","First category (at least one: having documents, epi info, or government responses)","Include","N/A","Governments and public institutions","N/A","Public",0,0,0,0,0,0,0,0,0,0,0,0,0,"No","No","No","Yes","Yes","Yes","No",0,"N/A","No","Yes","No","No","No",0,0,0,0,0,0,0,0,0,"No","No","No","14/05/2020","2020-01-06","Unclear","English","English",0,"No","No","Yes","Yes","No","No","No","External links_Other hubs","N/A","Yes","No","Date of publication","Yes"]
["2020-05-06","Irvine","",{"$f":"IFERROR(SEARCH('1. Searching Hubs'!$E$14, E187)+ROW()/100000,\"\")","v":""},"U.S. Veterans’ Affairs (VA) Evidence Synthesis Program","http://www.covid19reviews.org/","Our goal of cataloging COVID-19 evidence reviews is to capture the work of evidence synthesis groups in the US and around the world to maximize our collective contributions to patients, frontline clinicians, researchers, and policymakers during the COVID-19 pandemic and avoid duplicating efforts. This catalog is maintained by staff at the VA Evidence Synthesis Program based in Portland, OR. We identify new evidence reviews and reviews in progress through literature searching and through correspondence with colleagues and content experts. We welcome your feedback and questions; please reach out to us at covid19reviews@gmail.com","Global ","Yes","Yes","Yes","Yes","Yes","Yes","Yes","Yes","Yes","Yes","Yes","Yes","First category (at least one: having documents, epi info, or government responses)","Include","N/A","Governments and public institutions","N/A","Public",0,0,0,0,0,0,0,0,0,0,0,0,0,"Yes","Yes","No","No","No","Yes","No","No","N/A","Yes","Yes","Yes","Yes","Yes",0,0,0,0,0,0,0,0,0,"Yes","Yes","No","Unclear","2020-05-06","Unclear","English","English",0,"No","No","Yes","Yes","No","No","No","No","N/A","Yes","No","Last update of the document","Yes","45 min"]
["2020-09-06","Nkuli","",{"$f":"IFERROR(SEARCH('1. Searching Hubs'!$E$14, E188)+ROW()/100000,\"\")","v":""},"UCLA Law Covid-19 Behind Bars Data Project","https://docs.google.com/spreadsheets/d/1X6uJkXXS-O6eePLxw2e4JeRtM41uPZ2eRcOA_HkPVTk/edit#gid=422276226","The spreadsheet provides comprehensive responses related to law and order in the United States during the COVID-19 pandemic (i.e. prison case tracking, releases, shortened sentences and measures taken in youth correction facilities). The information has been made available at both a national and county level.","National","No","No","No","Yes","No","No","No","No","No","Yes","Yes","Yes","First category (at least one: having documents, epi info, or government responses)","Include","N/A","NGO","N/A","Public",0,0,0,0,0,0,0,0,0,0,0,0,0,"No","No","No","Yes","Yes","No","No","No","N/A","Yes","No","No","Yes","No",0,0,0,0,0,0,0,0,0,"N/A","Yes","N/A","Unclear","2020-09-06","1 Google spreadhseet","English","English",0,"Yes","No","Yes","Yes","No","No","No","External links_Resource","N/A","Yes","No","None of them","No","40 mins"]
["2020-04-06","Promise","",{"$f":"IFERROR(SEARCH('1. Searching Hubs'!$E$14, E189)+ROW()/100000,\"\")","v":""},"UK government","https://www.gov.uk/government/groups/scientific-advisory-group-for-emergencies-sage-coronavirus-covid-19-response","The Scientific Advisory Group for Emergencies (SAGE) provides scientific and technical advice to support government decision makers during emergencies.","National","No","No","Yes","No","No","No","No","No","No","Yes","Yes","Yes","First category (at least one: having documents, epi info, or government responses)","Include","N/A","Governments and public institutions","N/A","Public",0,0,0,0,0,0,0,0,0,0,0,0,0,"Yes","No","No","No","No","No","No","No","N/A","No","Yes","No","No","No",0,0,0,0,0,0,0,0,0,"No","No","No","Unclear","2020-04-06","Unclear","English","English",0,"No","Yes","No","Yes","No","No","No","No","N/A","Yes","No","Date of publication","No","40 mins"]
["27/05/2020","Irvine","",{"$f":"IFERROR(SEARCH('1. Searching Hubs'!$E$14, E190)+ROW()/100000,\"\")","v":""},"UK Government (Previously put as DFID)","https://www.gov.uk/coronavirus","The best place to find UK government services and information Simpler, clearer, faster","National","No","No","No","No","No","No","No","No","No","Yes","Yes","Yes","First category (at least one: having documents, epi info, or government responses)","Include","N/A","Governments and public institutions","N/A","Public","No","Yes",0,0,0,0,0,0,0,0,0,0,0,"Yes","Yes","Yes","Yes","Yes","No","Yes","Yes","N/A","Yes","Yes","Yes","Yes","Yes",0,0,0,0,0,0,0,0,0,"Yes","No","No","Unclear","27/05/2020","Unclear","English","English","Health","Yes","No","Yes","No","Yes","No","No","External links_Other hubs & Resources ","N/A","Yes","Yes","None of them","No"]
[null,"Irvine","",{"$f":"IFERROR(SEARCH('1. Searching Hubs'!$E$14, E191)+ROW()/100000,\"\")","v":""},"UN Food and Agriculture Organisation(FAO)","http://www.fao.org/2019-ncov/en/","FAO has implemented an array of tools to support policy analyses and assess the impact of COVID-19 on on food and agriculture, value chains, food prices, food security across the globe.","Global ","Yes","Yes","Yes","Yes","Yes","Yes","Yes","Yes","Yes","Yes","Yes","Yes","First category (at least one: having documents, epi info, or government responses)","Include","N/A","International Organization","N/A","Public","No","No","No","No","No","No","No","No","No","No","Yes","No",0,"No","Yes","Yes","Yes","No","No","Yes",0,"N/A","No","No","Yes","Yes","Yes","No","No","No","No","No","No","No","No","No","Yes","Yes","Yes","Unclear","25/05/2020","Unclear","English, French,Russian,Mandarin & Japanese","English, French,Russian,Mandarin & Japanese","Food safety and security","Yes","No","Yes","No","No","Yes","Yes","External links_Other hubs & Resources ","Reports and articles","Yes","Yes","Date of publication","No","75 mins"]
[null,"Nkuli","",{"$f":"IFERROR(SEARCH('1. Searching Hubs'!$E$14, E192)+ROW()/100000,\"\")","v":""},"UN Habitat","https://unhabitat.org/covid-19-pandemic","UN-Habitat is responding to a growing volume of requests from both national and local governments to help them prepare for, prevent, respond to and recover from the COVID-19 pandemic. Building on more than 40 years of urban experience, much of it in humanitarian situations, we are focusing on the city-level response to the crisis.","Global ","Yes","Yes","No","Yes","Yes","No","Yes","Yes","Yes","Yes","Yes","Yes","First category (at least one: having documents, epi info, or government responses)","Include","N/A","International Organization","N/A","Public","No","Yes","No","No","No","No","No","No","No","Yes","No","No",0,"No","No","No","Yes","No","No","No",0,"N/A","No","No","No","Yes","Yes","No","No","No","Yes","No","Yes","No","No","No","No","No","No","Unclear","26/05/2020","Unclear","English","English, Russian. French, Arabic, Chinese (for five resources)","Culture and gender","Yes","No","Yes","Yes","No","No","Yes","External links_Resource","News articles, Posters","Yes","Yes","Date of publication","No","85 mins"]
[null,"Promise","",{"$f":"IFERROR(SEARCH('1. Searching Hubs'!$E$14, E193)+ROW()/100000,\"\")","v":""},"UN International Labour Organisation(ILO)","https://www.ilo.org/global/topics/coronavirus/lang--en/index.htm","The world of work is being profoundly affected by the global virus pandemic. In addition to the threat to public health, the economic and social disruption threatens the long-term livelihoods and wellbeing of millions. The ILO and its constituents – Governments, workers and employers – will play a crucial role in combating the outbreak, ensuring the safety of individuals and the sustainability of businesses and jobs.","Global ","Yes","Yes","Yes","Yes","Yes","Yes","Yes","Yes","Yes","Yes","Yes","Yes","First category (at least one: having documents, epi info, or government responses)","Include","N/A","International Organization","N/A","Public","No","Yes",0,0,0,0,0,0,0,0,0,0,0,"No","No","Yes","Yes","No","No","No",0,"N/A","No","No","No","Yes","Yes",0,0,0,0,0,0,0,0,0,"N/A","N/A","N/A","26/05/2020","26/05/2020","Country responses for 188 countries ","English","English",0,"Yes","No","Yes","Yes","Yes","No","No","No",0,"Yes","Yes","None of them","No","25 mins"]
[null,"Nkuli","",{"$f":"IFERROR(SEARCH('1. Searching Hubs'!$E$14, E194)+ROW()/100000,\"\")","v":""},"UNDP COVID 19 Dashboard","https://www.undp.org/content/undp/en/home/coronavirus.html#covid19dashboard","The pandemic is moving like a wave—one that may yet crash on those least able to cope.\n\nBut COVID-19 is much more than a health crisis. By stressing every one of the countries it touches, it has the potential to create devastating social, economic and political crises that will leave deep scars. As the UN’s lead agency on socio-economic impact and recovery, UNDP will provide the technical lead in the UN’s socio-economic recovery, supporting the  role of the Resident Coordinators, with UN teams working as one across all aspects of the response.","Global ","Yes","Yes","Yes","Yes","Yes","Yes","Yes","Yes","Yes","Yes","Yes","Yes","First category (at least one: having documents, epi info, or government responses)","Include","N/A","International Organization","N/A","Public","No","Yes","No","No","No","No","No","No","No","No","No","No",0,"No","No","No","Yes","Yes","No","Yes",0,"N/A","No","No","No","Yes","Yes","No","No","No","No","No","No","No","No","No","No","Yes","Yes","Unclear","26/05/2020","Unclear","English","Engilsh, French (for one resource)","Economic development and growth","Yes","No","Yes","Yes","Yes","No","No","No","N/A","Yes","Yes","Date of publication","No","62 mins"]
["2020-09-06","Promise",{"$f":"IFERROR(RANK(D195,D:D,1),\"\")","v":""},{"$f":"IFERROR(SEARCH('1. Searching Hubs'!$E$14, E195)+ROW()/100000,\"\")","v":""},"UNDP HDR Global Preparedness and Vulnerability Dashboard","http://hdr.undp.org/","A hub that assesses the effects of Covid-`19 from a human development perspective","Global ","Yes","Yes","Yes","Yes","Yes","Yes","Yes","Yes","Yes","Yes","Yes","Yes","First category (at least one: having documents, epi info, or government responses)","Include","N/A","International Organization","N/A","Public",0,0,0,0,0,0,0,0,0,0,0,0,0,"No","No","No","No","No","No","No","No","N/A","Yes","No","Yes","Yes","Yes",0,0,0,0,0,0,0,0,0,"No","No","No","Unclear","2020-09-06","1 Human Development Index (HDI) Ranking platform and 2 Covid-19 related documents","English","English",0,"Yes","No","Yes","Yes","No","No","No","No","N/A","Yes","No","Date of publication","No"]
[null,"Andile","",{"$f":"IFERROR(SEARCH('1. Searching Hubs'!$E$14, E196)+ROW()/100000,\"\")","v":""},"UNEP","https://www.unenvironment.org/covid-19-updates","The transmission of diseases, like the Novel Coronavirus COVID-19, between animals and humans (zoonoses) threatens economic development, animal and human well-being, and ecosystem integrity. The United Nations Environment Programme supports global efforts to protect biodiversity, to put an end to the illegal trade in wildlife, to safeguard the handling of chemicals and waste and to promote economic recovery plans that take nature and the climate emergency into account.","Global ","Yes","Yes","Yes","No","No","Yes","Yes","Yes","Yes","Yes","Yes","Yes","First category (at least one: having documents, epi info, or government responses)","Include","N/A","International Organization","N/A","Public","No","No","No","No","No","No","No","No","No","No","No","No",0,"No","No","Yes","No","No","No","No",0,"N/A","No","No","No","No","No","No","No","No","No","No","No","No","No","No","No","No","No","Unclear","26/05/2020","47: 34 Stories 3 Events 3 Press release 3 Reports 3 Related information Videos ","English, Arabic, Chinese, French, Russian, Spanish, Swahili","English, Arabic, Chinese, French, Russian, Spanish, Swahili ",0,"Yes","No","No","Yes","Yes","No","No","No","Stories, Press release","Yes","No","Date of publication","No","60mins"]
[null,"Andile","",{"$f":"IFERROR(SEARCH('1. Searching Hubs'!$E$14, E197)+ROW()/100000,\"\")","v":""},"UNESCO COVID-19","https://en.unesco.org/covid19","Most governments around the world have temporarily closed educational institutions in an attempt to contain the spread of the COVID-19 pandemic. These nationwide closures are impacting almost 70% of the world’s student population. Several other countries have implemented localized closures impacting millions of additional learners.","Global ","Yes","Yes","Yes","Yes","Yes","Yes","Yes","Yes","Yes","Yes","Yes","Yes","First category (at least one: having documents, epi info, or government responses)","Include","N/A","International Organization","N/A","Public","No","No",0,0,0,0,0,0,0,0,0,0,0,"Yes","No","Yes","Yes","No","No","Yes",0,"N/A","No","No","No","No","No",0,0,0,0,0,0,0,0,0,"N/A","N/A","N/A","Unclear","26/05/2020","Unclear","English, French, Spanish, Portuguese, Chinese","English, French, Spanish, Portuguese, Chinese",0,"Yes","No","No","Yes","Yes","No","Yes","No","Publications, Stories, Info hub, News, Ideas and opinions. For the media, Reports from the field","Yes","Yes","None of them","No"]
["2020-05-06","Nkuli","",{"$f":"IFERROR(SEARCH('1. Searching Hubs'!$E$14, E198)+ROW()/100000,\"\")","v":""},"UNESCO Planipolis","https://planipolis.iiep.unesco.org/","Planipolis is a portal of national education plans and policies and key education frameworks and monitoring reports.\n\nIt provides a single entry point to official education resources for national policy makers, donors and partners.","Global ","Yes","Yes","Yes","Yes","Yes","Yes","Yes","Yes","Yes","Yes","Yes","Yes","First category (at least one: having documents, epi info, or government responses)","Include","N/A","International Organization","N/A","Public",0,0,0,0,0,0,0,0,0,0,0,0,0,"No","No","No","Yes","No","No","No","No","N/A","No","No","Yes","Yes","Yes",0,0,0,0,0,0,0,0,0,"No","No","No","Unclear","2020-05-06","94 articles","English","English",0,"Yes","No","No","Yes","No","No","No","External links_Resource","N/A","Yes","No","Date of publication","No","40 mins"]
[null,"Andile","",{"$f":"IFERROR(SEARCH('1. Searching Hubs'!$E$14, E199)+ROW()/100000,\"\")","v":""},"UNICEF","https://www.unicef.org/coronavirus/covid-19","UNICEF is working with health experts to promote facts over fear, bringing trustworthy guidance to parents, caregivers and educators. We’re on the ground in more than 190 countries, partnering with front-line responders and providing them with the information and resources they need to keep children healthy and learning, protected from sickness and violence.","Global ","Yes","Yes","Yes","Yes","Yes","Yes","Yes","Yes","Yes","Yes","Yes","Yes","First category (at least one: having documents, epi info, or government responses)","Include","N/A","International Organization","N/A","Public","Yes","No","Yes","No","Yes","No","No","No","No","Yes","No","No",0,"No","No","No","No","No","Yes","No",0,"N/A","No","No","No","Yes","Yes","No","No","No","No","No","No","No","No","No","No","No","No","Unclear","26/05/2020","Unclear","English, French, Spanish, Arabic, Chinese","English",0,"Yes","No","No","Yes","Yes","No","No","No","Press releases, Articles, Photo Essay, Blogs and think pieces","Yes","No","Date of publication","No","70mins"]
["2020-04-06","Irvine","",{"$f":"IFERROR(SEARCH('1. Searching Hubs'!$E$14, E200)+ROW()/100000,\"\")","v":""},"UNIDO","https://iap.unido.org/articles/managing-covid-19-how-industrial-policy-can-mitigate-impact-pandemic?_ga=2.65846894.1956488358.1586987027-212321766.1586987027","Managing COVID-19: How industrial policy can mitigate the impact of the pandemic\nPolicy actions and coordination will be crucial in mitigating the impacts of the global pandemic on industry.","Global ","Yes","Yes","Yes","Yes","Yes","Yes","Yes","Yes","Yes","Yes","Yes","Yes","Second category (at least two: having expert opinions or others)","Include","N/A","International Organization","N/A","Public",0,0,0,0,0,0,0,0,0,0,0,0,0,"Yes","Yes","No","No","No","No","No","No","N/A","No","No","No","No","Yes",0,0,0,0,0,0,0,0,0,"Yes","No","No","Unclear","2020-04-06","Unclear","English","English",0,"No","No","Yes","Yes","No","No","No","External links_Resource","N/A","Yes","No","Date of publication","No"]
["2020-04-06","Promise","",{"$f":"IFERROR(SEARCH('1. Searching Hubs'!$E$14, E201)+ROW()/100000,\"\")","v":""},"United Nations Office for the Coordination of Humanitarian Affairs","https://data.humdata.org/event/covid-19","A compilation of Covid-19 related datasets including global cases and deaths, impacts , government responses,  travel restrictions, projections etc. It also has a visual  map showing shows the number of confirmed cases and deaths from the coronavirus disease (COVID-19) in locations with Humanitarian Response Plans (HRPs). ","Global ","Yes","Yes","Yes","Yes","Yes","Yes","Yes","Yes","Yes","Yes",0,"Yes","First category (at least one: having documents, epi info, or government responses)","Include","N/A","International Organization","N/A","Public",0,0,0,0,0,0,0,0,0,0,0,0,0,"No","No","No","Yes","No","No","No","No","N/A","Yes","No","No","Yes","Yes",0,0,0,0,0,0,0,0,0,"Yes","Yes","Yes",43927,"2020-04-06","63: 1. visual map and 62 datasets  of Covid-19 related including global cases and deaths(national and subnational, impacts , government responses,  travel restrictions, projections etc","English","English",0,"Yes","No","Yes","Yes","No","No","Yes","External links_Resource","N/A","Yes","No","Last update of the document",0,"60 mins"]
["2020-08-06","Andile","",{"$f":"IFERROR(SEARCH('1. Searching Hubs'!$E$14, E202)+ROW()/100000,\"\")","v":""},"Vera Institute of Justice","https://www.vera.org/blog/covid-19-1/use-this-data-to-hold-your-local-jail-accountable-during-the-pandemic","People in jails are among those most at risk of contracting COVID-19. Urgent action is needed to decarcerate all jails and prisons in the United States to protect public health and save lives. Vera will be regularly monitoring jail populations during this crisis.\nThe table below presents the most recent jail population data available, as well as the jail population before the crisis.","National","No","No","No","Yes","No","No","No","No","No","Yes","Yes","Yes","First category (at least one: having documents, epi info, or government responses)","Include","N/A","NGO","N/A","Private not for profit",0,0,0,0,0,0,0,0,0,0,0,0,0,"Yes","No","No","Yes","No","No","No","No","N/A","Yes","No","No","No","No",0,0,0,0,0,0,0,0,0,"No","Yes","Yes",44018,"2020-08-06","4: 1 Table, 3 Related blog posts","English","English",0,"Yes","Yes","Yes","No","No","No","Yes","No","N/A","Yes","No","Last update of the document","No"]
["27/05/2020","Andile","",{"$f":"IFERROR(SEARCH('1. Searching Hubs'!$E$14, E203)+ROW()/100000,\"\")","v":""},"VHL Regional Portal","https://bvsalud.org/vitrinas/en/post_vitrines/novel_coronavirus/","The VHL regional portal combines data from different organisations; namely the Pan American Health Organisation, World Health organisation and BIREME. ","Regional","No","No","Yes","Yes","No","No","No","No","Yes","Yes","Yes","Yes","First category (at least one: having documents, epi info, or government responses)","Include","N/A","Other","Regional Organisation","Public","Yes","No",0,0,0,0,0,0,0,0,0,0,0,"Yes","No","No","No","No","No","No","No","N/A","Yes","No","Yes","Yes","Yes",0,0,0,0,0,0,0,0,0,"Yes","Yes","Yes","Unclear","2020-03-06","Unclear","English, Portuguese, Spanish, French","English, Portuguese, Spanish, French",0,"No","No","No","Yes","Yes","No","Yes","External links_Other hubs","Courses, Communication materials, More reference sites","Yes","No","Date of publication","No"]
["2020-05-06","Andile","",{"$f":"IFERROR(SEARCH('1. Searching Hubs'!$E$14, E204)+ROW()/100000,\"\")","v":""},"Weekly Social Protection Links","https://www.ugogentilini.net/","A newsletter on latest research and practices from the world of social protection","Global ","Yes","Yes","Yes","Yes","Yes","Yes","Yes","Yes","Yes","Yes","Yes","Yes","First category (at least one: having documents, epi info, or government responses)","Include","N/A","Other","An economist","Private not for profit",0,0,0,0,0,0,0,0,0,0,0,0,0,"Yes","No","No","Yes","No","No","No","No","N/A","No","No","No","No","No",0,0,0,0,0,0,0,0,0,"No","No","No","29/06/2020","2020-05-06","Unclear","English","English",0,"Yes","No","Yes","Yes","No","No","Yes","External links_Resource","N/A","Yes","No","Last update of the document","No","30mins"]
["2020-05-06","Nkuli","",{"$f":"IFERROR(SEARCH('1. Searching Hubs'!$E$14, E205)+ROW()/100000,\"\")","v":""},"WHO Global research on coronavirus disease (COVID-19)","https://www.who.int/emergencies/diseases/novel-coronavirus-2019/global-research-on-novel-coronavirus-2019-ncov","WHO is bringing the world’s scientists and global health professionals together to accelerate the research and development process, and develop new norms and standards to contain the spread of the coronavirus pandemic and help care for those affected.\n\nThe R&D Blueprint has been activated to accelerate diagnostics, vaccines and therapeutics for this novel coronavirus. \n\nThe solidarity of all countries will be essential to ensure equitable access to COVID-19 health products.","Global ","Yes","Yes","Yes","Yes","Yes","Yes","Yes","Yes","Yes","Yes","Yes","Yes","First category (at least one: having documents, epi info, or government responses)","Include","N/A","International Organization","N/A","Public",0,0,0,0,0,0,0,0,0,0,0,0,0,"Yes","Yes","No","Yes","No","Yes","No","No","N/A","Yes","Yes","Yes","Yes","No",0,0,0,0,0,0,0,0,0,"No","Yes","No",43927,"2020-05-06","25203 articles","English","English, Spanish, Chinese, German, French, Japanese, Portuguese, Italian, Norwegian, Hungarian,  Dutch, Hebrew, Danish, Swedish, Icelandic, Polish, Russian, Turkish",0,"No","No","No","Yes","No","No","No","External links_Other hubs","N/A","Yes","No","Date of publication","No","62 mins"]
["2020-04-06","Irvine","",{"$f":"IFERROR(SEARCH('1. Searching Hubs'!$E$14, E206)+ROW()/100000,\"\")","v":""},"WHO R & D","https://www.who.int/blueprint/priority-diseases/key-action/novel-coronavirus/en/","The current COVID-19 pandemic is unprecedented, but the global response draws on the lessons learned from other disease outbreaks over the past several decades. As part of WHO’s response, the R&D Blueprint was activated to accelerate diagnostics, vaccines and therapeutics for this novel coronavirus. The Blueprint aims to improve coordination between scientists and global health professionals, accelerate the research and development process, and develop new norms and standards to learn from and improve upon the global response.","Global ","Yes","Yes","Yes","Yes","Yes","Yes","Yes","Yes","Yes","Yes","Yes","Yes","Second category (at least two: having expert opinions or others)","Include","N/A","International Organization","N/A","Public",0,0,0,0,0,0,0,0,0,0,0,0,0,"Yes","Yes","Yes","No","No","Yes","Yes","No","N/A","Yes","Yes","Yes","Yes","Yes",0,0,0,0,0,0,0,0,0,"Yes","No","No","Unclear","2020-04-06","Unclear","English","English",0,"No","No","Yes","Yes","Yes","Yes","Yes","External links_Resource","N/A","Yes","No","Date of publication","Yes"]
["2020-05-06","Nkuli","",{"$f":"IFERROR(SEARCH('1. Searching Hubs'!$E$14, E207)+ROW()/100000,\"\")","v":""},"WHO Regional Office for Europe (technical guidance)","http://www.euro.who.int/en/health-topics/health-emergencies/coronavirus-covid-19/novel-coronavirus-2019-ncov-technical-guidance/coronavirus-disease-covid-19-outbreak-technical-guidance-europe/strengthening-the-health-system-response-to-covid-19","WHO/Europe provides guidance to Member States on strengthening health systems and rapidly reorganizing service delivery to respond to COVID-19 while maintaining core essential services across the continuum of care so that no one is left behind. This overview of policy resources includes overall policy recommendations for a well-aligned health system response, technical guidance and checklists, and planning and monitoring tools.","Regional","No","No","Yes","No","No","No","Yes","Yes","Yes","Yes","Yes","Yes","First category (at least one: having documents, epi info, or government responses)","Include","N/A","International Organization","N/A","Public",0,0,0,0,0,0,0,0,0,0,0,0,0,"No","No","No","Yes","No","No","No","No",0,"No","No","Yes","No","No",0,0,0,0,0,0,0,0,0,"No","Yes","No","Unclear","2020-05-07","Unclear","English","English",0,"No","No","No","Yes","No","No","No","No","N/A","Yes","No","Date of publication","No","60 mins"]
["2020-09-06","Irvine","",{"$f":"IFERROR(SEARCH('1. Searching Hubs'!$E$14, E208)+ROW()/100000,\"\")","v":""},"Wiley Covid-19: Novel Coronavirus Outbreak","https://novel-coronavirus.onlinelibrary.wiley.com","Wiley is using this site to highlight newly published content – all free of access - related to the current COVID-19 outbreak. The most recent articles can be found below. From the navigation menu above, you will find links to archived content from the past few months, as well as Special Collections compiled by several individual journals and organizations. In addition to this site, Wiley is also making a collection of journal articles and our book chapters on coronavirus research freely available to the global scientific community. ","Global ","Yes","Yes","Yes","Yes","Yes","Yes","Yes","Yes","Yes","Yes","Yes","Yes","Second category (at least two: having expert opinions or others)","Include","N/A","Other","Journal","Public",0,0,0,0,0,0,0,0,0,0,0,0,0,"Yes","Yes","No","No","No","Yes","Yes","No","N/A","Yes","Yes",0,"Yes","Yes",0,0,0,0,0,0,0,0,0,"Yes","No","No",43867,"2020-09-06","Unclear","English","English",0,"No","No","Yes","Yes","No","No","No","No","N/A","Yes","No","Date of publication","No"]
["2020-03-06","Andile","",{"$f":"IFERROR(SEARCH('1. Searching Hubs'!$E$14, E209)+ROW()/100000,\"\")","v":""},"Wits Hub","https://www.wits.ac.za/covid19/","Find all the latest information from Wits University, and what we are doing for our community during this global pandemic. ","National","Yes","No","No","No","No","No","No","No","Yes","No","Yes","Yes","First category (at least one: having documents, epi info, or government responses)","Include","N/A","Academic institution","N/A","Public",0,0,0,0,0,0,0,0,0,0,0,0,0,"Yes","No","No","Yes","No","No","No","No","N/A","Yes","No","No","No","No",0,0,0,0,0,0,0,0,0,"No","No","No","Unclear","2020-03-06","Unclear","English","English",0,"No","No","Yes","No","No","No","Yes","External links_Other hubs","N/A","Yes","Yes","Date of publication","No"]
["2020-08-06","Promise","",{"$f":"IFERROR(SEARCH('1. Searching Hubs'!$E$14, E210)+ROW()/100000,\"\")","v":""},"Wolters Kluwer Global Infectious Diseases and Epidemiology Online Network (GIDEON)","http://tools.ovid.com/coronavirus/?utm_source=press-release&utm_medium=website&utm_campaign=coronavirus-pr","GIDEON, Global Infectious Diseases and Epidemiology Online Network, a unique resource dedicated to the detection, prevention, and education of infectious diseases, is ideal for anyone working in this critical, fast-paced field, including: clinicians, educators, policymakers, drug makers, and researchers.\n\nThis multimedia resource features up-to-date information and visual tools for diagnosing diseases and following the latest trends in epidemiology and treatment.","Global ","Yes","Yes","Yes","Yes","Yes","Yes","Yes","Yes","Yes","Yes","Yes","Yes","First category (at least one: having documents, epi info, or government responses)","Include","N/A","NGO","Journal /database","Public",0,0,0,0,0,0,0,0,0,0,0,0,0,"No","No","No","No","No","No","No","No","N/A","No","No","Yes","No","No",0,0,0,0,0,0,0,0,0,"Yes","Yes","No",43867,"2020-08-06","21111 citations ","English","English",0,"No","No","No","Yes","No","No","No","No","N/A","Yes","No","Date of publication","No"]
[null,"Andile","",{"$f":"IFERROR(SEARCH('1. Searching Hubs'!$E$14, E211)+ROW()/100000,\"\")","v":""},"World Bank Data","http://datatopics.worldbank.org/universal-health-coverage/covid19","This site provides an array of real-time data, statistical indicators, and other types of data that are relevant to the coronavirus pandemic. These data are drawn from the World Bank’s data catalog and other authoritative sources.","Global ","Yes","Yes","Yes","Yes","Yes","Yes","Yes","Yes","Yes","Yes","Yes","Yes","First category (at least one: having documents, epi info, or government responses)","Include","N/A","International Organization","N/A","Public","No","No",0,0,0,0,0,0,0,0,0,0,0,"Yes","No","No","No","No","No","No","No","N/A","Yes","No","No","No","Yes",0,0,0,0,0,0,0,0,0,"Yes","Yes","Yes","26/05/2020","26/05/2020","Unclear","English","English",0,"Yes","No","No","Yes","No","No","Yes","External links_Other hubs","N/A","Yes","No","Date of publication","No"]
["2020-03-06","Promise","",{"$f":"IFERROR(SEARCH('1. Searching Hubs'!$E$14, E212)+ROW()/100000,\"\")","v":""},"World Bank Education","https://www.worldbank.org/en/data/interactive/2020/03/24/world-bank-education-and-covid-19","A hub presenting global government responses in terms of school closures and a blog series of education and Covid-19","Global ","Yes","Yes","Yes","Yes","Yes","Yes","Yes","Yes","Yes","Yes","Yes","Yes","First category (at least one: having documents, epi info, or government responses)","Include","N/A","International Organization","N/A","Public",0,0,0,0,0,0,0,0,0,0,0,0,0,"No","No","Yes","Yes","No","No","No","No","N/A","No","No","Yes","Yes","Yes",0,0,0,0,0,0,0,0,0,"No","N/A","N/A",43867,"2020-03-06","1 global map indicating school closure statistics, 8 briefs on educational responses","English","English and for selected resources Russian, french,arabic, spanish, portuguese, chinese",0,"Yes","No","No","No","No","No","Yes","No","Blogs","Yes","Yes","Date of publication","No","46 mins"]
["2020-05-06","Irvine","",{"$f":"IFERROR(SEARCH('1. Searching Hubs'!$E$14, E213)+ROW()/100000,\"\")","v":""},"World Health Organization (WHO) technical guidelines","https://www.who.int/emergencies/diseases/novel-coronavirus-2019/technical-guidance","Country & Technical Guidance Covid 19 Disease","Global ","Yes","Yes","Yes","Yes","Yes","Yes","Yes","Yes","Yes","Yes","Yes","Yes","Second category (at least two: having expert opinions or others)","Include","N/A","International Organization","N/A","Public",0,0,0,0,0,0,0,0,0,0,0,0,0,"No","Yes","Yes","No","Yes","No","Yes","No","N/A","Yes","Yes",0,"Yes","Yes",0,0,0,0,0,0,0,0,0,"Yes","Yes","Yes","Unclear","2020-05-06","Unclear","English","English",0,"No","No","Yes","Yes","Yes","Yes","Yes","External links_Resource","N/A","Yes","Yes","Last update of the document","Yes","48 min"]
["2020-08-06","Nkuli","",{"$f":"IFERROR(SEARCH('1. Searching Hubs'!$E$14, E214)+ROW()/100000,\"\")","v":""},"World Pandemic Research Network (WPRN) ","https://wprn.org/","The World Pandemic Research Network (WPRN) is a platform serving research communities. It maintains a searchable global directory of the scientific resources available on the societal and human impacts of the Covid-19 pandemic. It shows who works on what, where, in real time, at global level.\n\nDesigned and maintained by researchers, WPRN is free, non-profit, public-funded, open (creative commons, open-source), GDPR compliant. It is steered by an international Advisory Board and supported by major scientific institutions and scientific networks worldwide.\n\nWPRN is the product of a collective scientific intelligence, with validation by senior scholars who act as referents in their fields.","Global ","Yes","Yes","Yes","Yes","Yes","Yes","Yes","Yes","Yes","Yes","Yes","Yes","First category (at least one: having documents, epi info, or government responses)","Include","N/A","NGO","N/A","Public",0,0,0,0,0,0,0,0,0,0,0,0,0,"Yes","No","No","No","No","Yes","No","Yes","N/A","Yes","Yes","Yes","Yes","Yes",0,0,0,0,0,0,0,0,0,"Yes","Yes","Yes","Unclear","2020-08-06","388 total entries for projects related to COVID-19/abstracts","English","English, French",0,"Yes","No","Yes","No","No","No","No","No","N/A","Yes","No","Date of publication","No","50 mins"]
[null,"Shona/Irvine","",{"$f":"IFERROR(SEARCH('1. Searching Hubs'!$E$14, E215)+ROW()/100000,\"\")","v":""},"Yale School of Management's Program COVID-19 Financial Response Tracker (CFRT)","https://som.yale.edu/faculty-research-centers/centers-initiatives/program-on-financial-stability/covid-19-crisis","The Yale Program on Financial Stability (YPFS) is tracking what governments across the world are doing in response to the crisis. Look here for a regularly updated tracker and blog posts on these interventions. In addition, materials from our study of previous financial crises could be of use to policymakers. For many previous interventions, we have summaries of key design decisions and evaluations of outcomes. We also have a rich online archive of implementing documents and public communications from these interventions.","Global ","Yes","Yes","Yes","Yes","Yes","Yes","Yes","Yes","Yes","Yes","Yes","Yes","First category (at least one: having documents, epi info, or government responses)","Include","N/A","Academic institution","N/A","Public","No","No",0,0,0,0,0,0,0,0,0,0,0,"No","Yes","No","Yes","No","No","Yes","No","N/A","No","No","No","No","Yes",0,0,0,0,0,0,0,0,0,"N/A","N/A","N/A","Unclear","30/04/2020","241: 108 case studies, 3 blog posts, 23 systematic risk blogs, 1 journal, 106 working papers.","English","English","Economic development and growth","No","No","Yes","Yes","Yes","No","No","No","N/A","Yes","Yes","Last update of the document","No"]
["2020-04-06","Irvine","",{"$f":"IFERROR(SEARCH('1. Searching Hubs'!$E$14, E216)+ROW()/100000,\"\")","v":""},"Zimbabwe COVID-19 Support Hub","https://zimcovid19.com","Delivering COVID-19 news, updates, information and initiatives in one place.","National","Yes","No","No","No","No","No","Yes","No","No","No","Yes","Yes","Second category (at least two: having expert opinions or others)","Include","N/A","NGO","N/A","Private not for profit",0,0,0,0,0,0,0,0,0,0,0,0,0,"No","Yes","No","Yes","No","No","No","No","N/A","Yes","Yes","No","No","No",0,0,0,0,0,0,0,0,0,"Yes","Yes","Yes","Unclear","2020-04-06","Unclear","English","English",0,"No","No","Yes","Yes","No","No","Yes","No","N/A","Yes","No","None of them","No"]

{"sheet":"3. Geographical scope","index":3,"n_rows":691,"n_cols":6,"rows_kept":691,"cut":false,"hidden":true,"merged":[]}
["Name of hub","WHO Region","Geographical scope of the Hub",null,"Key"]
["International Monetary Fund (IMF)","AFRO","Global ",{"$f":"COUNTIF($B$1:B2,B2)","v":1},{"$f":"B2&D2","v":"AFRO1"},{"$f":"A2","v":"International Monetary Fund (IMF)"}]
["World Bank Data","AFRO","Global ",{"$f":"COUNTIF($B$1:B3,B3)","v":2},{"$f":"B3&D3","v":"AFRO2"},{"$f":"A3","v":"World Bank Data"}]
["Covidbase","AFRO","Global ",{"$f":"COUNTIF($B$1:B4,B4)","v":3},"AFRO3","Covidbase"]
["Africa Evidence Network Hub","AFRO","Regional",{"$f":"COUNTIF($B$1:B5,B5)","v":4},"AFRO4","Africa Evidence Network Hub"]
["Oxford Government response tracker","AFRO","Global ",{"$f":"COUNTIF($B$1:B6,B6)","v":5},"AFRO5","Oxford Government response tracker"]
["Yale School of Management's Program COVID-19 Financial Response Tracker (CFRT)","AFRO","Global ",{"$f":"COUNTIF($B$1:B7,B7)","v":6},"AFRO6","Yale School of Management's Program COVID-19 Financial Response Tracker (CFRT)"]
["UNDP COVID 19 Dashboard","AFRO","Global ",{"$f":"COUNTIF($B$1:B8,B8)","v":7},"AFRO7","UNDP COVID 19 Dashboard"]
["UNICEF","AFRO","Global ",{"$f":"COUNTIF($B$1:B9,B9)","v":8},"AFRO8","UNICEF"]
["UNEP","AFRO","Global ",{"$f":"COUNTIF($B$1:B10,B10)","v":9},"AFRO9","UNEP"]
["OECD Tax policy responses by country","AFRO","Global ",{"$f":"COUNTIF($B$1:B11,B11)","v":10},"AFRO10","OECD Tax policy responses by country"]
["COVID-19 Research Project Tracker by UKCDR & GloPID-R","AFRO","Global ",{"$f":"COUNTIF($B$1:B12,B12)","v":11},"AFRO11","COVID-19 Research Project Tracker by UKCDR & GloPID-R"]
["UNESCO COVID-19","AFRO","Global ",{"$f":"COUNTIF($B$1:B13,B13)","v":12},"AFRO12","UNESCO COVID-19"]
["Johns Hopkins University and Medicine Coronavirus Resource Center","AFRO","Global ",{"$f":"COUNTIF($B$1:B14,B14)","v":13},"AFRO13","Johns Hopkins University and Medicine Coronavirus Resource Center"]
["McMaster COVID-19 evidence","AFRO","Global ",{"$f":"COUNTIF($B$1:B15,B15)","v":14},"AFRO14","McMaster COVID-19 evidence"]
["Economics for Inclusive Prosperity (Econflip)","AFRO","Global ",{"$f":"COUNTIF($B$1:B16,B16)","v":15},"AFRO15","Economics for Inclusive Prosperity (Econflip)"]
["Our World in Data Coronavirus Disease (COVID-19)","AFRO","Global ",{"$f":"COUNTIF($B$1:B17,B17)","v":16},"AFRO16","Our World in Data Coronavirus Disease (COVID-19)"]
["COVID-19 CoronaVirus South African Resource Portal","AFRO","National",{"$f":"COUNTIF($B$1:B18,B18)","v":17},"AFRO17","COVID-19 CoronaVirus South African Resource Portal"]
["China National Knowledge Infrastructure (CNKI)","AFRO","Global ",{"$f":"COUNTIF($B$1:B19,B19)","v":18},"AFRO18","China National Knowledge Infrastructure (CNKI)"]
["Elrha","AFRO","Global ",{"$f":"COUNTIF($B$1:B20,B20)","v":19},"AFRO19","Elrha"]
["COVID-19 Open Research Dataset","AFRO","Global ",{"$f":"COUNTIF($B$1:B21,B21)","v":20},"AFRO20","COVID-19 Open Research Dataset"]
["COVID 19 ZA Dashboard","AFRO","National",{"$f":"COUNTIF($B$1:B22,B22)","v":21},"AFRO21","COVID 19 ZA Dashboard"]
["LitCovid","AFRO","Global ",{"$f":"COUNTIF($B$1:B23,B23)","v":22},"AFRO22","LitCovid"]
["TEPHINET Coronavirus Knowledge Hub","AFRO","Global ",{"$f":"COUNTIF($B$1:B24,B24)","v":23},"AFRO23","TEPHINET Coronavirus Knowledge Hub"]
["Wits Hub","AFRO","National",{"$f":"COUNTIF($B$1:B25,B25)","v":24},"AFRO24","Wits Hub"]
["DynaMed","AFRO","Global ",{"$f":"COUNTIF($B$1:B26,B26)","v":25},"AFRO25","DynaMed"]
["Open government partnership","AFRO","Global ",{"$f":"COUNTIF($B$1:B27,B27)","v":26},"AFRO26","Open government partnership"]
["SocArxi Corona Net","AFRO","Global ",{"$f":"COUNTIF($B$1:B28,B28)","v":27},"AFRO27","SocArxi Corona Net"]
["Communication Initiative","AFRO","Global ",{"$f":"COUNTIF($B$1:B29,B29)","v":28},"AFRO28","Communication Initiative"]
["Guidelines Network International","AFRO","Global ",{"$f":"COUNTIF($B$1:B30,B30)","v":29},"AFRO29","Guidelines Network International"]
["ECRI Guidelines Trust COVID-19 Resource Center","AFRO","Global ",{"$f":"COUNTIF($B$1:B31,B31)","v":30},"AFRO30","ECRI Guidelines Trust COVID-19 Resource Center"]
["George Institute","AFRO","Global ",{"$f":"COUNTIF($B$1:B32,B32)","v":31},"AFRO31","George Institute"]
["European Respiratory Society","AFRO","Global ",{"$f":"COUNTIF($B$1:B33,B33)","v":32},"AFRO32","European Respiratory Society"]
["Weekly Social Protection Links","AFRO","Global ",{"$f":"COUNTIF($B$1:B34,B34)","v":33},"AFRO33","Weekly Social Protection Links"]
["International Network for Government Science Advice (INGSA)","AFRO","Global ",{"$f":"COUNTIF($B$1:B35,B35)","v":34},"AFRO34","International Network for Government Science Advice (INGSA)"]
["Gulag Echoes project","AFRO","Global ",{"$f":"COUNTIF($B$1:B36,B36)","v":35},"AFRO35","Gulag Echoes project"]
["ILO Social Protection Monitor","AFRO","Global ",{"$f":"COUNTIF($B$1:B37,B37)","v":36},"AFRO36","ILO Social Protection Monitor"]
["Malcolm Wiener Centre for Social Policy Monitoring the Covid-19 Employment Response: Policy Approaches Across Countries","AFRO","Global ",{"$f":"COUNTIF($B$1:B38,B38)","v":37},"AFRO37","Malcolm Wiener Centre for Social Policy Monitoring the Covid-19 Employment Response: Policy Approaches Across Countries"]
["Global Health 5050 COVID-19 sex-disaggregated data tracker","AFRO","Global ",{"$f":"COUNTIF($B$1:B39,B39)","v":38},"AFRO38","Global Health 5050 COVID-19 sex-disaggregated data tracker"]
["Dimensions COVID-19","AFRO","Global ",{"$f":"COUNTIF($B$1:B40,B40)","v":39},"AFRO39","Dimensions COVID-19"]
["OECD SME Policy Responses","AFRO","Global ",{"$f":"COUNTIF($B$1:B41,B41)","v":40},"AFRO40","OECD SME Policy Responses"]
["Global overview of COVID-19: Impact on elections","AFRO","Global ",{"$f":"COUNTIF($B$1:B42,B42)","v":41},"AFRO41","Global overview of COVID-19: Impact on elections"]
["Conflict and Covid-19 Resource Hub","AFRO","Global ",{"$f":"COUNTIF($B$1:B43,B43)","v":42},"AFRO42","Conflict and Covid-19 Resource Hub"]
["Coronavirus: prison fever","AFRO","Global ",{"$f":"COUNTIF($B$1:B44,B44)","v":43},"AFRO43","Coronavirus: prison fever"]
["Candid Philanthropic Funding Data","AFRO","Global ",{"$f":"COUNTIF($B$1:B45,B45)","v":44},"AFRO44","Candid Philanthropic Funding Data"]
["Coronavirus Research Repository","AFRO","Global ",{"$f":"COUNTIF($B$1:B46,B46)","v":45},"AFRO45","Coronavirus Research Repository"]
["UN Habitat","AFRO","Global ",{"$f":"COUNTIF($B$1:B47,B47)","v":46},"AFRO46","UN Habitat"]
["UN Food and Agriculture Organisation(FAO)","AFRO","Global ",{"$f":"COUNTIF($B$1:B48,B48)","v":47},"AFRO47","UN Food and Agriculture Organisation(FAO)"]
["Centers for Disease Control and Prevention","AFRO","Global ",{"$f":"COUNTIF($B$1:B49,B49)","v":48},"AFRO48","Centers for Disease Control and Prevention"]
["OECD Country Policy Tracker","AFRO","Global ",{"$f":"COUNTIF($B$1:B50,B50)","v":49},"AFRO49","OECD Country Policy Tracker"]
["OECD Health System Response Tracker","AFRO","Global ",{"$f":"COUNTIF($B$1:B51,B51)","v":50},"AFRO50","OECD Health System Response Tracker"]
["OECD Employment & Social policy responses by country","AFRO","Global ",{"$f":"COUNTIF($B$1:B52,B52)","v":51},"AFRO51","OECD Employment & Social policy responses by country"]
["UN International Labour Organisation(ILO)","AFRO","Global ",{"$f":"COUNTIF($B$1:B53,B53)","v":52},"AFRO52","UN International Labour Organisation(ILO)"]
["Institute for Health Metrics and Evaluation (IHME)","AFRO","Global ",{"$f":"COUNTIF($B$1:B54,B54)","v":53},"AFRO53","Institute for Health Metrics and Evaluation (IHME)"]
["OECD Knowledge Hub","AFRO","Global ",{"$f":"COUNTIF($B$1:B55,B55)","v":54},"AFRO54","OECD Knowledge Hub"]
["AU","AFRO","Regional",{"$f":"COUNTIF($B$1:B56,B56)","v":55},"AFRO55","AU"]
["COVID-19 and Citizen Science","AFRO","Global ",{"$f":"COUNTIF($B$1:B57,B57)","v":56},"AFRO56","COVID-19 and Citizen Science"]
["COVID 19 Africa Data Research","AFRO","Regional",{"$f":"COUNTIF($B$1:B58,B58)","v":57},"AFRO57","COVID 19 Africa Data Research"]
["NMA","AFRO","Global ",{"$f":"COUNTIF($B$1:B59,B59)","v":58},"AFRO58","NMA"]
["Social Science in Humanitarian Action","AFRO","Global ",{"$f":"COUNTIF($B$1:B60,B60)","v":59},"AFRO59","Social Science in Humanitarian Action"]
["EPI-WIN (WHO Information for Network for Epidemics)","AFRO","Global ",{"$f":"COUNTIF($B$1:B61,B61)","v":60},"AFRO60","EPI-WIN (WHO Information for Network for Epidemics)"]
["Hewlett Foundation","AFRO","Global ",{"$f":"COUNTIF($B$1:B62,B62)","v":61},"AFRO61","Hewlett Foundation"]
["Development aid","AFRO","Global ",{"$f":"COUNTIF($B$1:B63,B63)","v":62},"AFRO62","Development aid"]
["NICD","AFRO","National",{"$f":"COUNTIF($B$1:B64,B64)","v":63},"AFRO63","NICD"]
["Kenyan government","AFRO","National",{"$f":"COUNTIF($B$1:B65,B65)","v":64},"AFRO64","Kenyan government"]
["Ghana government","AFRO","National",{"$f":"COUNTIF($B$1:B66,B66)","v":65},"AFRO65","Ghana government"]
["Coronavirus Tech Handbook","AFRO","Global ",{"$f":"COUNTIF($B$1:B67,B67)","v":66},{"$f":"B67&D67","v":"AFRO66"},{"$f":"A67","v":"Coronavirus Tech Handbook"}]
["Covid-19 Innovations","AFRO","Global ",{"$f":"COUNTIF($B$1:B68,B68)","v":67},"AFRO67","Covid-19 Innovations"]
["SYREAF","AFRO","Global ",{"$f":"COUNTIF($B$1:B69,B69)","v":68},"AFRO68","SYREAF"]
["OECD Science and innovation policy responses by country","AFRO","Global ",{"$f":"COUNTIF($B$1:B70,B70)","v":69},"AFRO69","OECD Science and innovation policy responses by country"]
["CHAIN","AFRO","Global ",{"$f":"COUNTIF($B$1:B71,B71)","v":70},"AFRO70","CHAIN"]
["Oxford Evidence Service","AFRO","Global ",{"$f":"COUNTIF($B$1:B72,B72)","v":71},"AFRO71","Oxford Evidence Service"]
["COVID-19 Economic Stimulus Index","AFRO","Global ",{"$f":"COUNTIF($B$1:B73,B73)","v":72},"AFRO72","COVID-19 Economic Stimulus Index"]
["Nigerian government","AFRO","National",{"$f":"COUNTIF($B$1:B74,B74)","v":73},"AFRO73","Nigerian government"]
["World Bank Education","AFRO","Global ",{"$f":"COUNTIF($B$1:B75,B75)","v":74},"AFRO74","World Bank Education"]
["Covid 19 Africa Watch","AFRO","Regional",{"$f":"COUNTIF($B$1:B76,B76)","v":75},"AFRO75","Covid 19 Africa Watch"]
["American College of Cardiology","AFRO","Global ",{"$f":"COUNTIF($B$1:B77,B77)","v":76},"AFRO76","American College of Cardiology"]
["International Long Term Care Policy Network","AFRO","Global ",{"$f":"COUNTIF($B$1:B78,B78)","v":77},"AFRO77","International Long Term Care Policy Network"]
["Elsevier Novel Coronavirus Information Center","AFRO","Global ",{"$f":"COUNTIF($B$1:B79,B79)","v":78},"AFRO78","Elsevier Novel Coronavirus Information Center"]
["International trade centre","AFRO","Global ",{"$f":"COUNTIF($B$1:B80,B80)","v":79},"AFRO79","International trade centre"]
["WHO R & D","AFRO","Global ",{"$f":"COUNTIF($B$1:B81,B81)","v":80},"AFRO80","WHO R & D"]
["United Nations Office for the Coordination of Humanitarian Affairs","AFRO","Global ",{"$f":"COUNTIF($B$1:B82,B82)","v":81},"AFRO81","United Nations Office for the Coordination of Humanitarian Affairs"]
["UNIDO","AFRO","Global ",{"$f":"COUNTIF($B$1:B83,B83)","v":82},"AFRO82","UNIDO"]
["International Centre for not-for-profit law","AFRO","Global ",{"$f":"COUNTIF($B$1:B84,B84)","v":83},"AFRO83","International Centre for not-for-profit law"]
["Zimbabwe COVID-19 Support Hub","AFRO","National",{"$f":"COUNTIF($B$1:B85,B85)","v":84},"AFRO84","Zimbabwe COVID-19 Support Hub"]
["Asian Development Bank","AFRO","Global ",{"$f":"COUNTIF($B$1:B86,B86)","v":85},"AFRO85","Asian Development Bank"]
["Tableau Public","AFRO","Global ",{"$f":"COUNTIF($B$1:B87,B87)","v":86},"AFRO86","Tableau Public"]
["Havard Dataverse","AFRO","Global ",{"$f":"COUNTIF($B$1:B88,B88)","v":87},"AFRO87","Havard Dataverse"]
["WHO Global research on coronavirus disease (COVID-19)","AFRO","Global ",{"$f":"COUNTIF($B$1:B89,B89)","v":88},"AFRO88","WHO Global research on coronavirus disease (COVID-19)"]
["World Health Organization (WHO) technical guidelines","AFRO","Global ",{"$f":"COUNTIF($B$1:B90,B90)","v":89},"AFRO89","World Health Organization (WHO) technical guidelines"]
["UNESCO Planipolis","AFRO","Global ",{"$f":"COUNTIF($B$1:B91,B91)","v":90},"AFRO90","UNESCO Planipolis"]
["U.S. Veterans’ Affairs (VA) Evidence Synthesis Program","AFRO","Global ",{"$f":"COUNTIF($B$1:B92,B92)","v":91},"AFRO91","U.S. Veterans’ Affairs (VA) Evidence Synthesis Program"]
["Santé Public France","AFRO","Global ",{"$f":"COUNTIF($B$1:B93,B93)","v":92},"AFRO92","Santé Public France"]
["Campbell UK and Ireland","AFRO","Global ",{"$f":"COUNTIF($B$1:B94,B94)","v":93},"AFRO93","Campbell UK and Ireland"]
["Africaxiv","AFRO","Regional",{"$f":"COUNTIF($B$1:B95,B95)","v":94},"AFRO94","Africaxiv"]
["Our World In data Policy Responses to the Coronavirus Pandemic","AFRO","Global ",{"$f":"COUNTIF($B$1:B96,B96)","v":95},"AFRO95","Our World In data Policy Responses to the Coronavirus Pandemic"]
["Wolters Kluwer Global Infectious Diseases and Epidemiology Online Network (GIDEON)","AFRO","Global ",{"$f":"COUNTIF($B$1:B97,B97)","v":96},"AFRO96","Wolters Kluwer Global Infectious Diseases and Epidemiology Online Network (GIDEON)"]
["European Society of Intensive Care Medicine","AFRO","Global ",{"$f":"COUNTIF($B$1:B98,B98)","v":97},"AFRO97","European Society of Intensive Care Medicine"]
["Health Data Research UK","AFRO","Global ",{"$f":"COUNTIF($B$1:B99,B99)","v":98},"AFRO98","Health Data Research UK"]
["CGD - COVID education policy tracking","AFRO","Global ",{"$f":"COUNTIF($B$1:B100,B100)","v":99},"AFRO99","CGD - COVID education policy tracking"]
["World Pandemic Research Network (WPRN) ","AFRO","Global ",{"$f":"COUNTIF($B$1:B101,B101)","v":100},"AFRO100","World Pandemic Research Network (WPRN) "]
["OECD Cities responses","AFRO","Global ",{"$f":"COUNTIF($B$1:B102,B102)","v":101},"AFRO101","OECD Cities responses"]
["International Growth Centre(ICG)","AFRO","Regional",{"$f":"COUNTIF($B$1:B103,B103)","v":102},"AFRO102","International Growth Centre(ICG)"]
["EY COVID-19 Global Trade Considerations tracker ","AFRO","Global ",{"$f":"COUNTIF($B$1:B104,B104)","v":103},"AFRO103","EY COVID-19 Global Trade Considerations tracker "]
["OECD SME Policy Responses","AFRO","Global ",{"$f":"COUNTIF($B$1:B105,B105)","v":104},"AFRO104","OECD SME Policy Responses"]
["CIAT/IOTA/OECD Tax Response","AFRO","Global ",{"$f":"COUNTIF($B$1:B106,B106)","v":105},"AFRO105","CIAT/IOTA/OECD Tax Response"]
["IFPRI Covid 19 Food Trade Policy Tracker","AFRO","Global ",{"$f":"COUNTIF($B$1:B107,B107)","v":106},"AFRO106","IFPRI Covid 19 Food Trade Policy Tracker"]
["Global Health Network Covid-19 Research Implementation Hub","AFRO","Global ",{"$f":"COUNTIF($B$1:B108,B108)","v":107},"AFRO107","Global Health Network Covid-19 Research Implementation Hub"]
["OECD Tourism Summary","AFRO","Global ",{"$f":"COUNTIF($B$1:B109,B109)","v":108},"AFRO108","OECD Tourism Summary"]
["Kaggle","AFRO","Global ",{"$f":"COUNTIF($B$1:B110,B110)","v":109},"AFRO109","Kaggle"]
["Google Covid-19 Community Mobility Reports","AFRO","Global ",{"$f":"COUNTIF($B$1:B111,B111)","v":110},"AFRO110","Google Covid-19 Community Mobility Reports"]
["Wiley Covid-19: Novel Coronavirus Outbreak","AFRO","Global ",{"$f":"COUNTIF($B$1:B112,B112)","v":111},"AFRO111","Wiley Covid-19: Novel Coronavirus Outbreak"]
["COVID-19 Disorder Tracker (CDT)","AFRO","Global ",{"$f":"COUNTIF($B$1:B113,B113)","v":112},"AFRO112","COVID-19 Disorder Tracker (CDT)"]
["African Policy Monitor","AFRO","Regional",{"$f":"COUNTIF($B$1:B114,B114)","v":113},"AFRO113","African Policy Monitor"]
["Global Policy Responses – Developed Markets ","AFRO","Regional",{"$f":"COUNTIF($B$1:B115,B115)","v":114},"AFRO114","Global Policy Responses – Developed Markets "]
["Economic Relief Around the World","AFRO","Global ",{"$f":"COUNTIF($B$1:B116,B116)","v":115},"AFRO115","Economic Relief Around the World"]
["Impact Peace Resources on Covid","AFRO","Global ",{"$f":"COUNTIF($B$1:B117,B117)","v":116},"AFRO116","Impact Peace Resources on Covid"]
["EBSCO Medical","AFRO","Global ",{"$f":"COUNTIF($B$1:B118,B118)","v":117},"AFRO117","EBSCO Medical"]
["UNDP HDR Global Preparedness and Vulnerability Dashboard","AFRO","Global ",{"$f":"COUNTIF($B$1:B119,B119)","v":118},"AFRO118","UNDP HDR Global Preparedness and Vulnerability Dashboard"]
["International Monetary Fund (IMF)","EMRO","Global ",{"$f":"COUNTIF($B$1:B120,B120)","v":1},"EMRO1","International Monetary Fund (IMF)"]
["World Bank Data","EMRO","Global ",{"$f":"COUNTIF($B$1:B121,B121)","v":2},"EMRO2","World Bank Data"]
["Covidbase","EMRO","Global ",{"$f":"COUNTIF($B$1:B122,B122)","v":3},"EMRO3","Covidbase"]
["Oxford Government response tracker","EMRO","Global ",{"$f":"COUNTIF($B$1:B123,B123)","v":4},"EMRO4","Oxford Government response tracker"]
["Yale School of Management's Program COVID-19 Financial Response Tracker (CFRT)","EMRO","Global ",{"$f":"COUNTIF($B$1:B124,B124)","v":5},"EMRO5","Yale School of Management's Program COVID-19 Financial Response Tracker (CFRT)"]
["UNDP COVID 19 Dashboard","EMRO","Global ",{"$f":"COUNTIF($B$1:B125,B125)","v":6},"EMRO6","UNDP COVID 19 Dashboard"]
["UNICEF","EMRO","Global ",{"$f":"COUNTIF($B$1:B126,B126)","v":7},"EMRO7","UNICEF"]
["UNEP","EMRO","Global ",{"$f":"COUNTIF($B$1:B127,B127)","v":8},"EMRO8","UNEP"]
["OECD Tax policy responses by country","EMRO","Global ",{"$f":"COUNTIF($B$1:B128,B128)","v":9},"EMRO9","OECD Tax policy responses by country"]
["COVID-19 Research Project Tracker by UKCDR & GloPID-R","EMRO","Global ",{"$f":"COUNTIF($B$1:B129,B129)","v":10},"EMRO10","COVID-19 Research Project Tracker by UKCDR & GloPID-R"]
["UNESCO COVID-19","EMRO","Global ",{"$f":"COUNTIF($B$1:B130,B130)","v":11},"EMRO11","UNESCO COVID-19"]
["Johns Hopkins University and Medicine Coronavirus Resource Center","EMRO","Global ",{"$f":"COUNTIF($B$1:B131,B131)","v":12},{"$f":"B131&D131","v":"EMRO12"},{"$f":"A131","v":"Johns Hopkins University and Medicine Coronavirus Resource Center"}]
["McMaster COVID-19 evidence","EMRO","Global ",{"$f":"COUNTIF($B$1:B132,B132)","v":13},"EMRO13","McMaster COVID-19 evidence"]
["Economics for Inclusive Prosperity (Econflip)","EMRO","Global ",{"$f":"COUNTIF($B$1:B133,B133)","v":14},"EMRO14","Economics for Inclusive Prosperity (Econflip)"]
["Our World in Data Coronavirus Disease (COVID-19)","EMRO","Global ",{"$f":"COUNTIF($B$1:B134,B134)","v":15},"EMRO15","Our World in Data Coronavirus Disease (COVID-19)"]
["China National Knowledge Infrastructure (CNKI)","EMRO","Global ",{"$f":"COUNTIF($B$1:B135,B135)","v":16},"EMRO16","China National Knowledge Infrastructure (CNKI)"]
["Elrha","EMRO","Global ",{"$f":"COUNTIF($B$1:B136,B136)","v":17},"EMRO17","Elrha"]
["COVID-19 Open Research Dataset","EMRO","Global ",{"$f":"COUNTIF($B$1:B137,B137)","v":18},"EMRO18","COVID-19 Open Research Dataset"]
["LitCovid","EMRO","Global ",{"$f":"COUNTIF($B$1:B138,B138)","v":19},"EMRO19","LitCovid"]
["TEPHINET Coronavirus Knowledge Hub","EMRO","Global ",{"$f":"COUNTIF($B$1:B139,B139)","v":20},"EMRO20","TEPHINET Coronavirus Knowledge Hub"]
["DynaMed","EMRO","Global ",{"$f":"COUNTIF($B$1:B140,B140)","v":21},"EMRO21","DynaMed"]
["Open government partnership","EMRO","Global ",{"$f":"COUNTIF($B$1:B141,B141)","v":22},"EMRO22","Open government partnership"]
["SocArxi Corona Net","EMRO","Global ",{"$f":"COUNTIF($B$1:B142,B142)","v":23},"EMRO23","SocArxi Corona Net"]
["Communication Initiative","EMRO","Global ",{"$f":"COUNTIF($B$1:B143,B143)","v":24},"EMRO24","Communication Initiative"]
["Guidelines Network International","EMRO","Global ",{"$f":"COUNTIF($B$1:B144,B144)","v":25},"EMRO25","Guidelines Network International"]
["ECRI Guidelines Trust COVID-19 Resource Center","EMRO","Global ",{"$f":"COUNTIF($B$1:B145,B145)","v":26},"EMRO26","ECRI Guidelines Trust COVID-19 Resource Center"]
["George Institute","EMRO","Global ",{"$f":"COUNTIF($B$1:B146,B146)","v":27},"EMRO27","George Institute"]
["European Respiratory Society","EMRO","Global ",{"$f":"COUNTIF($B$1:B147,B147)","v":28},"EMRO28","European Respiratory Society"]
["Weekly Social Protection Links","EMRO","Global ",{"$f":"COUNTIF($B$1:B148,B148)","v":29},"EMRO29","Weekly Social Protection Links"]
["International Network for Government Science Advice (INGSA)","EMRO","Global ",{"$f":"COUNTIF($B$1:B149,B149)","v":30},"EMRO30","International Network for Government Science Advice (INGSA)"]
["GULAGECHOES","EMRO","Global ",{"$f":"COUNTIF($B$1:B150,B150)","v":31},"EMRO31","GULAGECHOES"]
["ILO Social Protection Monitor","EMRO","Global ",{"$f":"COUNTIF($B$1:B151,B151)","v":32},"EMRO32","ILO Social Protection Monitor"]
["Global Health 5050 COVID-19 sex-disaggregated data tracker","EMRO","Global ",{"$f":"COUNTIF($B$1:B152,B152)","v":33},"EMRO33","Global Health 5050 COVID-19 sex-disaggregated data tracker"]
["Dimensions COVID-19","EMRO","Global ",{"$f":"COUNTIF($B$1:B153,B153)","v":34},"EMRO34","Dimensions COVID-19"]
["OECD SME Policy Responses","EMRO","Global ",{"$f":"COUNTIF($B$1:B154,B154)","v":35},"EMRO35","OECD SME Policy Responses"]
["Global overview of COVID-19: Impact on elections","EMRO","Global ",{"$f":"COUNTIF($B$1:B155,B155)","v":36},"EMRO36","Global overview of COVID-19: Impact on elections"]
["Conflict and Covid-19 Resource Hub","EMRO","Global ",{"$f":"COUNTIF($B$1:B156,B156)","v":37},"EMRO37","Conflict and Covid-19 Resource Hub"]
["Coronavirus: prison fever","EMRO","Global ",{"$f":"COUNTIF($B$1:B157,B157)","v":38},"EMRO38","Coronavirus: prison fever"]
["Candid Philanthropic Funding Data","EMRO","Global ",{"$f":"COUNTIF($B$1:B158,B158)","v":39},"EMRO39","Candid Philanthropic Funding Data"]
["Coronavirus Research Repository","EMRO","Global ",{"$f":"COUNTIF($B$1:B159,B159)","v":40},"EMRO40","Coronavirus Research Repository"]
["UN Habitat","EMRO","Global ",{"$f":"COUNTIF($B$1:B160,B160)","v":41},"EMRO41","UN Habitat"]
["UN Food and Agriculture Organisation(FAO)","EMRO","Global ",{"$f":"COUNTIF($B$1:B161,B161)","v":42},"EMRO42","UN Food and Agriculture Organisation(FAO)"]
["Centers for Disease Control and Prevention","EMRO","Global ",{"$f":"COUNTIF($B$1:B162,B162)","v":43},"EMRO43","Centers for Disease Control and Prevention"]
["OECD Country Policy Tracker","EMRO","Global ",{"$f":"COUNTIF($B$1:B163,B163)","v":44},"EMRO44","OECD Country Policy Tracker"]
["OECD Health System Response Tracker","EMRO","Global ",{"$f":"COUNTIF($B$1:B164,B164)","v":45},"EMRO45","OECD Health System Response Tracker"]
["OECD Employment & Social policy responses by country","EMRO","Global ",{"$f":"COUNTIF($B$1:B165,B165)","v":46},"EMRO46","OECD Employment & Social policy responses by country"]
["UN International Labour Organisation(ILO)","EMRO","Global ",{"$f":"COUNTIF($B$1:B166,B166)","v":47},"EMRO47","UN International Labour Organisation(ILO)"]
["Institute for Health Metrics and Evaluation (IHME)","EMRO","Global ",{"$f":"COUNTIF($B$1:B167,B167)","v":48},"EMRO48","Institute for Health Metrics and Evaluation (IHME)"]
["OECD Knowledge Hub","EMRO","Global ",{"$f":"COUNTIF($B$1:B168,B168)","v":49},"EMRO49","OECD Knowledge Hub"]
["AU","EMRO","Regional",{"$f":"COUNTIF($B$1:B169,B169)","v":50},"EMRO50","AU"]
["COVID-19 and Citizen Science","EMRO","Global ",{"$f":"COUNTIF($B$1:B170,B170)","v":51},"EMRO51","COVID-19 and Citizen Science"]
["COVID 19 Africa Data Research","EMRO","Regional",{"$f":"COUNTIF($B$1:B171,B171)","v":52},"EMRO52","COVID 19 Africa Data Research"]
["NMA","EMRO","Global ",{"$f":"COUNTIF($B$1:B172,B172)","v":53},"EMRO53","NMA"]
["Social Science in Humanitarian Action","EMRO","Global ",{"$f":"COUNTIF($B$1:B173,B173)","v":54},"EMRO54","Social Science in Humanitarian Action"]
["EPI-WIN (WHO Information for Network for Epidemics)","EMRO","Global ",{"$f":"COUNTIF($B$1:B174,B174)","v":55},"EMRO55","EPI-WIN (WHO Information for Network for Epidemics)"]
["Hewlett Foundation","EMRO","Global ",{"$f":"COUNTIF($B$1:B175,B175)","v":56},"EMRO56","Hewlett Foundation"]
["Development aid","EMRO","Global ",{"$f":"COUNTIF($B$1:B176,B176)","v":57},"EMRO57","Development aid"]
["Coronavirus Tech Handbook","EMRO","Global ",{"$f":"COUNTIF($B$1:B177,B177)","v":58},"EMRO58","Coronavirus Tech Handbook"]
["Covid-19 Innovations","EMRO","Global ",{"$f":"COUNTIF($B$1:B178,B178)","v":59},"EMRO59","Covid-19 Innovations"]
["Health Economics, Policy and Law blog series on country responses","EMRO","Global ",{"$f":"COUNTIF($B$1:B179,B179)","v":60},"EMRO60","Health Economics, Policy and Law blog series on country responses"]
["SYREAF","EMRO","Global ",{"$f":"COUNTIF($B$1:B180,B180)","v":61},"EMRO61","SYREAF"]
["CHAIN","EMRO","Global ",{"$f":"COUNTIF($B$1:B181,B181)","v":62},"EMRO62","CHAIN"]
["Oxford Evidence Service","EMRO","Global ",{"$f":"COUNTIF($B$1:B182,B182)","v":63},"EMRO63","Oxford Evidence Service"]
["COVID-19 Economic Stimulus Index","EMRO","Global ",{"$f":"COUNTIF($B$1:B183,B183)","v":64},"EMRO64","COVID-19 Economic Stimulus Index"]
["World Bank Education","EMRO","Global ",{"$f":"COUNTIF($B$1:B184,B184)","v":65},"EMRO65","World Bank Education"]
["American College of Cardiology","EMRO","Global ",{"$f":"COUNTIF($B$1:B185,B185)","v":66},"EMRO66","American College of Cardiology"]
["International Long Term Care Policy Network","EMRO","Global ",{"$f":"COUNTIF($B$1:B186,B186)","v":67},"EMRO67","International Long Term Care Policy Network"]
["International trade centre","EMRO","Global ",{"$f":"COUNTIF($B$1:B187,B187)","v":68},"EMRO68","International trade centre"]
["WHO R & D","EMRO","Global ",{"$f":"COUNTIF($B$1:B188,B188)","v":69},"EMRO69","WHO R & D"]
["United Nations Office for the Coordination of Humanitarian Affairs","EMRO","Global ",{"$f":"COUNTIF($B$1:B189,B189)","v":70},"EMRO70","United Nations Office for the Coordination of Humanitarian Affairs"]
["UNIDO","EMRO","Global ",{"$f":"COUNTIF($B$1:B190,B190)","v":71},"EMRO71","UNIDO"]
["International Centre for not-for-profit law","EMRO","Global ",{"$f":"COUNTIF($B$1:B191,B191)","v":72},"EMRO72","International Centre for not-for-profit law"]
["Asian Development Bank","EMRO","Global ",{"$f":"COUNTIF($B$1:B192,B192)","v":73},"EMRO73","Asian Development Bank"]
["Tableau Public","EMRO","Global ",{"$f":"COUNTIF($B$1:B193,B193)","v":74},"EMRO74","Tableau Public"]
["Havard Dataverse","EMRO","Global ",{"$f":"COUNTIF($B$1:B194,B194)","v":75},"EMRO75","Havard Dataverse"]
["WHO Global research on coronavirus disease (COVID-19)","EMRO","Global ",{"$f":"COUNTIF($B$1:B195,B195)","v":76},{"$f":"B195&D195","v":"EMRO76"},{"$f":"A195","v":"WHO Global research on coronavirus disease (COVID-19)"}]
["World Health Organization (WHO) technical guidelines","EMRO","Global ",{"$f":"COUNTIF($B$1:B196,B196)","v":77},"EMRO77","World Health Organization (WHO) technical guidelines"]
["UNESCO Planipolis","EMRO","Global ",{"$f":"COUNTIF($B$1:B197,B197)","v":78},"EMRO78","UNESCO Planipolis"]
["U.S. Veterans’ Affairs (VA) Evidence Synthesis Program","EMRO","Global ",{"$f":"COUNTIF($B$1:B198,B198)","v":79},"EMRO79","U.S. Veterans’ Affairs (VA) Evidence Synthesis Program"]
["Santé Public France","EMRO","Global ",{"$f":"COUNTIF($B$1:B199,B199)","v":80},"EMRO80","Santé Public France"]
["Campbell UK and Ireland","EMRO","Global ",{"$f":"COUNTIF($B$1:B200,B200)","v":81},"EMRO81","Campbell UK and Ireland"]
["Africaxiv","EMRO","Regional",{"$f":"COUNTIF($B$1:B201,B201)","v":82},"EMRO82","Africaxiv"]
["Our World In data Policy Responses to the Coronavirus Pandemic","EMRO","Global ",{"$f":"COUNTIF($B$1:B202,B202)","v":83},"EMRO83","Our World In data Policy Responses to the Coronavirus Pandemic"]
["Wolters Kluwer Global Infectious Diseases and Epidemiology Online Network (GIDEON)","EMRO","Global ",{"$f":"COUNTIF($B$1:B203,B203)","v":84},"EMRO84","Wolters Kluwer Global Infectious Diseases and Epidemiology Online Network (GIDEON)"]
["European Society of Intensive Care Medicine","EMRO","Global ",{"$f":"COUNTIF($B$1:B204,B204)","v":85},"EMRO85","European Society of Intensive Care Medicine"]
["Health Data Research UK","EMRO","Global ",{"$f":"COUNTIF($B$1:B205,B205)","v":86},"EMRO86","Health Data Research UK"]
["CGD - COVID education policy tracking","EMRO","Global ",{"$f":"COUNTIF($B$1:B206,B206)","v":87},"EMRO87","CGD - COVID education policy tracking"]
["World Pandemic Research Network (WPRN) ","EMRO","Global ",{"$f":"COUNTIF($B$1:B207,B207)","v":88},"EMRO88","World Pandemic Research Network (WPRN) "]
["OECD Cities responses","EMRO","Global ",{"$f":"COUNTIF($B$1:B208,B208)","v":89},"EMRO89","OECD Cities responses"]
["International Growth Centre(ICG)","EMRO","Regional",{"$f":"COUNTIF($B$1:B209,B209)","v":90},"EMRO90","International Growth Centre(ICG)"]
["OECD SME Policy Responses","EMRO","Global ",{"$f":"COUNTIF($B$1:B210,B210)","v":91},"EMRO91","OECD SME Policy Responses"]
["IFPRI Covid 19 Food Trade Policy Tracker","EMRO","Global ",{"$f":"COUNTIF($B$1:B211,B211)","v":92},"EMRO92","IFPRI Covid 19 Food Trade Policy Tracker"]
["Global Health Network Covid-19 Research Implementation Hub","EMRO","Global ",{"$f":"COUNTIF($B$1:B212,B212)","v":93},"EMRO93","Global Health Network Covid-19 Research Implementation Hub"]
["OECD Tourism Summary","EMRO","Global ",{"$f":"COUNTIF($B$1:B213,B213)","v":94},"EMRO94","OECD Tourism Summary"]
["Society of Critical Care Medicine","EMRO","Global ",{"$f":"COUNTIF($B$1:B214,B214)","v":95},"EMRO95","Society of Critical Care Medicine"]
["Covid19 Behaviour Tracker\n","EMRO","Global ",{"$f":"COUNTIF($B$1:B215,B215)","v":96},"EMRO96","Covid19 Behaviour Tracker\n"]
["Kaggle","EMRO","Global ",{"$f":"COUNTIF($B$1:B216,B216)","v":97},"EMRO97","Kaggle"]
["Google Covid-19 Community Mobility Reports","EMRO","Global ",{"$f":"COUNTIF($B$1:B217,B217)","v":98},"EMRO98","Google Covid-19 Community Mobility Reports"]
["Wiley Covid-19: Novel Coronavirus Outbreak","EMRO","Global ",{"$f":"COUNTIF($B$1:B218,B218)","v":99},"EMRO99","Wiley Covid-19: Novel Coronavirus Outbreak"]
["COVID-19 Disorder Tracker (CDT)","EMRO","Global ",{"$f":"COUNTIF($B$1:B219,B219)","v":100},"EMRO100","COVID-19 Disorder Tracker (CDT)"]
["Global Policy Responses – Developed Markets ","EMRO","Regional",{"$f":"COUNTIF($B$1:B220,B220)","v":101},"EMRO101","Global Policy Responses – Developed Markets "]
["Economic Relief Around the World","EMRO","Global ",{"$f":"COUNTIF($B$1:B221,B221)","v":102},"EMRO102","Economic Relief Around the World"]
["Impact Peace Resources on Covid","EMRO","Global ",{"$f":"COUNTIF($B$1:B222,B222)","v":103},"EMRO103","Impact Peace Resources on Covid"]
["EBSCO Medical","EMRO","Global ",{"$f":"COUNTIF($B$1:B223,B223)","v":104},"EMRO104","EBSCO Medical"]
["UNDP HDR Global Preparedness and Vulnerability Dashboard","EMRO","Global ",{"$f":"COUNTIF($B$1:B224,B224)","v":105},"EMRO105","UNDP HDR Global Preparedness and Vulnerability Dashboard"]
["International Monetary Fund (IMF)","EURO","Global ",{"$f":"COUNTIF($B$1:B225,B225)","v":1},"EURO1","International Monetary Fund (IMF)"]
["World Bank Data","EURO","Global ",{"$f":"COUNTIF($B$1:B226,B226)","v":2},"EURO2","World Bank Data"]
["Covidbase","EURO","Global ",{"$f":"COUNTIF($B$1:B227,B227)","v":3},"EURO3","Covidbase"]
["Oxford Government response tracker","EURO","Global ",{"$f":"COUNTIF($B$1:B228,B228)","v":4},"EURO4","Oxford Government response tracker"]
["Yale School of Management's Program COVID-19 Financial Response Tracker (CFRT)","EURO","Global ",{"$f":"COUNTIF($B$1:B229,B229)","v":5},"EURO5","Yale School of Management's Program COVID-19 Financial Response Tracker (CFRT)"]
["UNDP COVID 19 Dashboard","EURO","Global ",{"$f":"COUNTIF($B$1:B230,B230)","v":6},"EURO6","UNDP COVID 19 Dashboard"]
["UNICEF","EURO","Global ",{"$f":"COUNTIF($B$1:B231,B231)","v":7},"EURO7","UNICEF"]
["UNEP","EURO","Global ",{"$f":"COUNTIF($B$1:B232,B232)","v":8},"EURO8","UNEP"]
["OECD Tax policy responses by country","EURO","Global ",{"$f":"COUNTIF($B$1:B233,B233)","v":9},"EURO9","OECD Tax policy responses by country"]
["COVID-19 Research Project Tracker by UKCDR & GloPID-R","EURO","Global ",{"$f":"COUNTIF($B$1:B234,B234)","v":10},"EURO10","COVID-19 Research Project Tracker by UKCDR & GloPID-R"]
["UNESCO COVID-19","EURO","Global ",{"$f":"COUNTIF($B$1:B235,B235)","v":11},"EURO11","UNESCO COVID-19"]
["Johns Hopkins University and Medicine Coronavirus Resource Center","EURO","Global ",{"$f":"COUNTIF($B$1:B236,B236)","v":12},"EURO12","Johns Hopkins University and Medicine Coronavirus Resource Center"]
["VHL Regional Portal","EURO","Regional",{"$f":"COUNTIF($B$1:B237,B237)","v":13},"EURO13","VHL Regional Portal"]
["McMaster COVID-19 evidence","EURO","Global ",{"$f":"COUNTIF($B$1:B238,B238)","v":14},"EURO14","McMaster COVID-19 evidence"]
["Public Health England","EURO","National",{"$f":"COUNTIF($B$1:B239,B239)","v":15},"EURO15","Public Health England"]
["Economics for Inclusive Prosperity (Econflip)","EURO","Global ",{"$f":"COUNTIF($B$1:B240,B240)","v":16},"EURO16","Economics for Inclusive Prosperity (Econflip)"]
["Our World in Data Coronavirus Disease (COVID-19)","EURO","Global ",{"$f":"COUNTIF($B$1:B241,B241)","v":17},"EURO17","Our World in Data Coronavirus Disease (COVID-19)"]
["China National Knowledge Infrastructure (CNKI)","EURO","Global ",{"$f":"COUNTIF($B$1:B242,B242)","v":18},"EURO18","China National Knowledge Infrastructure (CNKI)"]
["Elrha","EURO","Global ",{"$f":"COUNTIF($B$1:B243,B243)","v":19},"EURO19","Elrha"]
["European Research Area (ERA) Corona Platform","EURO","Regional",{"$f":"COUNTIF($B$1:B244,B244)","v":20},"EURO20","European Research Area (ERA) Corona Platform"]
["COVID-19 Open Research Dataset","EURO","Global ",{"$f":"COUNTIF($B$1:B245,B245)","v":21},"EURO21","COVID-19 Open Research Dataset"]
["LitCovid","EURO","Global ",{"$f":"COUNTIF($B$1:B246,B246)","v":22},"EURO22","LitCovid"]
["Health Information and Quality Authority","EURO","Global ",{"$f":"COUNTIF($B$1:B247,B247)","v":23},"EURO23","Health Information and Quality Authority"]
["TEPHINET Coronavirus Knowledge Hub","EURO","Global ",{"$f":"COUNTIF($B$1:B248,B248)","v":24},"EURO24","TEPHINET Coronavirus Knowledge Hub"]
["Irish Longitudinal Study on Ageing","EURO","National",{"$f":"COUNTIF($B$1:B249,B249)","v":25},"EURO25","Irish Longitudinal Study on Ageing"]
["DynaMed","EURO","Global ",{"$f":"COUNTIF($B$1:B250,B250)","v":26},"EURO26","DynaMed"]
["Open government partnership","EURO","Global ",{"$f":"COUNTIF($B$1:B251,B251)","v":27},"EURO27","Open government partnership"]
["SocArxi Corona Net","EURO","Global ",{"$f":"COUNTIF($B$1:B252,B252)","v":28},"EURO28","SocArxi Corona Net"]
["Communication Initiative","EURO","Global ",{"$f":"COUNTIF($B$1:B253,B253)","v":29},"EURO29","Communication Initiative"]
["Guidelines Network International","EURO","Global ",{"$f":"COUNTIF($B$1:B254,B254)","v":30},"EURO30","Guidelines Network International"]
["ECRI Guidelines Trust COVID-19 Resource Center","EURO","Global ",{"$f":"COUNTIF($B$1:B255,B255)","v":31},"EURO31","ECRI Guidelines Trust COVID-19 Resource Center"]
["Knowledge to Policy Center, American University of Beirut","EURO","Global ",{"$f":"COUNTIF($B$1:B256,B256)","v":32},"EURO32","Knowledge to Policy Center, American University of Beirut"]
["MAGICapp","EURO","Regional",{"$f":"COUNTIF($B$1:B257,B257)","v":33},"EURO33","MAGICapp"]
["George Institute","EURO","Global ",{"$f":"COUNTIF($B$1:B258,B258)","v":34},"EURO34","George Institute"]
["European Respiratory Society","EURO","Global ",{"$f":"COUNTIF($B$1:B259,B259)","v":35},{"$f":"B259&D259","v":"EURO35"},{"$f":"A259","v":"European Respiratory Society"}]
["Weekly Social Protection Links","EURO","Global ",{"$f":"COUNTIF($B$1:B260,B260)","v":36},"EURO36","Weekly Social Protection Links"]
["International Network for Government Science Advice (INGSA)","EURO","Global ",{"$f":"COUNTIF($B$1:B261,B261)","v":37},"EURO37","International Network for Government Science Advice (INGSA)"]
["GULAGECHOES","EURO","Global ",{"$f":"COUNTIF($B$1:B262,B262)","v":38},"EURO38","GULAGECHOES"]
["ILO Social Protection Monitor","EURO","Global ",{"$f":"COUNTIF($B$1:B263,B263)","v":39},"EURO39","ILO Social Protection Monitor"]
["Malcolm Wiener Centre for Social Policy Monitoring the Covid-19 Employment Response: Policy Approaches Across Countries","EURO","Global ",{"$f":"COUNTIF($B$1:B264,B264)","v":40},"EURO40","Malcolm Wiener Centre for Social Policy Monitoring the Covid-19 Employment Response: Policy Approaches Across Countries"]
["Global Health 5050 COVID-19 sex-disaggregated data tracker","EURO","Global ",{"$f":"COUNTIF($B$1:B265,B265)","v":41},"EURO41","Global Health 5050 COVID-19 sex-disaggregated data tracker"]
["Dimensions COVID-19","EURO","Global ",{"$f":"COUNTIF($B$1:B266,B266)","v":42},"EURO42","Dimensions COVID-19"]
["OECD Multilevel Governance","EURO","Regional",{"$f":"COUNTIF($B$1:B267,B267)","v":43},"EURO43","OECD Multilevel Governance"]
["OECD SME Policy Responses","EURO","Global ",{"$f":"COUNTIF($B$1:B268,B268)","v":44},"EURO44","OECD SME Policy Responses"]
["Global overview of COVID-19: Impact on elections","EURO","Global ",{"$f":"COUNTIF($B$1:B269,B269)","v":45},"EURO45","Global overview of COVID-19: Impact on elections"]
["Conflict and Covid-19 Resource Hub","EURO","Global ",{"$f":"COUNTIF($B$1:B270,B270)","v":46},"EURO46","Conflict and Covid-19 Resource Hub"]
["Coronavirus: prison fever","EURO","Global ",{"$f":"COUNTIF($B$1:B271,B271)","v":47},"EURO47","Coronavirus: prison fever"]
["Candid Philanthropic Funding Data","EURO","Global ",{"$f":"COUNTIF($B$1:B272,B272)","v":48},"EURO48","Candid Philanthropic Funding Data"]
["Coronavirus Research Repository","EURO","Global ",{"$f":"COUNTIF($B$1:B273,B273)","v":49},"EURO49","Coronavirus Research Repository"]
["UN Food and Agriculture Organisation(FAO)","EURO","Global ",{"$f":"COUNTIF($B$1:B274,B274)","v":50},"EURO50","UN Food and Agriculture Organisation(FAO)"]
["Centers for Disease Control and Prevention","EURO","Global ",{"$f":"COUNTIF($B$1:B275,B275)","v":51},"EURO51","Centers for Disease Control and Prevention"]
["OECD Country Policy Tracker","EURO","Global ",{"$f":"COUNTIF($B$1:B276,B276)","v":52},"EURO52","OECD Country Policy Tracker"]
["OECD Health System Response Tracker","EURO","Global ",{"$f":"COUNTIF($B$1:B277,B277)","v":53},"EURO53","OECD Health System Response Tracker"]
["OECD Employment & Social policy responses by country","EURO","Global ",{"$f":"COUNTIF($B$1:B278,B278)","v":54},"EURO54","OECD Employment & Social policy responses by country"]
["UN International Labour Organisation(ILO)","EURO","Global ",{"$f":"COUNTIF($B$1:B279,B279)","v":55},"EURO55","UN International Labour Organisation(ILO)"]
["Institute for Health Metrics and Evaluation (IHME)","EURO","Global ",{"$f":"COUNTIF($B$1:B280,B280)","v":56},"EURO56","Institute for Health Metrics and Evaluation (IHME)"]
["OECD Knowledge Hub","EURO","Global ",{"$f":"COUNTIF($B$1:B281,B281)","v":57},"EURO57","OECD Knowledge Hub"]
["COVID-19 and Citizen Science","EURO","Global ",{"$f":"COUNTIF($B$1:B282,B282)","v":58},"EURO58","COVID-19 and Citizen Science"]
["NMA","EURO","Global ",{"$f":"COUNTIF($B$1:B283,B283)","v":59},"EURO59","NMA"]
["Social Science in Humanitarian Action","EURO","Global ",{"$f":"COUNTIF($B$1:B284,B284)","v":60},"EURO60","Social Science in Humanitarian Action"]
["EPI-WIN (WHO Information for Network for Epidemics)","EURO","Global ",{"$f":"COUNTIF($B$1:B285,B285)","v":61},"EURO61","EPI-WIN (WHO Information for Network for Epidemics)"]
["Hewlett Foundation","EURO","Global ",{"$f":"COUNTIF($B$1:B286,B286)","v":62},"EURO62","Hewlett Foundation"]
["Development aid","EURO","Global ",{"$f":"COUNTIF($B$1:B287,B287)","v":63},"EURO63","Development aid"]
["Coronavirus Tech Handbook","EURO","Global ",{"$f":"COUNTIF($B$1:B288,B288)","v":64},"EURO64","Coronavirus Tech Handbook"]
["Homelesseness impact","EURO","National",{"$f":"COUNTIF($B$1:B289,B289)","v":65},"EURO65","Homelesseness impact"]
["Covid-19 Innovations","EURO","Global ",{"$f":"COUNTIF($B$1:B290,B290)","v":66},"EURO66","Covid-19 Innovations"]
["Health Economics, Policy and Law blog series on country responses","EURO","Global ",{"$f":"COUNTIF($B$1:B291,B291)","v":67},"EURO67","Health Economics, Policy and Law blog series on country responses"]
["SYREAF","EURO","Global ",{"$f":"COUNTIF($B$1:B292,B292)","v":68},"EURO68","SYREAF"]
["OECD Science and innovation policy responses by country","EURO","Global ",{"$f":"COUNTIF($B$1:B293,B293)","v":69},"EURO69","OECD Science and innovation policy responses by country"]
["CHAIN","EURO","Global ",{"$f":"COUNTIF($B$1:B294,B294)","v":70},"EURO70","CHAIN"]
["Oxford Evidence Service","EURO","Global ",{"$f":"COUNTIF($B$1:B295,B295)","v":71},"EURO71","Oxford Evidence Service"]
["COVID-19 Economic Stimulus Index","EURO","Global ",{"$f":"COUNTIF($B$1:B296,B296)","v":72},"EURO72","COVID-19 Economic Stimulus Index"]
["EUI Covid Knowledge Hub","EURO","Regional",{"$f":"COUNTIF($B$1:B297,B297)","v":73},"EURO73","EUI Covid Knowledge Hub"]
["World Bank Education","EURO","Global ",{"$f":"COUNTIF($B$1:B298,B298)","v":74},"EURO74","World Bank Education"]
["American College of Cardiology","EURO","Global ",{"$f":"COUNTIF($B$1:B299,B299)","v":75},"EURO75","American College of Cardiology"]
["International Long Term Care Policy Network","EURO","Global ",{"$f":"COUNTIF($B$1:B300,B300)","v":76},"EURO76","International Long Term Care Policy Network"]
["Elsevier Novel Coronavirus Information Center","EURO","Global ",{"$f":"COUNTIF($B$1:B301,B301)","v":77},"EURO77","Elsevier Novel Coronavirus Information Center"]
["International trade centre","EURO","Global ",{"$f":"COUNTIF($B$1:B302,B302)","v":78},"EURO78","International trade centre"]
["UK government","EURO","National",{"$f":"COUNTIF($B$1:B303,B303)","v":79},"EURO79","UK government"]
["WHO R & D","EURO","Global ",{"$f":"COUNTIF($B$1:B304,B304)","v":80},"EURO80","WHO R & D"]
["United Nations Office for the Coordination of Humanitarian Affairs","EURO","Global ",{"$f":"COUNTIF($B$1:B305,B305)","v":81},"EURO81","United Nations Office for the Coordination of Humanitarian Affairs"]
["UNIDO","EURO","Global ",{"$f":"COUNTIF($B$1:B306,B306)","v":82},"EURO82","UNIDO"]
["International Centre for not-for-profit law","EURO","Global ",{"$f":"COUNTIF($B$1:B307,B307)","v":83},"EURO83","International Centre for not-for-profit law"]
["Asian Development Bank","EURO","Global ",{"$f":"COUNTIF($B$1:B308,B308)","v":84},"EURO84","Asian Development Bank"]
["Tableau Public","EURO","Global ",{"$f":"COUNTIF($B$1:B309,B309)","v":85},"EURO85","Tableau Public"]
["Havard Dataverse","EURO","Global ",{"$f":"COUNTIF($B$1:B310,B310)","v":86},"EURO86","Havard Dataverse"]
["WHO Global research on coronavirus disease (COVID-19)","EURO","Global ",{"$f":"COUNTIF($B$1:B311,B311)","v":87},"EURO87","WHO Global research on coronavirus disease (COVID-19)"]
["World Health Organization (WHO) technical guidelines","EURO","Global ",{"$f":"COUNTIF($B$1:B312,B312)","v":88},"EURO88","World Health Organization (WHO) technical guidelines"]
["UNESCO Planipolis","EURO","Global ",{"$f":"COUNTIF($B$1:B313,B313)","v":89},"EURO89","UNESCO Planipolis"]
["WHO Regional Office for Europe (technical guidance)","EURO","Regional",{"$f":"COUNTIF($B$1:B314,B314)","v":90},"EURO90","WHO Regional Office for Europe (technical guidance)"]
["U.S. Veterans’ Affairs (VA) Evidence Synthesis Program","EURO","Global ",{"$f":"COUNTIF($B$1:B315,B315)","v":91},"EURO91","U.S. Veterans’ Affairs (VA) Evidence Synthesis Program"]
["Santé Public France","EURO","Global ",{"$f":"COUNTIF($B$1:B316,B316)","v":92},"EURO92","Santé Public France"]
["Campbell UK and Ireland","EURO","Global ",{"$f":"COUNTIF($B$1:B317,B317)","v":93},"EURO93","Campbell UK and Ireland"]
["Africaxiv","EURO","Regional",{"$f":"COUNTIF($B$1:B318,B318)","v":94},"EURO94","Africaxiv"]
["Our World In data Policy Responses to the Coronavirus Pandemic","EURO","Global ",{"$f":"COUNTIF($B$1:B319,B319)","v":95},"EURO95","Our World In data Policy Responses to the Coronavirus Pandemic"]
["ETUC Briefing Notes on national measures","EURO","Regional",{"$f":"COUNTIF($B$1:B320,B320)","v":96},"EURO96","ETUC Briefing Notes on national measures"]
["Wolters Kluwer Global Infectious Diseases and Epidemiology Online Network (GIDEON)","EURO","Global ",{"$f":"COUNTIF($B$1:B321,B321)","v":97},"EURO97","Wolters Kluwer Global Infectious Diseases and Epidemiology Online Network (GIDEON)"]
["COVID 19 Inequality Project","EURO","Regional",{"$f":"COUNTIF($B$1:B322,B322)","v":98},"EURO98","COVID 19 Inequality Project"]
["European Society of Intensive Care Medicine","EURO","Global ",{"$f":"COUNTIF($B$1:B323,B323)","v":99},{"$f":"B323&D323","v":"EURO99"},{"$f":"A323","v":"European Society of Intensive Care Medicine"}]
["IIASA COVID-19 : Visualizing regional socioeconomic indicators for Europe","EURO","Regional",{"$f":"COUNTIF($B$1:B324,B324)","v":100},"EURO100","IIASA COVID-19 : Visualizing regional socioeconomic indicators for Europe"]
["Health Data Research UK","EURO","Global ",{"$f":"COUNTIF($B$1:B325,B325)","v":101},"EURO101","Health Data Research UK"]
["CGD - COVID education policy tracking","EURO","Global ",{"$f":"COUNTIF($B$1:B326,B326)","v":102},"EURO102","CGD - COVID education policy tracking"]
["World Pandemic Research Network (WPRN) ","EURO","Global ",{"$f":"COUNTIF($B$1:B327,B327)","v":103},"EURO103","World Pandemic Research Network (WPRN) "]
["OECD Cities responses","EURO","Global ",{"$f":"COUNTIF($B$1:B328,B328)","v":104},"EURO104","OECD Cities responses"]
["EY COVID-19 Global Trade Considerations tracker ","EURO","Global ",{"$f":"COUNTIF($B$1:B329,B329)","v":105},"EURO105","EY COVID-19 Global Trade Considerations tracker "]
["OECD SME Policy Responses","EURO","Global ",{"$f":"COUNTIF($B$1:B330,B330)","v":106},"EURO106","OECD SME Policy Responses"]
["CIAT/IOTA/OECD Tax Response","EURO","Global ",{"$f":"COUNTIF($B$1:B331,B331)","v":107},"EURO107","CIAT/IOTA/OECD Tax Response"]
["IFPRI Covid 19 Food Trade Policy Tracker","EURO","Global ",{"$f":"COUNTIF($B$1:B332,B332)","v":108},"EURO108","IFPRI Covid 19 Food Trade Policy Tracker"]
["Global Health Network Covid-19 Research Implementation Hub","EURO","Global ",{"$f":"COUNTIF($B$1:B333,B333)","v":109},"EURO109","Global Health Network Covid-19 Research Implementation Hub"]
["OECD Tourism Summary","EURO","Global ",{"$f":"COUNTIF($B$1:B334,B334)","v":110},"EURO110","OECD Tourism Summary"]
["Society of Critical Care Medicine","EURO","Global ",{"$f":"COUNTIF($B$1:B335,B335)","v":111},"EURO111","Society of Critical Care Medicine"]
["Covid19 Behaviour Tracker\n","EURO","Global ",{"$f":"COUNTIF($B$1:B336,B336)","v":112},"EURO112","Covid19 Behaviour Tracker\n"]
["Kaggle","EURO","Global ",{"$f":"COUNTIF($B$1:B337,B337)","v":113},"EURO113","Kaggle"]
["Google Covid-19 Community Mobility Reports","EURO","Global ",{"$f":"COUNTIF($B$1:B338,B338)","v":114},"EURO114","Google Covid-19 Community Mobility Reports"]
["Wiley Covid-19: Novel Coronavirus Outbreak","EURO","Global ",{"$f":"COUNTIF($B$1:B339,B339)","v":115},"EURO115","Wiley Covid-19: Novel Coronavirus Outbreak"]
["Civic Space Watch: Solidarity amid the COVID-19 crisis","EURO","Regional",{"$f":"COUNTIF($B$1:B340,B340)","v":116},"EURO116","Civic Space Watch: Solidarity amid the COVID-19 crisis"]
["COVID-19 Disorder Tracker (CDT)","EURO","Global ",{"$f":"COUNTIF($B$1:B341,B341)","v":117},"EURO117","COVID-19 Disorder Tracker (CDT)"]
["Global Policy Responses – Developed Markets ","EURO","Regional",{"$f":"COUNTIF($B$1:B342,B342)","v":118},"EURO118","Global Policy Responses – Developed Markets "]
["Economic Relief Around the World","EURO","Global ",{"$f":"COUNTIF($B$1:B343,B343)","v":119},"EURO119","Economic Relief Around the World"]
["Impact Peace Resources on Covid","EURO","Global ",{"$f":"COUNTIF($B$1:B344,B344)","v":120},"EURO120","Impact Peace Resources on Covid"]
["EBSCO Medical","EURO","Global ",{"$f":"COUNTIF($B$1:B345,B345)","v":121},"EURO121","EBSCO Medical"]
["UNDP HDR Global Preparedness and Vulnerability Dashboard","EURO","Global ",{"$f":"COUNTIF($B$1:B346,B346)","v":122},"EURO122","UNDP HDR Global Preparedness and Vulnerability Dashboard"]
["International Monetary Fund (IMF)","PAHO","Global ",{"$f":"COUNTIF($B$1:B347,B347)","v":1},"PAHO1","International Monetary Fund (IMF)"]
["World Bank Data","PAHO","Global ",{"$f":"COUNTIF($B$1:B348,B348)","v":2},"PAHO2","World Bank Data"]
["Covidbase","PAHO","Global ",{"$f":"COUNTIF($B$1:B349,B349)","v":3},"PAHO3","Covidbase"]
["Oxford Government response tracker","PAHO","Global ",{"$f":"COUNTIF($B$1:B350,B350)","v":4},"PAHO4","Oxford Government response tracker"]
["Yale School of Management's Program COVID-19 Financial Response Tracker (CFRT)","PAHO","Global ",{"$f":"COUNTIF($B$1:B351,B351)","v":5},"PAHO5","Yale School of Management's Program COVID-19 Financial Response Tracker (CFRT)"]
["UNDP COVID 19 Dashboard","PAHO","Global ",{"$f":"COUNTIF($B$1:B352,B352)","v":6},"PAHO6","UNDP COVID 19 Dashboard"]
["UNICEF","PAHO","Global ",{"$f":"COUNTIF($B$1:B353,B353)","v":7},"PAHO7","UNICEF"]
["OECD Tax policy responses by country","PAHO","Global ",{"$f":"COUNTIF($B$1:B354,B354)","v":8},"PAHO8","OECD Tax policy responses by country"]
["COVID-19 Research Project Tracker by UKCDR & GloPID-R","PAHO","Global ",{"$f":"COUNTIF($B$1:B355,B355)","v":9},"PAHO9","COVID-19 Research Project Tracker by UKCDR & GloPID-R"]
["UNESCO COVID-19","PAHO","Global ",{"$f":"COUNTIF($B$1:B356,B356)","v":10},"PAHO10","UNESCO COVID-19"]
["Johns Hopkins University and Medicine Coronavirus Resource Center","PAHO","Global ",{"$f":"COUNTIF($B$1:B357,B357)","v":11},"PAHO11","Johns Hopkins University and Medicine Coronavirus Resource Center"]
["Johns Hopkins Medicine POC-IT Guide","PAHO","National",{"$f":"COUNTIF($B$1:B358,B358)","v":12},"PAHO12","Johns Hopkins Medicine POC-IT Guide"]
["Pan American Health Organization","PAHO","Regional",{"$f":"COUNTIF($B$1:B359,B359)","v":13},"PAHO13","Pan American Health Organization"]
["VHL Regional Portal","PAHO","Regional",{"$f":"COUNTIF($B$1:B360,B360)","v":14},"PAHO14","VHL Regional Portal"]
["McMaster COVID-19 evidence","PAHO","Global ",{"$f":"COUNTIF($B$1:B361,B361)","v":15},"PAHO15","McMaster COVID-19 evidence"]
["Ontario Ministry of Health","PAHO","Sub-national",{"$f":"COUNTIF($B$1:B362,B362)","v":16},"PAHO16","Ontario Ministry of Health"]
["Economics for Inclusive Prosperity (Econflip)","PAHO","Global ",{"$f":"COUNTIF($B$1:B363,B363)","v":17},"PAHO17","Economics for Inclusive Prosperity (Econflip)"]
["Our World in Data Coronavirus Disease (COVID-19)","PAHO","Global ",{"$f":"COUNTIF($B$1:B364,B364)","v":18},"PAHO18","Our World in Data Coronavirus Disease (COVID-19)"]
["China National Knowledge Infrastructure (CNKI)","PAHO","Global ",{"$f":"COUNTIF($B$1:B365,B365)","v":19},"PAHO19","China National Knowledge Infrastructure (CNKI)"]
["Elrha","PAHO","Global ",{"$f":"COUNTIF($B$1:B366,B366)","v":20},"PAHO20","Elrha"]
["(USA) White House Call to Action to the Tech Community on New Machine Readable COVID-19 Dataset","PAHO","National",{"$f":"COUNTIF($B$1:B367,B367)","v":21},"PAHO21","(USA) White House Call to Action to the Tech Community on New Machine Readable COVID-19 Dataset"]
["COVID-19 Open Research Dataset","PAHO","Global ",{"$f":"COUNTIF($B$1:B368,B368)","v":22},"PAHO22","COVID-19 Open Research Dataset"]
["Mental Health Commission of Canada","PAHO","National",{"$f":"COUNTIF($B$1:B369,B369)","v":23},"PAHO23","Mental Health Commission of Canada"]
["LitCovid","PAHO","Global ",{"$f":"COUNTIF($B$1:B370,B370)","v":24},"PAHO24","LitCovid"]
["U.S. National Institutes of Health","PAHO","National",{"$f":"COUNTIF($B$1:B371,B371)","v":25},"PAHO25","U.S. National Institutes of Health"]
["Ontario Ministry of Health ,Ministry of Long-Term Care","PAHO","Sub-national",{"$f":"COUNTIF($B$1:B372,B372)","v":26},"PAHO26","Ontario Ministry of Health ,Ministry of Long-Term Care"]
["Ontario Hospital Association","PAHO","Sub-national",{"$f":"COUNTIF($B$1:B373,B373)","v":27},"PAHO27","Ontario Hospital Association"]
["Government of Canada","PAHO","National",{"$f":"COUNTIF($B$1:B374,B374)","v":28},"PAHO28","Government of Canada"]
["TEPHINET Coronavirus Knowledge Hub","PAHO","Global ",{"$f":"COUNTIF($B$1:B375,B375)","v":29},"PAHO29","TEPHINET Coronavirus Knowledge Hub"]
["DynaMed","PAHO","Global ",{"$f":"COUNTIF($B$1:B376,B376)","v":30},"PAHO30","DynaMed"]
["Open government partnership","PAHO","Global ",{"$f":"COUNTIF($B$1:B377,B377)","v":31},"PAHO31","Open government partnership"]
["SocArxi Corona Net","PAHO","Global ",{"$f":"COUNTIF($B$1:B378,B378)","v":32},"PAHO32","SocArxi Corona Net"]
["Communication Initiative","PAHO","Global ",{"$f":"COUNTIF($B$1:B379,B379)","v":33},"PAHO33","Communication Initiative"]
["American Psychological Association: Education","PAHO","National",{"$f":"COUNTIF($B$1:B380,B380)","v":34},"PAHO34","American Psychological Association: Education"]
["Guidelines Network International","PAHO","Global ",{"$f":"COUNTIF($B$1:B381,B381)","v":35},"PAHO35","Guidelines Network International"]
["ECRI Guidelines Trust COVID-19 Resource Center","PAHO","Global ",{"$f":"COUNTIF($B$1:B382,B382)","v":36},"PAHO36","ECRI Guidelines Trust COVID-19 Resource Center"]
["George Institute","PAHO","Global ",{"$f":"COUNTIF($B$1:B383,B383)","v":37},"PAHO37","George Institute"]
["European Respiratory Society","PAHO","Global ",{"$f":"COUNTIF($B$1:B384,B384)","v":38},"PAHO38","European Respiratory Society"]
["Weekly Social Protection Links","PAHO","Global ",{"$f":"COUNTIF($B$1:B385,B385)","v":39},"PAHO39","Weekly Social Protection Links"]
["International Network for Government Science Advice (INGSA)","PAHO","Global ",{"$f":"COUNTIF($B$1:B386,B386)","v":40},"PAHO40","International Network for Government Science Advice (INGSA)"]
["Institut national d’excellence en santé et en services sociaux","PAHO","Sub-national",{"$f":"COUNTIF($B$1:B387,B387)","v":41},{"$f":"B387&D387","v":"PAHO41"},{"$f":"A387","v":"Institut national d’excellence en santé et en services sociaux"}]
["GULAGECHOES","PAHO","Global ",{"$f":"COUNTIF($B$1:B388,B388)","v":42},"PAHO42","GULAGECHOES"]
["The Marshall Project Coronavirus Tracker","PAHO","National",{"$f":"COUNTIF($B$1:B389,B389)","v":43},"PAHO43","The Marshall Project Coronavirus Tracker"]
["Vera Institute of Justice","PAHO","National",{"$f":"COUNTIF($B$1:B390,B390)","v":44},"PAHO44","Vera Institute of Justice"]
["ILO Social Protection Monitor","PAHO","Global ",{"$f":"COUNTIF($B$1:B391,B391)","v":45},"PAHO45","ILO Social Protection Monitor"]
["Malcolm Wiener Centre for Social Policy Monitoring the Covid-19 Employment Response: Policy Approaches Across Countries","PAHO","Global ",{"$f":"COUNTIF($B$1:B392,B392)","v":46},"PAHO46","Malcolm Wiener Centre for Social Policy Monitoring the Covid-19 Employment Response: Policy Approaches Across Countries"]
["Global Health 5050 COVID-19 sex-disaggregated data tracker","PAHO","Global ",{"$f":"COUNTIF($B$1:B393,B393)","v":47},"PAHO47","Global Health 5050 COVID-19 sex-disaggregated data tracker"]
["Dimensions COVID-19","PAHO","Global ",{"$f":"COUNTIF($B$1:B394,B394)","v":48},"PAHO48","Dimensions COVID-19"]
["OECD Multilevel Governance","PAHO","Regional",{"$f":"COUNTIF($B$1:B395,B395)","v":49},"PAHO49","OECD Multilevel Governance"]
["OECD SME Policy Responses","PAHO","Global ",{"$f":"COUNTIF($B$1:B396,B396)","v":50},"PAHO50","OECD SME Policy Responses"]
["Global overview of COVID-19: Impact on elections","PAHO","Global ",{"$f":"COUNTIF($B$1:B397,B397)","v":51},"PAHO51","Global overview of COVID-19: Impact on elections"]
["Conflict and Covid-19 Resource Hub","PAHO","Global ",{"$f":"COUNTIF($B$1:B398,B398)","v":52},"PAHO52","Conflict and Covid-19 Resource Hub"]
["Coronavirus: prison fever","PAHO","Global ",{"$f":"COUNTIF($B$1:B399,B399)","v":53},"PAHO53","Coronavirus: prison fever"]
["Candid Philanthropic Funding Data","PAHO","Global ",{"$f":"COUNTIF($B$1:B400,B400)","v":54},"PAHO54","Candid Philanthropic Funding Data"]
["Coronavirus Research Repository","PAHO","Global ",{"$f":"COUNTIF($B$1:B401,B401)","v":55},"PAHO55","Coronavirus Research Repository"]
["UN Habitat","PAHO","Global ",{"$f":"COUNTIF($B$1:B402,B402)","v":56},"PAHO56","UN Habitat"]
["UN Food and Agriculture Organisation(FAO)","PAHO","Global ",{"$f":"COUNTIF($B$1:B403,B403)","v":57},"PAHO57","UN Food and Agriculture Organisation(FAO)"]
["Inter-American Development Bank","PAHO","Regional",{"$f":"COUNTIF($B$1:B404,B404)","v":58},"PAHO58","Inter-American Development Bank"]
["Centers for Disease Control and Prevention","PAHO","Global ",{"$f":"COUNTIF($B$1:B405,B405)","v":59},"PAHO59","Centers for Disease Control and Prevention"]
["OECD Country Policy Tracker","PAHO","Global ",{"$f":"COUNTIF($B$1:B406,B406)","v":60},"PAHO60","OECD Country Policy Tracker"]
["OECD Health System Response Tracker","PAHO","Global ",{"$f":"COUNTIF($B$1:B407,B407)","v":61},"PAHO61","OECD Health System Response Tracker"]
["OECD Employment & Social policy responses by country","PAHO","Global ",{"$f":"COUNTIF($B$1:B408,B408)","v":62},"PAHO62","OECD Employment & Social policy responses by country"]
["UN International Labour Organisation(ILO)","PAHO","Global ",{"$f":"COUNTIF($B$1:B409,B409)","v":63},"PAHO63","UN International Labour Organisation(ILO)"]
["McMaster Daily News","PAHO","National",{"$f":"COUNTIF($B$1:B410,B410)","v":64},"PAHO64","McMaster Daily News"]
["Institute for Health Metrics and Evaluation (IHME)","PAHO","Global ",{"$f":"COUNTIF($B$1:B411,B411)","v":65},"PAHO65","Institute for Health Metrics and Evaluation (IHME)"]
["OECD Knowledge Hub","PAHO","Global ",{"$f":"COUNTIF($B$1:B412,B412)","v":66},"PAHO66","OECD Knowledge Hub"]
["COVID-19 and Citizen Science","PAHO","Global ",{"$f":"COUNTIF($B$1:B413,B413)","v":67},"PAHO67","COVID-19 and Citizen Science"]
["NMA","PAHO","Global ",{"$f":"COUNTIF($B$1:B414,B414)","v":68},"PAHO68","NMA"]
["Social Science in Humanitarian Action","PAHO","Global ",{"$f":"COUNTIF($B$1:B415,B415)","v":69},"PAHO69","Social Science in Humanitarian Action"]
["MCMaster National Collaborating Centre for Methods and Tools : Canada","PAHO","National",{"$f":"COUNTIF($B$1:B416,B416)","v":70},"PAHO70","MCMaster National Collaborating Centre for Methods and Tools : Canada"]
["EPI-WIN (WHO Information for Network for Epidemics)","PAHO","Global ",{"$f":"COUNTIF($B$1:B417,B417)","v":71},"PAHO71","EPI-WIN (WHO Information for Network for Epidemics)"]
["Hewlett Foundation","PAHO","Global ",{"$f":"COUNTIF($B$1:B418,B418)","v":72},"PAHO72","Hewlett Foundation"]
["Development aid","PAHO","Global ",{"$f":"COUNTIF($B$1:B419,B419)","v":73},"PAHO73","Development aid"]
["Fasken Covid 19 Knowledge","PAHO","National",{"$f":"COUNTIF($B$1:B420,B420)","v":74},"PAHO74","Fasken Covid 19 Knowledge"]
["Public Health Ontario","PAHO","Sub-national",{"$f":"COUNTIF($B$1:B421,B421)","v":75},"PAHO75","Public Health Ontario"]
["Coronavirus Tech Handbook","PAHO","Global ",{"$f":"COUNTIF($B$1:B422,B422)","v":76},"PAHO76","Coronavirus Tech Handbook"]
["Canadian Centre on substance use and addiction","PAHO","National",{"$f":"COUNTIF($B$1:B423,B423)","v":77},"PAHO77","Canadian Centre on substance use and addiction"]
["Covid-19 Innovations","PAHO","Global ",{"$f":"COUNTIF($B$1:B424,B424)","v":78},"PAHO78","Covid-19 Innovations"]
["Centre for Effective Practice","PAHO","Sub-national",{"$f":"COUNTIF($B$1:B425,B425)","v":79},"PAHO79","Centre for Effective Practice"]
["Health Economics, Policy and Law blog series on country responses","PAHO","Global ",{"$f":"COUNTIF($B$1:B426,B426)","v":80},"PAHO80","Health Economics, Policy and Law blog series on country responses"]
["SYREAF","PAHO","Global ",{"$f":"COUNTIF($B$1:B427,B427)","v":81},"PAHO81","SYREAF"]
["OECD Science and innovation policy responses by country","PAHO","Global ",{"$f":"COUNTIF($B$1:B428,B428)","v":82},"PAHO82","OECD Science and innovation policy responses by country"]
["CHAIN","PAHO","Global ",{"$f":"COUNTIF($B$1:B429,B429)","v":83},"PAHO83","CHAIN"]
["Oxford Evidence Service","PAHO","Global ",{"$f":"COUNTIF($B$1:B430,B430)","v":84},"PAHO84","Oxford Evidence Service"]
["COVID-19 Economic Stimulus Index","PAHO","Global ",{"$f":"COUNTIF($B$1:B431,B431)","v":85},"PAHO85","COVID-19 Economic Stimulus Index"]
["World Bank Education","PAHO","Global ",{"$f":"COUNTIF($B$1:B432,B432)","v":86},"PAHO86","World Bank Education"]
["American College of Cardiology","PAHO","Global ",{"$f":"COUNTIF($B$1:B433,B433)","v":87},"PAHO87","American College of Cardiology"]
["International Long Term Care Policy Network","PAHO","Global ",{"$f":"COUNTIF($B$1:B434,B434)","v":88},"PAHO88","International Long Term Care Policy Network"]
["International trade centre","PAHO","Global ",{"$f":"COUNTIF($B$1:B435,B435)","v":89},"PAHO89","International trade centre"]
["WHO R & D","PAHO","Global ",{"$f":"COUNTIF($B$1:B436,B436)","v":90},"PAHO90","WHO R & D"]
["United Nations Office for the Coordination of Humanitarian Affairs","PAHO","Global ",{"$f":"COUNTIF($B$1:B437,B437)","v":91},"PAHO91","United Nations Office for the Coordination of Humanitarian Affairs"]
["UNIDO","PAHO","Global ",{"$f":"COUNTIF($B$1:B438,B438)","v":92},"PAHO92","UNIDO"]
["International Centre for not-for-profit law","PAHO","Global ",{"$f":"COUNTIF($B$1:B439,B439)","v":93},"PAHO93","International Centre for not-for-profit law"]
["Asian Development Bank","PAHO","Global ",{"$f":"COUNTIF($B$1:B440,B440)","v":94},"PAHO94","Asian Development Bank"]
["Regional Educational Laboratories (RELs)","PAHO","National",{"$f":"COUNTIF($B$1:B441,B441)","v":95},"PAHO95","Regional Educational Laboratories (RELs)"]
["Tableau Public","PAHO","Global ",{"$f":"COUNTIF($B$1:B442,B442)","v":96},"PAHO96","Tableau Public"]
["Havard Dataverse","PAHO","Global ",{"$f":"COUNTIF($B$1:B443,B443)","v":97},"PAHO97","Havard Dataverse"]
["WHO Global research on coronavirus disease (COVID-19)","PAHO","Global ",{"$f":"COUNTIF($B$1:B444,B444)","v":98},"PAHO98","WHO Global research on coronavirus disease (COVID-19)"]
["World Health Organization (WHO) technical guidelines","PAHO","Global ",{"$f":"COUNTIF($B$1:B445,B445)","v":99},"PAHO99","World Health Organization (WHO) technical guidelines"]
["UNESCO Planipolis","PAHO","Global ",{"$f":"COUNTIF($B$1:B446,B446)","v":100},"PAHO100","UNESCO Planipolis"]
["U.S. Veterans’ Affairs (VA) Evidence Synthesis Program","PAHO","Global ",{"$f":"COUNTIF($B$1:B447,B447)","v":101},"PAHO101","U.S. Veterans’ Affairs (VA) Evidence Synthesis Program"]
["Ontario Health’s Quality Business Unit","PAHO","Sub-national",{"$f":"COUNTIF($B$1:B448,B448)","v":102},"PAHO102","Ontario Health’s Quality Business Unit"]
["Santé Public France","PAHO","Global ",{"$f":"COUNTIF($B$1:B449,B449)","v":103},"PAHO103","Santé Public France"]
["Campbell UK and Ireland","PAHO","Global ",{"$f":"COUNTIF($B$1:B450,B450)","v":104},"PAHO104","Campbell UK and Ireland"]
["Prison Policy Initiative","PAHO","National",{"$f":"COUNTIF($B$1:B451,B451)","v":105},{"$f":"B451&D451","v":"PAHO105"},{"$f":"A451","v":"Prison Policy Initiative"}]
["Brennan Center for Justice","PAHO","National",{"$f":"COUNTIF($B$1:B452,B452)","v":106},"PAHO106","Brennan Center for Justice"]
["Africaxiv","PAHO","Regional",{"$f":"COUNTIF($B$1:B453,B453)","v":107},"PAHO107","Africaxiv"]
["Our World In data Policy Responses to the Coronavirus Pandemic","PAHO","Global ",{"$f":"COUNTIF($B$1:B454,B454)","v":108},"PAHO108","Our World In data Policy Responses to the Coronavirus Pandemic"]
["Wolters Kluwer Global Infectious Diseases and Epidemiology Online Network (GIDEON)","PAHO","Global ",{"$f":"COUNTIF($B$1:B455,B455)","v":109},"PAHO109","Wolters Kluwer Global Infectious Diseases and Epidemiology Online Network (GIDEON)"]
["COVID 19 Inequality Project","PAHO","Regional",{"$f":"COUNTIF($B$1:B456,B456)","v":110},"PAHO110","COVID 19 Inequality Project"]
["European Society of Intensive Care Medicine","PAHO","Global ",{"$f":"COUNTIF($B$1:B457,B457)","v":111},"PAHO111","European Society of Intensive Care Medicine"]
["Health Data Research UK","PAHO","Global ",{"$f":"COUNTIF($B$1:B458,B458)","v":112},"PAHO112","Health Data Research UK"]
["COVID Racial Data Tracker","PAHO","National",{"$f":"COUNTIF($B$1:B459,B459)","v":113},"PAHO113","COVID Racial Data Tracker"]
["CGD - COVID education policy tracking","PAHO","Global ",{"$f":"COUNTIF($B$1:B460,B460)","v":114},"PAHO114","CGD - COVID education policy tracking"]
["World Pandemic Research Network (WPRN) ","PAHO","Global ",{"$f":"COUNTIF($B$1:B461,B461)","v":115},"PAHO115","World Pandemic Research Network (WPRN) "]
["OECD Cities responses","PAHO","Global ",{"$f":"COUNTIF($B$1:B462,B462)","v":116},"PAHO116","OECD Cities responses"]
["GovPredict Federal, State, and Local Responses to the Coronavirus\nFocus","PAHO","National",{"$f":"COUNTIF($B$1:B463,B463)","v":117},"PAHO117","GovPredict Federal, State, and Local Responses to the Coronavirus\nFocus"]
["EY COVID-19 Global Trade Considerations tracker ","PAHO","Global ",{"$f":"COUNTIF($B$1:B464,B464)","v":118},"PAHO118","EY COVID-19 Global Trade Considerations tracker "]
["OECD SME Policy Responses","PAHO","Global ",{"$f":"COUNTIF($B$1:B465,B465)","v":119},"PAHO119","OECD SME Policy Responses"]
["CIAT/IOTA/OECD Tax Response","PAHO","Global ",{"$f":"COUNTIF($B$1:B466,B466)","v":120},"PAHO120","CIAT/IOTA/OECD Tax Response"]
["IFPRI Covid 19 Food Trade Policy Tracker","PAHO","Global ",{"$f":"COUNTIF($B$1:B467,B467)","v":121},"PAHO121","IFPRI Covid 19 Food Trade Policy Tracker"]
["Global Health Network Covid-19 Research Implementation Hub","PAHO","Global ",{"$f":"COUNTIF($B$1:B468,B468)","v":122},"PAHO122","Global Health Network Covid-19 Research Implementation Hub"]
["OECD Tourism Summary","PAHO","Global ",{"$f":"COUNTIF($B$1:B469,B469)","v":123},"PAHO123","OECD Tourism Summary"]
["Society of Critical Care Medicine","PAHO","Global ",{"$f":"COUNTIF($B$1:B470,B470)","v":124},"PAHO124","Society of Critical Care Medicine"]
["Covid19 Behaviour Tracker\n","PAHO","Global ",{"$f":"COUNTIF($B$1:B471,B471)","v":125},"PAHO125","Covid19 Behaviour Tracker\n"]
["Kaggle","PAHO","Global ",{"$f":"COUNTIF($B$1:B472,B472)","v":126},"PAHO126","Kaggle"]
["Google Covid-19 Community Mobility Reports","PAHO","Global ",{"$f":"COUNTIF($B$1:B473,B473)","v":127},"PAHO127","Google Covid-19 Community Mobility Reports"]
["Wiley Covid-19: Novel Coronavirus Outbreak","PAHO","Global ",{"$f":"COUNTIF($B$1:B474,B474)","v":128},"PAHO128","Wiley Covid-19: Novel Coronavirus Outbreak"]
["COVID-19 Disorder Tracker (CDT)","PAHO","Global ",{"$f":"COUNTIF($B$1:B475,B475)","v":129},"PAHO129","COVID-19 Disorder Tracker (CDT)"]
["UCLA Law Covid-19 Behind Bars Data Project","PAHO","National",{"$f":"COUNTIF($B$1:B476,B476)","v":130},"PAHO130","UCLA Law Covid-19 Behind Bars Data Project"]
["Covid Prison Data","PAHO","National",{"$f":"COUNTIF($B$1:B477,B477)","v":131},"PAHO131","Covid Prison Data"]
["Global Policy Responses – Developed Markets ","PAHO","Regional",{"$f":"COUNTIF($B$1:B478,B478)","v":132},"PAHO132","Global Policy Responses – Developed Markets "]
["Economic Relief Around the World","PAHO","Global ",{"$f":"COUNTIF($B$1:B479,B479)","v":133},"PAHO133","Economic Relief Around the World"]
["Impact Peace Resources on Covid","PAHO","Global ",{"$f":"COUNTIF($B$1:B480,B480)","v":134},"PAHO134","Impact Peace Resources on Covid"]
["EBSCO Medical","PAHO","Global ",{"$f":"COUNTIF($B$1:B481,B481)","v":135},"PAHO135","EBSCO Medical"]
["UNDP HDR Global Preparedness and Vulnerability Dashboard","PAHO","Global ",{"$f":"COUNTIF($B$1:B482,B482)","v":136},"PAHO136","UNDP HDR Global Preparedness and Vulnerability Dashboard"]
["International Monetary Fund (IMF)","SEARO","Global ",{"$f":"COUNTIF($B$1:B483,B483)","v":1},"SEARO1","International Monetary Fund (IMF)"]
["World Bank Data","SEARO","Global ",{"$f":"COUNTIF($B$1:B484,B484)","v":2},"SEARO2","World Bank Data"]
["Covidbase","SEARO","Global ",{"$f":"COUNTIF($B$1:B485,B485)","v":3},"SEARO3","Covidbase"]
["Oxford Government response tracker","SEARO","Global ",{"$f":"COUNTIF($B$1:B486,B486)","v":4},"SEARO4","Oxford Government response tracker"]
["Yale School of Management's Program COVID-19 Financial Response Tracker (CFRT)","SEARO","Global ",{"$f":"COUNTIF($B$1:B487,B487)","v":5},"SEARO5","Yale School of Management's Program COVID-19 Financial Response Tracker (CFRT)"]
["UNDP COVID 19 Dashboard","SEARO","Global ",{"$f":"COUNTIF($B$1:B488,B488)","v":6},"SEARO6","UNDP COVID 19 Dashboard"]
["UNICEF","SEARO","Global ",{"$f":"COUNTIF($B$1:B489,B489)","v":7},"SEARO7","UNICEF"]
["OECD Tax policy responses by country","SEARO","Global ",{"$f":"COUNTIF($B$1:B490,B490)","v":8},"SEARO8","OECD Tax policy responses by country"]
["COVID-19 Research Project Tracker by UKCDR & GloPID-R","SEARO","Global ",{"$f":"COUNTIF($B$1:B491,B491)","v":9},"SEARO9","COVID-19 Research Project Tracker by UKCDR & GloPID-R"]
["UNESCO COVID-19","SEARO","Global ",{"$f":"COUNTIF($B$1:B492,B492)","v":10},"SEARO10","UNESCO COVID-19"]
["Johns Hopkins University and Medicine Coronavirus Resource Center","SEARO","Global ",{"$f":"COUNTIF($B$1:B493,B493)","v":11},"SEARO11","Johns Hopkins University and Medicine Coronavirus Resource Center"]
["McMaster COVID-19 evidence","SEARO","Global ",{"$f":"COUNTIF($B$1:B494,B494)","v":12},"SEARO12","McMaster COVID-19 evidence"]
["Economics for Inclusive Prosperity (Econflip)","SEARO","Global ",{"$f":"COUNTIF($B$1:B495,B495)","v":13},"SEARO13","Economics for Inclusive Prosperity (Econflip)"]
["Our World in Data Coronavirus Disease (COVID-19)","SEARO","Global ",{"$f":"COUNTIF($B$1:B496,B496)","v":14},"SEARO14","Our World in Data Coronavirus Disease (COVID-19)"]
["China National Knowledge Infrastructure (CNKI)","SEARO","Global ",{"$f":"COUNTIF($B$1:B497,B497)","v":15},"SEARO15","China National Knowledge Infrastructure (CNKI)"]
["Elrha","SEARO","Global ",{"$f":"COUNTIF($B$1:B498,B498)","v":16},"SEARO16","Elrha"]
["COVID-19 Open Research Dataset","SEARO","Global ",{"$f":"COUNTIF($B$1:B499,B499)","v":17},"SEARO17","COVID-19 Open Research Dataset"]
["LitCovid","SEARO","Global ",{"$f":"COUNTIF($B$1:B500,B500)","v":18},"SEARO18","LitCovid"]
["TEPHINET Coronavirus Knowledge Hub","SEARO","Global ",{"$f":"COUNTIF($B$1:B501,B501)","v":19},"SEARO19","TEPHINET Coronavirus Knowledge Hub"]
["DynaMed","SEARO","Global ",{"$f":"COUNTIF($B$1:B502,B502)","v":20},"SEARO20","DynaMed"]
["Open government partnership","SEARO","Global ",{"$f":"COUNTIF($B$1:B503,B503)","v":21},"SEARO21","Open government partnership"]
["SocArxi Corona Net","SEARO","Global ",{"$f":"COUNTIF($B$1:B504,B504)","v":22},"SEARO22","SocArxi Corona Net"]
["Communication Initiative","SEARO","Global ",{"$f":"COUNTIF($B$1:B505,B505)","v":23},"SEARO23","Communication Initiative"]
["Guidelines Network International","SEARO","Global ",{"$f":"COUNTIF($B$1:B506,B506)","v":24},"SEARO24","Guidelines Network International"]
["ECRI Guidelines Trust COVID-19 Resource Center","SEARO","Global ",{"$f":"COUNTIF($B$1:B507,B507)","v":25},"SEARO25","ECRI Guidelines Trust COVID-19 Resource Center"]
["George Institute","SEARO","Global ",{"$f":"COUNTIF($B$1:B508,B508)","v":26},"SEARO26","George Institute"]
["European Respiratory Society","SEARO","Global ",{"$f":"COUNTIF($B$1:B509,B509)","v":27},"SEARO27","European Respiratory Society"]
["Weekly Social Protection Links","SEARO","Global ",{"$f":"COUNTIF($B$1:B510,B510)","v":28},"SEARO28","Weekly Social Protection Links"]
["International Network for Government Science Advice (INGSA)","SEARO","Global ",{"$f":"COUNTIF($B$1:B511,B511)","v":29},"SEARO29","International Network for Government Science Advice (INGSA)"]
["GULAGECHOES","SEARO","Global ",{"$f":"COUNTIF($B$1:B512,B512)","v":30},"SEARO30","GULAGECHOES"]
["ILO Social Protection Monitor","SEARO","Global ",{"$f":"COUNTIF($B$1:B513,B513)","v":31},"SEARO31","ILO Social Protection Monitor"]
["Global Health 5050 COVID-19 sex-disaggregated data tracker","SEARO","Global ",{"$f":"COUNTIF($B$1:B514,B514)","v":32},"SEARO32","Global Health 5050 COVID-19 sex-disaggregated data tracker"]
["Dimensions COVID-19","SEARO","Global ",{"$f":"COUNTIF($B$1:B515,B515)","v":33},{"$f":"B515&D515","v":"SEARO33"},{"$f":"A515","v":"Dimensions COVID-19"}]
["OECD SME Policy Responses","SEARO","Global ",{"$f":"COUNTIF($B$1:B516,B516)","v":34},"SEARO34","OECD SME Policy Responses"]
["Global overview of COVID-19: Impact on elections","SEARO","Global ",{"$f":"COUNTIF($B$1:B517,B517)","v":35},"SEARO35","Global overview of COVID-19: Impact on elections"]
["Conflict and Covid-19 Resource Hub","SEARO","Global ",{"$f":"COUNTIF($B$1:B518,B518)","v":36},"SEARO36","Conflict and Covid-19 Resource Hub"]
["Coronavirus: prison fever","SEARO","Global ",{"$f":"COUNTIF($B$1:B519,B519)","v":37},"SEARO37","Coronavirus: prison fever"]
["Candid Philanthropic Funding Data","SEARO","Global ",{"$f":"COUNTIF($B$1:B520,B520)","v":38},"SEARO38","Candid Philanthropic Funding Data"]
["Coronavirus Research Repository","SEARO","Global ",{"$f":"COUNTIF($B$1:B521,B521)","v":39},"SEARO39","Coronavirus Research Repository"]
["UN Habitat","SEARO","Global ",{"$f":"COUNTIF($B$1:B522,B522)","v":40},"SEARO40","UN Habitat"]
["UN Food and Agriculture Organisation(FAO)","SEARO","Global ",{"$f":"COUNTIF($B$1:B523,B523)","v":41},"SEARO41","UN Food and Agriculture Organisation(FAO)"]
["Centers for Disease Control and Prevention","SEARO","Global ",{"$f":"COUNTIF($B$1:B524,B524)","v":42},"SEARO42","Centers for Disease Control and Prevention"]
["OECD Country Policy Tracker","SEARO","Global ",{"$f":"COUNTIF($B$1:B525,B525)","v":43},"SEARO43","OECD Country Policy Tracker"]
["OECD Health System Response Tracker","SEARO","Global ",{"$f":"COUNTIF($B$1:B526,B526)","v":44},"SEARO44","OECD Health System Response Tracker"]
["OECD Employment & Social policy responses by country","SEARO","Global ",{"$f":"COUNTIF($B$1:B527,B527)","v":45},"SEARO45","OECD Employment & Social policy responses by country"]
["UN International Labour Organisation(ILO)","SEARO","Global ",{"$f":"COUNTIF($B$1:B528,B528)","v":46},"SEARO46","UN International Labour Organisation(ILO)"]
["Institute for Health Metrics and Evaluation (IHME)","SEARO","Global ",{"$f":"COUNTIF($B$1:B529,B529)","v":47},"SEARO47","Institute for Health Metrics and Evaluation (IHME)"]
["OECD Knowledge Hub","SEARO","Global ",{"$f":"COUNTIF($B$1:B530,B530)","v":48},"SEARO48","OECD Knowledge Hub"]
["COVID-19 and Citizen Science","SEARO","Global ",{"$f":"COUNTIF($B$1:B531,B531)","v":49},"SEARO49","COVID-19 and Citizen Science"]
["NMA","SEARO","Global ",{"$f":"COUNTIF($B$1:B532,B532)","v":50},"SEARO50","NMA"]
["Social Science in Humanitarian Action","SEARO","Global ",{"$f":"COUNTIF($B$1:B533,B533)","v":51},"SEARO51","Social Science in Humanitarian Action"]
["EPI-WIN (WHO Information for Network for Epidemics)","SEARO","Global ",{"$f":"COUNTIF($B$1:B534,B534)","v":52},"SEARO52","EPI-WIN (WHO Information for Network for Epidemics)"]
["Hewlett Foundation","SEARO","Global ",{"$f":"COUNTIF($B$1:B535,B535)","v":53},"SEARO53","Hewlett Foundation"]
["Development aid","SEARO","Global ",{"$f":"COUNTIF($B$1:B536,B536)","v":54},"SEARO54","Development aid"]
["Coronavirus Tech Handbook","SEARO","No geographical scope",{"$f":"COUNTIF($B$1:B537,B537)","v":55},"SEARO55","Coronavirus Tech Handbook"]
["Covid-19 Innovations","SEARO","Global ",{"$f":"COUNTIF($B$1:B538,B538)","v":56},"SEARO56","Covid-19 Innovations"]
["Health Economics, Policy and Law blog series on country responses","SEARO","Global ",{"$f":"COUNTIF($B$1:B539,B539)","v":57},"SEARO57","Health Economics, Policy and Law blog series on country responses"]
["SYREAF","SEARO","Global ",{"$f":"COUNTIF($B$1:B540,B540)","v":58},"SEARO58","SYREAF"]
["CHAIN","SEARO","Global ",{"$f":"COUNTIF($B$1:B541,B541)","v":59},"SEARO59","CHAIN"]
["Oxford Evidence Service","SEARO","Global ",{"$f":"COUNTIF($B$1:B542,B542)","v":60},"SEARO60","Oxford Evidence Service"]
["COVID-19 Economic Stimulus Index","SEARO","Global ",{"$f":"COUNTIF($B$1:B543,B543)","v":61},"SEARO61","COVID-19 Economic Stimulus Index"]
["World Bank Education","SEARO","Global ",{"$f":"COUNTIF($B$1:B544,B544)","v":62},"SEARO62","World Bank Education"]
["American College of Cardiology","SEARO","Global ",{"$f":"COUNTIF($B$1:B545,B545)","v":63},"SEARO63","American College of Cardiology"]
["International Long Term Care Policy Network","SEARO","Global ",{"$f":"COUNTIF($B$1:B546,B546)","v":64},"SEARO64","International Long Term Care Policy Network"]
["Elsevier Novel Coronavirus Information Center","SEARO","Global ",{"$f":"COUNTIF($B$1:B547,B547)","v":65},"SEARO65","Elsevier Novel Coronavirus Information Center"]
["International trade centre","SEARO","Global ",{"$f":"COUNTIF($B$1:B548,B548)","v":66},"SEARO66","International trade centre"]
["WHO R & D","SEARO","Global ",{"$f":"COUNTIF($B$1:B549,B549)","v":67},"SEARO67","WHO R & D"]
["United Nations Office for the Coordination of Humanitarian Affairs","SEARO","Global ",{"$f":"COUNTIF($B$1:B550,B550)","v":68},"SEARO68","United Nations Office for the Coordination of Humanitarian Affairs"]
["UNIDO","SEARO","Global ",{"$f":"COUNTIF($B$1:B551,B551)","v":69},"SEARO69","UNIDO"]
["International Centre for not-for-profit law","SEARO","Global ",{"$f":"COUNTIF($B$1:B552,B552)","v":70},"SEARO70","International Centre for not-for-profit law"]
["Asian Development Bank","SEARO","Global ",{"$f":"COUNTIF($B$1:B553,B553)","v":71},"SEARO71","Asian Development Bank"]
["Regional Educational Laboratories (RELs)","SEARO","National",{"$f":"COUNTIF($B$1:B554,B554)","v":72},"SEARO72","Regional Educational Laboratories (RELs)"]
["Tableau Public","SEARO","Global ",{"$f":"COUNTIF($B$1:B555,B555)","v":73},"SEARO73","Tableau Public"]
["Havard Dataverse","SEARO","Global ",{"$f":"COUNTIF($B$1:B556,B556)","v":74},"SEARO74","Havard Dataverse"]
["WHO Global research on coronavirus disease (COVID-19)","SEARO","Global ",{"$f":"COUNTIF($B$1:B557,B557)","v":75},"SEARO75","WHO Global research on coronavirus disease (COVID-19)"]
["World Health Organization (WHO) technical guidelines","SEARO","Global ",{"$f":"COUNTIF($B$1:B558,B558)","v":76},"SEARO76","World Health Organization (WHO) technical guidelines"]
["UNESCO Planipolis","SEARO","Global ",{"$f":"COUNTIF($B$1:B559,B559)","v":77},"SEARO77","UNESCO Planipolis"]
["U.S. Veterans’ Affairs (VA) Evidence Synthesis Program","SEARO","Global ",{"$f":"COUNTIF($B$1:B560,B560)","v":78},"SEARO78","U.S. Veterans’ Affairs (VA) Evidence Synthesis Program"]
["Santé Public France","SEARO","Global ",{"$f":"COUNTIF($B$1:B561,B561)","v":79},"SEARO79","Santé Public France"]
["Campbell UK and Ireland","SEARO","Global ",{"$f":"COUNTIF($B$1:B562,B562)","v":80},"SEARO80","Campbell UK and Ireland"]
["Africaxiv","SEARO","Regional",{"$f":"COUNTIF($B$1:B563,B563)","v":81},"SEARO81","Africaxiv"]
["Our World In data Policy Responses to the Coronavirus Pandemic","SEARO","Global ",{"$f":"COUNTIF($B$1:B564,B564)","v":82},"SEARO82","Our World In data Policy Responses to the Coronavirus Pandemic"]
["Wolters Kluwer Global Infectious Diseases and Epidemiology Online Network (GIDEON)","SEARO","Global ",{"$f":"COUNTIF($B$1:B565,B565)","v":83},"SEARO83","Wolters Kluwer Global Infectious Diseases and Epidemiology Online Network (GIDEON)"]
["European Society of Intensive Care Medicine","SEARO","Global ",{"$f":"COUNTIF($B$1:B566,B566)","v":84},"SEARO84","European Society of Intensive Care Medicine"]
["Health Data Research UK","SEARO","Global ",{"$f":"COUNTIF($B$1:B567,B567)","v":85},"SEARO85","Health Data Research UK"]
["CGD - COVID education policy tracking","SEARO","Global ",{"$f":"COUNTIF($B$1:B568,B568)","v":86},"SEARO86","CGD - COVID education policy tracking"]
["World Pandemic Research Network (WPRN) ","SEARO","Global ",{"$f":"COUNTIF($B$1:B569,B569)","v":87},"SEARO87","World Pandemic Research Network (WPRN) "]
["OECD Cities responses","SEARO","Global ",{"$f":"COUNTIF($B$1:B570,B570)","v":88},"SEARO88","OECD Cities responses"]
["International Growth Centre(ICG)","SEARO","Regional",{"$f":"COUNTIF($B$1:B571,B571)","v":89},"SEARO89","International Growth Centre(ICG)"]
["OECD SME Policy Responses","SEARO","Global ",{"$f":"COUNTIF($B$1:B572,B572)","v":90},"SEARO90","OECD SME Policy Responses"]
["Global Health Network Covid-19 Research Implementation Hub","SEARO","Global ",{"$f":"COUNTIF($B$1:B573,B573)","v":91},"SEARO91","Global Health Network Covid-19 Research Implementation Hub"]
["OECD Tourism Summary","SEARO","Global ",{"$f":"COUNTIF($B$1:B574,B574)","v":92},"SEARO92","OECD Tourism Summary"]
["Society of Critical Care Medicine","SEARO","Global ",{"$f":"COUNTIF($B$1:B575,B575)","v":93},"SEARO93","Society of Critical Care Medicine"]
["Covid19 Behaviour Tracker\n","SEARO","Global ",{"$f":"COUNTIF($B$1:B576,B576)","v":94},"SEARO94","Covid19 Behaviour Tracker\n"]
["Kaggle","SEARO","Global ",{"$f":"COUNTIF($B$1:B577,B577)","v":95},"SEARO95","Kaggle"]
["Google Covid-19 Community Mobility Reports","SEARO","Global ",{"$f":"COUNTIF($B$1:B578,B578)","v":96},"SEARO96","Google Covid-19 Community Mobility Reports"]
["Wiley Covid-19: Novel Coronavirus Outbreak","SEARO","Global ",{"$f":"COUNTIF($B$1:B579,B579)","v":97},{"$f":"B579&D579","v":"SEARO97"},{"$f":"A579","v":"Wiley Covid-19: Novel Coronavirus Outbreak"}]
["COVID-19 Disorder Tracker (CDT)","SEARO","Global ",{"$f":"COUNTIF($B$1:B580,B580)","v":98},"SEARO98","COVID-19 Disorder Tracker (CDT)"]
["Economic Relief Around the World","SEARO","Global ",{"$f":"COUNTIF($B$1:B581,B581)","v":99},"SEARO99","Economic Relief Around the World"]
["Impact Peace Resources on Covid","SEARO","Global ",{"$f":"COUNTIF($B$1:B582,B582)","v":100},"SEARO100","Impact Peace Resources on Covid"]
["EBSCO Medical","SEARO","Global ",{"$f":"COUNTIF($B$1:B583,B583)","v":101},"SEARO101","EBSCO Medical"]
["UNDP HDR Global Preparedness and Vulnerability Dashboard","SEARO","Global ",{"$f":"COUNTIF($B$1:B584,B584)","v":102},"SEARO102","UNDP HDR Global Preparedness and Vulnerability Dashboard"]
["International Monetary Fund (IMF)","WPRO","Global ",{"$f":"COUNTIF($B$1:B585,B585)","v":1},"WPRO1","International Monetary Fund (IMF)"]
["World Bank Data","WPRO","Global ",{"$f":"COUNTIF($B$1:B586,B586)","v":2},"WPRO2","World Bank Data"]
["Covidbase","WPRO","Global ",{"$f":"COUNTIF($B$1:B587,B587)","v":3},"WPRO3","Covidbase"]
["Oxford Government response tracker","WPRO","Global ",{"$f":"COUNTIF($B$1:B588,B588)","v":4},"WPRO4","Oxford Government response tracker"]
["Yale School of Management's Program COVID-19 Financial Response Tracker (CFRT)","WPRO","Global ",{"$f":"COUNTIF($B$1:B589,B589)","v":5},"WPRO5","Yale School of Management's Program COVID-19 Financial Response Tracker (CFRT)"]
["UNDP COVID 19 Dashboard","WPRO","Global ",{"$f":"COUNTIF($B$1:B590,B590)","v":6},"WPRO6","UNDP COVID 19 Dashboard"]
["UNICEF","WPRO","Global ",{"$f":"COUNTIF($B$1:B591,B591)","v":7},"WPRO7","UNICEF"]
["UNEP","WPRO","Global ",{"$f":"COUNTIF($B$1:B592,B592)","v":8},"WPRO8","UNEP"]
["OECD Tax policy responses by country","WPRO","Global ",{"$f":"COUNTIF($B$1:B593,B593)","v":9},"WPRO9","OECD Tax policy responses by country"]
["COVID-19 Research Project Tracker by UKCDR & GloPID-R","WPRO","Global ",{"$f":"COUNTIF($B$1:B594,B594)","v":10},"WPRO10","COVID-19 Research Project Tracker by UKCDR & GloPID-R"]
["UNESCO COVID-19","WPRO","Global ",{"$f":"COUNTIF($B$1:B595,B595)","v":11},"WPRO11","UNESCO COVID-19"]
["Johns Hopkins University and Medicine Coronavirus Resource Center","WPRO","Global ",{"$f":"COUNTIF($B$1:B596,B596)","v":12},"WPRO12","Johns Hopkins University and Medicine Coronavirus Resource Center"]
["McMaster COVID-19 evidence","WPRO","Global ",{"$f":"COUNTIF($B$1:B597,B597)","v":13},"WPRO13","McMaster COVID-19 evidence"]
["Economics for Inclusive Prosperity (Econflip)","WPRO","Global ",{"$f":"COUNTIF($B$1:B598,B598)","v":14},"WPRO14","Economics for Inclusive Prosperity (Econflip)"]
["Our World in Data Coronavirus Disease (COVID-19)","WPRO","Global ",{"$f":"COUNTIF($B$1:B599,B599)","v":15},"WPRO15","Our World in Data Coronavirus Disease (COVID-19)"]
["China National Knowledge Infrastructure (CNKI)","WPRO","Global ",{"$f":"COUNTIF($B$1:B600,B600)","v":16},"WPRO16","China National Knowledge Infrastructure (CNKI)"]
["Elrha","WPRO","Global ",{"$f":"COUNTIF($B$1:B601,B601)","v":17},"WPRO17","Elrha"]
["COVID-19 Open Research Dataset","WPRO","Global ",{"$f":"COUNTIF($B$1:B602,B602)","v":18},"WPRO18","COVID-19 Open Research Dataset"]
["LitCovid","WPRO","Global ",{"$f":"COUNTIF($B$1:B603,B603)","v":19},"WPRO19","LitCovid"]
["TEPHINET Coronavirus Knowledge Hub","WPRO","Global ",{"$f":"COUNTIF($B$1:B604,B604)","v":20},"WPRO20","TEPHINET Coronavirus Knowledge Hub"]
["DynaMed","WPRO","Global ",{"$f":"COUNTIF($B$1:B605,B605)","v":21},"WPRO21","DynaMed"]
["Open government partnership","WPRO","Global ",{"$f":"COUNTIF($B$1:B606,B606)","v":22},"WPRO22","Open government partnership"]
["SocArxi Corona Net","WPRO","Global ",{"$f":"COUNTIF($B$1:B607,B607)","v":23},"WPRO23","SocArxi Corona Net"]
["Communication Initiative","WPRO","Global ",{"$f":"COUNTIF($B$1:B608,B608)","v":24},"WPRO24","Communication Initiative"]
["Guidelines Network International","WPRO","Global ",{"$f":"COUNTIF($B$1:B609,B609)","v":25},"WPRO25","Guidelines Network International"]
["ECRI Guidelines Trust COVID-19 Resource Center","WPRO","Global ",{"$f":"COUNTIF($B$1:B610,B610)","v":26},"WPRO26","ECRI Guidelines Trust COVID-19 Resource Center"]
["George Institute","WPRO","Global ",{"$f":"COUNTIF($B$1:B611,B611)","v":27},"WPRO27","George Institute"]
["European Respiratory Society","WPRO","Global ",{"$f":"COUNTIF($B$1:B612,B612)","v":28},"WPRO28","European Respiratory Society"]
["Weekly Social Protection Links","WPRO","Global ",{"$f":"COUNTIF($B$1:B613,B613)","v":29},"WPRO29","Weekly Social Protection Links"]
["International Network for Government Science Advice (INGSA)","WPRO","Global ",{"$f":"COUNTIF($B$1:B614,B614)","v":30},"WPRO30","International Network for Government Science Advice (INGSA)"]
["GULAGECHOES","WPRO","Global ",{"$f":"COUNTIF($B$1:B615,B615)","v":31},"WPRO31","GULAGECHOES"]
["ILO Social Protection Monitor","WPRO","Global ",{"$f":"COUNTIF($B$1:B616,B616)","v":32},"WPRO32","ILO Social Protection Monitor"]
["Malcolm Wiener Centre for Social Policy Monitoring the Covid-19 Employment Response: Policy Approaches Across Countries","WPRO","Global ",{"$f":"COUNTIF($B$1:B617,B617)","v":33},"WPRO33","Malcolm Wiener Centre for Social Policy Monitoring the Covid-19 Employment Response: Policy Approaches Across Countries"]
["Global Health 5050 COVID-19 sex-disaggregated data tracker","WPRO","Global ",{"$f":"COUNTIF($B$1:B618,B618)","v":34},"WPRO34","Global Health 5050 COVID-19 sex-disaggregated data tracker"]
["Dimensions COVID-19","WPRO","Global ",{"$f":"COUNTIF($B$1:B619,B619)","v":35},"WPRO35","Dimensions COVID-19"]
["OECD Multilevel Governance","WPRO","Regional",{"$f":"COUNTIF($B$1:B620,B620)","v":36},"WPRO36","OECD Multilevel Governance"]
["OECD SME Policy Responses","WPRO","Global ",{"$f":"COUNTIF($B$1:B621,B621)","v":37},"WPRO37","OECD SME Policy Responses"]
["Global overview of COVID-19: Impact on elections","WPRO","Global ",{"$f":"COUNTIF($B$1:B622,B622)","v":38},"WPRO38","Global overview of COVID-19: Impact on elections"]
["Conflict and Covid-19 Resource Hub","WPRO","Global ",{"$f":"COUNTIF($B$1:B623,B623)","v":39},"WPRO39","Conflict and Covid-19 Resource Hub"]
["Coronavirus: prison fever","WPRO","Global ",{"$f":"COUNTIF($B$1:B624,B624)","v":40},"WPRO40","Coronavirus: prison fever"]
["Candid Philanthropic Funding Data","WPRO","Global ",{"$f":"COUNTIF($B$1:B625,B625)","v":41},"WPRO41","Candid Philanthropic Funding Data"]
["Coronavirus Research Repository","WPRO","Global ",{"$f":"COUNTIF($B$1:B626,B626)","v":42},"WPRO42","Coronavirus Research Repository"]
["UN Food and Agriculture Organisation(FAO)","WPRO","Global ",{"$f":"COUNTIF($B$1:B627,B627)","v":43},"WPRO43","UN Food and Agriculture Organisation(FAO)"]
["Centers for Disease Control and Prevention","WPRO","Global ",{"$f":"COUNTIF($B$1:B628,B628)","v":44},"WPRO44","Centers for Disease Control and Prevention"]
["OECD Country Policy Tracker","WPRO","Global ",{"$f":"COUNTIF($B$1:B629,B629)","v":45},"WPRO45","OECD Country Policy Tracker"]
["OECD Health System Response Tracker","WPRO","Global ",{"$f":"COUNTIF($B$1:B630,B630)","v":46},"WPRO46","OECD Health System Response Tracker"]
["OECD Employment & Social policy responses by country","WPRO","Global ",{"$f":"COUNTIF($B$1:B631,B631)","v":47},"WPRO47","OECD Employment & Social policy responses by country"]
["UN International Labour Organisation(ILO)","WPRO","Global ",{"$f":"COUNTIF($B$1:B632,B632)","v":48},"WPRO48","UN International Labour Organisation(ILO)"]
["Institute for Health Metrics and Evaluation (IHME)","WPRO","Global ",{"$f":"COUNTIF($B$1:B633,B633)","v":49},"WPRO49","Institute for Health Metrics and Evaluation (IHME)"]
["OECD Knowledge Hub","WPRO","Global ",{"$f":"COUNTIF($B$1:B634,B634)","v":50},"WPRO50","OECD Knowledge Hub"]
["COVID-19 and Citizen Science","WPRO","Global ",{"$f":"COUNTIF($B$1:B635,B635)","v":51},"WPRO51","COVID-19 and Citizen Science"]
["NMA","WPRO","Global ",{"$f":"COUNTIF($B$1:B636,B636)","v":52},"WPRO52","NMA"]
["Social Science in Humanitarian Action","WPRO","Global ",{"$f":"COUNTIF($B$1:B637,B637)","v":53},"WPRO53","Social Science in Humanitarian Action"]
["EPI-WIN (WHO Information for Network for Epidemics)","WPRO","Global ",{"$f":"COUNTIF($B$1:B638,B638)","v":54},"WPRO54","EPI-WIN (WHO Information for Network for Epidemics)"]
["Hewlett Foundation","WPRO","Global ",{"$f":"COUNTIF($B$1:B639,B639)","v":55},"WPRO55","Hewlett Foundation"]
["Development aid","WPRO","Global ",{"$f":"COUNTIF($B$1:B640,B640)","v":56},"WPRO56","Development aid"]
["Coronavirus Tech Handbook","WPRO","Global ",{"$f":"COUNTIF($B$1:B641,B641)","v":57},"WPRO57","Coronavirus Tech Handbook"]
["Covid-19 Innovations","WPRO","Global ",{"$f":"COUNTIF($B$1:B642,B642)","v":58},"WPRO58","Covid-19 Innovations"]
["Health Economics, Policy and Law blog series on country responses","WPRO","Global ",{"$f":"COUNTIF($B$1:B643,B643)","v":59},{"$f":"B643&D643","v":"WPRO59"},{"$f":"A643","v":"Health Economics, Policy and Law blog series on country responses"}]
["SYREAF","WPRO","Global ",{"$f":"COUNTIF($B$1:B644,B644)","v":60},"WPRO60","SYREAF"]
["OECD Science and innovation policy responses by country","WPRO","Global ",{"$f":"COUNTIF($B$1:B645,B645)","v":61},"WPRO61","OECD Science and innovation policy responses by country"]
["CHAIN","WPRO","Global ",{"$f":"COUNTIF($B$1:B646,B646)","v":62},"WPRO62","CHAIN"]
["Oxford Evidence Service","WPRO","Global ",{"$f":"COUNTIF($B$1:B647,B647)","v":63},"WPRO63","Oxford Evidence Service"]
["COVID-19 Economic Stimulus Index","WPRO","Global ",{"$f":"COUNTIF($B$1:B648,B648)","v":64},"WPRO64","COVID-19 Economic Stimulus Index"]
["World Bank Education","WPRO","Global ",{"$f":"COUNTIF($B$1:B649,B649)","v":65},"WPRO65","World Bank Education"]
["International Long Term Care Policy Network","WPRO","Global ",{"$f":"COUNTIF($B$1:B650,B650)","v":66},"WPRO66","International Long Term Care Policy Network"]
["Elsevier Novel Coronavirus Information Center","WPRO","Global ",{"$f":"COUNTIF($B$1:B651,B651)","v":67},"WPRO67","Elsevier Novel Coronavirus Information Center"]
["International trade centre","WPRO","Global ",{"$f":"COUNTIF($B$1:B652,B652)","v":68},"WPRO68","International trade centre"]
["WHO R & D","WPRO","Global ",{"$f":"COUNTIF($B$1:B653,B653)","v":69},"WPRO69","WHO R & D"]
["United Nations Office for the Coordination of Humanitarian Affairs","WPRO","Global ",{"$f":"COUNTIF($B$1:B654,B654)","v":70},"WPRO70","United Nations Office for the Coordination of Humanitarian Affairs"]
["UNIDO","WPRO","Global ",{"$f":"COUNTIF($B$1:B655,B655)","v":71},"WPRO71","UNIDO"]
["International Centre for not-for-profit law","WPRO","Global ",{"$f":"COUNTIF($B$1:B656,B656)","v":72},"WPRO72","International Centre for not-for-profit law"]
["Asian Development Bank","WPRO","Global ",{"$f":"COUNTIF($B$1:B657,B657)","v":73},"WPRO73","Asian Development Bank"]
["Tableau Public","WPRO","Global ",{"$f":"COUNTIF($B$1:B658,B658)","v":74},"WPRO74","Tableau Public"]
["Havard Dataverse","WPRO","Global ",{"$f":"COUNTIF($B$1:B659,B659)","v":75},"WPRO75","Havard Dataverse"]
["WHO Global research on coronavirus disease (COVID-19)","WPRO","Global ",{"$f":"COUNTIF($B$1:B660,B660)","v":76},"WPRO76","WHO Global research on coronavirus disease (COVID-19)"]
["World Health Organization (WHO) technical guidelines","WPRO","Global ",{"$f":"COUNTIF($B$1:B661,B661)","v":77},"WPRO77","World Health Organization (WHO) technical guidelines"]
["UNESCO Planipolis","WPRO","Global ",{"$f":"COUNTIF($B$1:B662,B662)","v":78},"WPRO78","UNESCO Planipolis"]
["U.S. Veterans’ Affairs (VA) Evidence Synthesis Program","WPRO","Global ",{"$f":"COUNTIF($B$1:B663,B663)","v":79},"WPRO79","U.S. Veterans’ Affairs (VA) Evidence Synthesis Program"]
["Santé Public France","WPRO","Global ",{"$f":"COUNTIF($B$1:B664,B664)","v":80},"WPRO80","Santé Public France"]
["Campbell UK and Ireland","WPRO","Global ",{"$f":"COUNTIF($B$1:B665,B665)","v":81},"WPRO81","Campbell UK and Ireland"]
["National COVID-19 Living Evidence Task Force","WPRO","National",{"$f":"COUNTIF($B$1:B666,B666)","v":82},"WPRO82","National COVID-19 Living Evidence Task Force"]
["Africaxiv","WPRO","Regional",{"$f":"COUNTIF($B$1:B667,B667)","v":83},"WPRO83","Africaxiv"]
["Our World In data Policy Responses to the Coronavirus Pandemic","WPRO","Global ",{"$f":"COUNTIF($B$1:B668,B668)","v":84},"WPRO84","Our World In data Policy Responses to the Coronavirus Pandemic"]
["Wolters Kluwer Global Infectious Diseases and Epidemiology Online Network (GIDEON)","WPRO","Global ",{"$f":"COUNTIF($B$1:B669,B669)","v":85},"WPRO85","Wolters Kluwer Global Infectious Diseases and Epidemiology Online Network (GIDEON)"]
["European Society of Intensive Care Medicine","WPRO","Global ",{"$f":"COUNTIF($B$1:B670,B670)","v":86},"WPRO86","European Society of Intensive Care Medicine"]
["Health Data Research UK","WPRO","Global ",{"$f":"COUNTIF($B$1:B671,B671)","v":87},"WPRO87","Health Data Research UK"]
["CGD - COVID education policy tracking","WPRO","Global ",{"$f":"COUNTIF($B$1:B672,B672)","v":88},"WPRO88","CGD - COVID education policy tracking"]
["World Pandemic Research Network (WPRN) ","WPRO","Global ",{"$f":"COUNTIF($B$1:B673,B673)","v":89},"WPRO89","World Pandemic Research Network (WPRN) "]
["OECD Cities responses","WPRO","Global ",{"$f":"COUNTIF($B$1:B674,B674)","v":90},"WPRO90","OECD Cities responses"]
["International Growth Centre(ICG)","WPRO","Regional",{"$f":"COUNTIF($B$1:B675,B675)","v":91},"WPRO91","International Growth Centre(ICG)"]
["OECD SME Policy Responses","WPRO","Global ",{"$f":"COUNTIF($B$1:B676,B676)","v":92},"WPRO92","OECD SME Policy Responses"]
["CIAT/IOTA/OECD Tax Response","WPRO","Global ",{"$f":"COUNTIF($B$1:B677,B677)","v":93},"WPRO93","CIAT/IOTA/OECD Tax Response"]
["IFPRI Covid 19 Food Trade Policy Tracker","WPRO","Global ",{"$f":"COUNTIF($B$1:B678,B678)","v":94},"WPRO94","IFPRI Covid 19 Food Trade Policy Tracker"]
["Global Health Network Covid-19 Research Implementation Hub","WPRO","Global ",{"$f":"COUNTIF($B$1:B679,B679)","v":95},"WPRO95","Global Health Network Covid-19 Research Implementation Hub"]
["OECD Tourism Summary","WPRO","Global ",{"$f":"COUNTIF($B$1:B680,B680)","v":96},"WPRO96","OECD Tourism Summary"]
["Society of Critical Care Medicine","WPRO","Global ",{"$f":"COUNTIF($B$1:B681,B681)","v":97},"WPRO97","Society of Critical Care Medicine"]
["Covid19 Behaviour Tracker\n","WPRO","Global ",{"$f":"COUNTIF($B$1:B682,B682)","v":98},"WPRO98","Covid19 Behaviour Tracker\n"]
["Kaggle","WPRO","Global ",{"$f":"COUNTIF($B$1:B683,B683)","v":99},"WPRO99","Kaggle"]
["Google Covid-19 Community Mobility Reports","WPRO","Global ",{"$f":"COUNTIF($B$1:B684,B684)","v":100},"WPRO100","Google Covid-19 Community Mobility Reports"]
["Wiley Covid-19: Novel Coronavirus Outbreak","WPRO","Global ",{"$f":"COUNTIF($B$1:B685,B685)","v":101},"WPRO101","Wiley Covid-19: Novel Coronavirus Outbreak"]
["COVID-19 Disorder Tracker (CDT)","WPRO","Global ",{"$f":"COUNTIF($B$1:B686,B686)","v":102},"WPRO102","COVID-19 Disorder Tracker (CDT)"]
["Global Policy Responses – Developed Markets ","WPRO","Regional",{"$f":"COUNTIF($B$1:B687,B687)","v":103},"WPRO103","Global Policy Responses – Developed Markets "]
["Economic Relief Around the World","WPRO","Global ",{"$f":"COUNTIF($B$1:B688,B688)","v":104},"WPRO104","Economic Relief Around the World"]
["Impact Peace Resources on Covid","WPRO","Global ",{"$f":"COUNTIF($B$1:B689,B689)","v":105},"WPRO105","Impact Peace Resources on Covid"]
["EBSCO Medical","WPRO","Global ",{"$f":"COUNTIF($B$1:B690,B690)","v":106},"WPRO106","EBSCO Medical"]
["UNDP HDR Global Preparedness and Vulnerability Dashboard","WPRO","Global ",{"$f":"COUNTIF($B$1:B691,B691)","v":107},"WPRO107","UNDP HDR Global Preparedness and Vulnerability Dashboard"]

{"sheet":"4. Resource types","index":4,"n_rows":678,"n_cols":11,"rows_kept":678,"cut":false,"hidden":true,"merged":[]}
["Person extracting ","Name of Hub","Resources available","Details","4.3 \nSingle studies","4.1.1 \nRecommendations or guidance that used evidence syntheses","4.1.2 \nRecommendations or guidance not reporting using evidence syntheses",null,"Key"]
["Nkuli","AEN Hub","Evidence Synthesis","Systematic reviews","Non of the above","Yes","Yes",{"$f":"COUNTIF($D$1:D2,D1)","v":1},{"$f":"C2&H2","v":"Evidence Synthesis1"},{"$f":"B2","v":"AEN Hub"},{"$f":"B2&C2&D2","v":"AEN HubEvidence SynthesisSystematic reviews"}]
[null,"AEN Hub","Evidence Synthesis","Rapid reviews",null,"Yes","Yes",{"$f":"COUNTIF($D$1:D3,D2)","v":1},{"$f":"C3&H3","v":"Evidence Synthesis1"},{"$f":"B3","v":"AEN Hub"},{"$f":"B3&C3&D3","v":"AEN HubEvidence SynthesisRapid reviews"}]
[null,"AEN Hub","Evidence Synthesis","Evidence syntheses building on systematic reviews",null,"Yes","Yes",{"$f":"COUNTIF($D$1:D4,D3)","v":1},"Evidence Synthesis1","AEN Hub","AEN HubEvidence SynthesisEvidence syntheses building on systematic reviews"]
[null,"AEN Hub","Recommendations","Recommendations or guidance that used evidence syntheses",null,null,null,{"$f":"COUNTIF($D$1:D5,D4)","v":1},"Recommendations1","AEN Hub","AEN HubRecommendationsRecommendations or guidance that used evidence syntheses"]
[null,"AEN Hub","Recommendations","Recommendations or guidance not reporting using evidence syntheses",null,null,null,{"$f":"COUNTIF($D$1:D6,D5)","v":1},"Recommendations1","AEN Hub","AEN HubRecommendationsRecommendations or guidance not reporting using evidence syntheses"]
[null,"AEN Hub","Expert opinions","N/A",null,null,null,{"$f":"COUNTIF($D$1:D7,D6)","v":1},"Expert opinions1","AEN Hub","AEN HubExpert opinionsN/A"]
["Irvine","Covidbase","Evidence Synthesis","Rapid reviews","Other primary research studies","Yes","Yes",{"$f":"COUNTIF($D$1:D8,D7)","v":1},"Evidence Synthesis1","Covidbase","CovidbaseEvidence SynthesisRapid reviews"]
[null,"Covidbase","Evidence Synthesis","Systematic reviews",null,null,null,{"$f":"COUNTIF($D$1:D9,D8)","v":2},"Evidence Synthesis2","Covidbase","CovidbaseEvidence SynthesisSystematic reviews"]
[null,"Covidbase","Single studies","Other primary research studies",null,null,null,{"$f":"COUNTIF($D$1:D10,D9)","v":2},"Single studies2","Covidbase","CovidbaseSingle studiesOther primary research studies"]
[null,"(USA) White House Call to Action to the Tech Community on New Machine Readable COVID-19 Dataset","Government responses","N/A",null,null,null,{"$f":"COUNTIF($D$1:D11,D10)","v":1},"Government responses1","(USA) White House Call to Action to the Tech Community on New Machine Readable COVID-19 Dataset","(USA) White House Call to Action to the Tech Community on New Machine Readable COVID-19 DatasetGovernment responsesN/A"]
[null,"Covidbase","Training resources and events","N/A",null,null,null,{"$f":"COUNTIF($D$1:D12,D11)","v":3},"Training resources and events3","Covidbase","CovidbaseTraining resources and eventsN/A"]
[null,"Covidbase","Books or handbooks","N/A",null,null,null,{"$f":"COUNTIF($D$1:D13,D12)","v":4},"Books or handbooks4","Covidbase","CovidbaseBooks or handbooksN/A"]
[null,"Covidbase","Recommendations","Recommendations or guidance that used evidence syntheses",null,null,null,{"$f":"COUNTIF($D$1:D14,D13)","v":4},"Recommendations4","Covidbase","CovidbaseRecommendationsRecommendations or guidance that used evidence syntheses"]
[null,"Covidbase","Recommendations","Recommendations or guidance not reporting using evidence syntheses",null,null,null,{"$f":"COUNTIF($D$1:D15,D14)","v":2},"Recommendations2","Covidbase","CovidbaseRecommendationsRecommendations or guidance not reporting using evidence syntheses"]
["Promise","Johns Hopkins University and Medicine Coronavirus Resource Center","Recommendations","Recommendations or guidance not reporting using evidence syntheses","Non of the above","No","Yes",{"$f":"COUNTIF($D$1:D16,D15)","v":3},"Recommendations3","Johns Hopkins University and Medicine Coronavirus Resource Center","Johns Hopkins University and Medicine Coronavirus Resource CenterRecommendationsRecommendations or guidance not reporting using evidence syntheses"]
[null,"Johns Hopkins University and Medicine Coronavirus Resource Center","Analyses of primary data","N/A",null,null,null,{"$f":"COUNTIF($D$1:D17,D16)","v":3},"Analyses of primary data3","Johns Hopkins University and Medicine Coronavirus Resource Center","Johns Hopkins University and Medicine Coronavirus Resource CenterAnalyses of primary dataN/A"]
[null,"Johns Hopkins University and Medicine Coronavirus Resource Center","Expert opinions","N/A",null,null,null,{"$f":"COUNTIF($D$1:D18,D17)","v":6},"Expert opinions6","Johns Hopkins University and Medicine Coronavirus Resource Center","Johns Hopkins University and Medicine Coronavirus Resource CenterExpert opinionsN/A"]
[null,"Johns Hopkins University and Medicine Coronavirus Resource Center","Training resources and events","N/A",null,null,null,{"$f":"COUNTIF($D$1:D19,D18)","v":7},"Training resources and events7","Johns Hopkins University and Medicine Coronavirus Resource Center","Johns Hopkins University and Medicine Coronavirus Resource CenterTraining resources and eventsN/A"]
["Andile","World Bank ","Analyses of primary data","N/A","Non of the above","No","No",{"$f":"COUNTIF($D$1:D20,D19)","v":8},"Analyses of primary data8","World Bank ","World Bank Analyses of primary dataN/A"]
["Nkuli","UNDP COVID 19 Dashboard","Recommendations","Recommendations or guidance not reporting using evidence syntheses","Non of the above","No","Yes",{"$f":"COUNTIF($D$1:D21,D20)","v":8},"Recommendations8","UNDP COVID 19 Dashboard","UNDP COVID 19 DashboardRecommendationsRecommendations or guidance not reporting using evidence syntheses"]
["Nkuli","African Policy Monitor","Government responses","N/A",null,null,null,{"$f":"COUNTIF($D$1:D22,D21)","v":4},"Government responses4","African Policy Monitor","African Policy MonitorGovernment responsesN/A"]
[null,"UNDP COVID 19 Dashboard","Funding opportunities","N/A",null,null,null,{"$f":"COUNTIF($D$1:D23,D22)","v":10},"Funding opportunities10","UNDP COVID 19 Dashboard","UNDP COVID 19 DashboardFunding opportunitiesN/A"]
[null,"UNDP COVID 19 Dashboard","Books or handbooks","N/A",null,null,null,{"$f":"COUNTIF($D$1:D24,D23)","v":11},"Books or handbooks11","UNDP COVID 19 Dashboard","UNDP COVID 19 DashboardBooks or handbooksN/A"]
[null,"American College of Cardiology","Government responses","N/A",null,null,null,{"$f":"COUNTIF($D$1:D25,D24)","v":12},"Government responses12","American College of Cardiology","American College of CardiologyGovernment responsesN/A"]
[null,"International Monetory Fund(IMF)","Books or handbooks","N/A",null,null,null,{"$f":"COUNTIF($D$1:D26,D25)","v":13},"Books or handbooks13","International Monetory Fund(IMF)","International Monetory Fund(IMF)Books or handbooksN/A"]
["Nkuli","UN Habitat","Single studies","Other primary research studies","Other primary research studies","No","Yes",{"$f":"COUNTIF($D$1:D27,D26)","v":13},"Single studies13","UN Habitat","UN HabitatSingle studiesOther primary research studies"]
[null,"UN Habitat","Recommendations","Recommendations or guidance not reporting using evidence syntheses",null,null,null,{"$f":"COUNTIF($D$1:D28,D27)","v":2},"Recommendations2","UN Habitat","UN HabitatRecommendationsRecommendations or guidance not reporting using evidence syntheses"]
["Promise","Asian Development Bank","Government responses","N/A",null,null,null,{"$f":"COUNTIF($D$1:D29,D28)","v":5},"Government responses5","Asian Development Bank","Asian Development BankGovernment responsesN/A"]
["Nkuli","Inter-American Development Bank","Recommendations","Recommendations or guidance not reporting using evidence syntheses","Non of the above","No","Yes",{"$f":"COUNTIF($D$1:D30,D29)","v":14},"Recommendations14","Inter-American Development Bank","Inter-American Development BankRecommendationsRecommendations or guidance not reporting using evidence syntheses"]
[null,"Inter-American Development Bank","Expert opinions",null,null,null,null,{"$f":"COUNTIF($D$1:D31,D30)","v":6},"Expert opinions6","Inter-American Development Bank","Inter-American Development BankExpert opinions"]
[null,"Inter-American Development Bank","Training resources and events",null,null,null,null,{"$f":"COUNTIF($D$1:D32,D31)","v":0},"Training resources and events0","Inter-American Development Bank","Inter-American Development BankTraining resources and events"]
["Andile","Oxford Government response tracker","Analyses of primary data","N/A","Non of the above","No","No",{"$f":"COUNTIF($D$1:D33,D32)","v":0},"Analyses of primary data0","Oxford Government response tracker","Oxford Government response trackerAnalyses of primary dataN/A"]
["Nkuli","Brennan Center for Justice","Government responses","N/A",null,null,null,{"$f":"COUNTIF($D$1:D34,D33)","v":16},"Government responses16","Brennan Center for Justice","Brennan Center for JusticeGovernment responsesN/A"]
["Promise","Cochrane Library","Evidence Synthesis","Systematic reviews","Non of the above","No","No",{"$f":"COUNTIF($D$1:D35,D34)","v":16},"Evidence Synthesis16","Cochrane Library","Cochrane LibraryEvidence SynthesisSystematic reviews"]
["Promise","Cochrane Library","Evidence Synthesis","Rapid reviews",null,"No","No",{"$f":"COUNTIF($D$1:D36,D35)","v":3},"Evidence Synthesis3","Cochrane Library","Cochrane LibraryEvidence SynthesisRapid reviews"]
["Promise","Cochrane Library","Evidence Synthesis","Protocols of systematic reviews that are underway",null,"No","No",{"$f":"COUNTIF($D$1:D37,D36)","v":3},"Evidence Synthesis3","Cochrane Library","Cochrane LibraryEvidence SynthesisProtocols of systematic reviews that are underway"]
["Nkuli","CGD - COVID education policy tracking","Government responses","N/A",null,null,null,{"$f":"COUNTIF($D$1:D38,D37)","v":1},"Government responses1","CGD - COVID education policy tracking","CGD - COVID education policy trackingGovernment responsesN/A"]
[null,"Yale School of Management's Program COVID-19 Financial Response Tracker (CFRT)","Books or handbooks","N/A",null,null,null,{"$f":"COUNTIF($D$1:D39,D38)","v":18},"Books or handbooks18","Yale School of Management's Program COVID-19 Financial Response Tracker (CFRT)","Yale School of Management's Program COVID-19 Financial Response Tracker (CFRT)Books or handbooksN/A"]
[null,"Yale School of Management's Program COVID-19 Financial Response Tracker (CFRT)","Expert opinions","N/A",null,null,null,{"$f":"COUNTIF($D$1:D40,D39)","v":19},"Expert opinions19","Yale School of Management's Program COVID-19 Financial Response Tracker (CFRT)","Yale School of Management's Program COVID-19 Financial Response Tracker (CFRT)Expert opinionsN/A"]
[null,"Yale School of Management's Program COVID-19 Financial Response Tracker (CFRT)","Single studies","Other primary research studies",null,null,null,{"$f":"COUNTIF($D$1:D41,D40)","v":19},"Single studies19","Yale School of Management's Program COVID-19 Financial Response Tracker (CFRT)","Yale School of Management's Program COVID-19 Financial Response Tracker (CFRT)Single studiesOther primary research studies"]
["Nkuli","National Institute for Health and Care Excellence","Evidence Synthesis","Evidence syntheses building on systematic reviews","Non of the above","No","No",{"$f":"COUNTIF($D$1:D42,D41)","v":3},"Evidence Synthesis3","National Institute for Health and Care Excellence","National Institute for Health and Care ExcellenceEvidence SynthesisEvidence syntheses building on systematic reviews"]
[null,"National Institute for Health and Care Excellence","Evidence Synthesis","Rapid reviews",null,"No","No",{"$f":"COUNTIF($D$1:D43,D42)","v":2},"Evidence Synthesis2","National Institute for Health and Care Excellence","National Institute for Health and Care ExcellenceEvidence SynthesisRapid reviews"]
["Andile","UNICEF","Evidence Synthesis","Systematic reviews","Other primary research studies","No","No",{"$f":"COUNTIF($D$1:D44,D43)","v":4},"Evidence Synthesis4","UNICEF","UNICEFEvidence SynthesisSystematic reviews"]
[null,"UNICEF","Evidence Synthesis","Rapid reviews",null,"Yes","No",{"$f":"COUNTIF($D$1:D45,D44)","v":4},"Evidence Synthesis4","UNICEF","UNICEFEvidence SynthesisRapid reviews"]
[null,"UNICEF","Single studies","Other primary research studies",null,null,null,{"$f":"COUNTIF($D$1:D46,D45)","v":5},"Single studies5","UNICEF","UNICEFSingle studiesOther primary research studies"]
[null,"UNICEF","Recommendations","Recommendations or guidance that used evidence syntheses",null,null,null,{"$f":"COUNTIF($D$1:D47,D46)","v":4},"Recommendations4","UNICEF","UNICEFRecommendationsRecommendations or guidance that used evidence syntheses"]
[null,"UNICEF","Research methods","N/A",null,null,null,{"$f":"COUNTIF($D$1:D48,D47)","v":3},"Research methods3","UNICEF","UNICEFResearch methodsN/A"]
["Andile","UNEP","Training resources and events","N/A","Non of the above","No","No",{"$f":"COUNTIF($D$1:D49,D48)","v":21},"Training resources and events21","UNEP","UNEPTraining resources and eventsN/A"]
["Andile","Norwegian Institute of Public Health","Evidence Synthesis","Protocols of systematic reviews that are underway","Non of the above","Yes","No",{"$f":"COUNTIF($D$1:D50,D49)","v":21},"Evidence Synthesis21","Norwegian Institute of Public Health","Norwegian Institute of Public HealthEvidence SynthesisProtocols of systematic reviews that are underway"]
[null,"Norwegian Institute of Public Health","Evidence Synthesis","Systematic reviews",null,"Yes","No",{"$f":"COUNTIF($D$1:D51,D50)","v":2},"Evidence Synthesis2","Norwegian Institute of Public Health","Norwegian Institute of Public HealthEvidence SynthesisSystematic reviews"]
[null,"Norwegian Institute of Public Health","Evidence Synthesis","Evidence maps",null,"Yes","No",{"$f":"COUNTIF($D$1:D52,D51)","v":5},"Evidence Synthesis5","Norwegian Institute of Public Health","Norwegian Institute of Public HealthEvidence SynthesisEvidence maps"]
[null,"Norwegian Institute of Public Health","Recommendations","Recommendations or guidance that used evidence syntheses",null,null,null,{"$f":"COUNTIF($D$1:D53,D52)","v":1},"Recommendations1","Norwegian Institute of Public Health","Norwegian Institute of Public HealthRecommendationsRecommendations or guidance that used evidence syntheses"]
[null,"Norwegian Institute of Public Health","Expert opinions","N/A",null,null,null,{"$f":"COUNTIF($D$1:D54,D53)","v":4},"Expert opinions4","Norwegian Institute of Public Health","Norwegian Institute of Public HealthExpert opinionsN/A"]
[null,"Norwegian Institute of Public Health","Research methods","N/A",null,null,null,{"$f":"COUNTIF($D$1:D55,D54)","v":23},"Research methods23","Norwegian Institute of Public Health","Norwegian Institute of Public HealthResearch methodsN/A"]
["Promise","OECD Country Policy Tracker","Recommendations","Recommendations or guidance not reporting using evidence syntheses","Non of the above","No","Yes",{"$f":"COUNTIF($D$1:D56,D55)","v":23},"Recommendations23","OECD Country Policy Tracker","OECD Country Policy TrackerRecommendationsRecommendations or guidance not reporting using evidence syntheses"]
["Promise","CIAT/IOTA/OECD Tax Response","Government responses","N/A",null,null,null,{"$f":"COUNTIF($D$1:D57,D56)","v":7},"Government responses7","CIAT/IOTA/OECD Tax Response","CIAT/IOTA/OECD Tax ResponseGovernment responsesN/A"]
["Nkuli","OECD Health System Response Tracker","Recommendations","Recommendations or guidance not reporting using evidence syntheses","Non of the above","No","Yes",{"$f":"COUNTIF($D$1:D58,D57)","v":24},"Recommendations24","OECD Health System Response Tracker","OECD Health System Response TrackerRecommendationsRecommendations or guidance not reporting using evidence syntheses"]
["Nkuli","Civic Space Watch: Solidarity amid the COVID-19 crisis","Government responses","N/A",null,null,null,{"$f":"COUNTIF($D$1:D59,D58)","v":8},"Government responses8","Civic Space Watch: Solidarity amid the COVID-19 crisis","Civic Space Watch: Solidarity amid the COVID-19 crisisGovernment responsesN/A"]
[null,"Cochrane Covid 19 Pregnancy and Fertility","Government responses","N/A",null,null,null,{"$f":"COUNTIF($D$1:D60,D59)","v":26},"Government responses26","Cochrane Covid 19 Pregnancy and Fertility","Cochrane Covid 19 Pregnancy and FertilityGovernment responsesN/A"]
["Promise","OECD Employment & Social policy responses by country","Recommendations","Recommendations or guidance not reporting using evidence syntheses","Non of the above","No","Yes",{"$f":"COUNTIF($D$1:D61,D60)","v":26},"Recommendations26","OECD Employment & Social policy responses by country","OECD Employment & Social policy responses by countryRecommendationsRecommendations or guidance not reporting using evidence syntheses"]
["Irvine","Centers for Disease Control and Prevention","Evidence Synthesis","Evidence maps","Clinical trials","Yes","Yes",{"$f":"COUNTIF($D$1:D62,D61)","v":9},"Evidence Synthesis9","Centers for Disease Control and Prevention","Centers for Disease Control and PreventionEvidence SynthesisEvidence maps"]
[null,"Centers for Disease Control and Prevention","Evidence Synthesis","Systematic reviews","Other primary research studies","Yes","Yes",{"$f":"COUNTIF($D$1:D63,D62)","v":2},"Evidence Synthesis2","Centers for Disease Control and Prevention","Centers for Disease Control and PreventionEvidence SynthesisSystematic reviews"]
[null,"Centers for Disease Control and Prevention","Evidence Synthesis","Evidence syntheses building on systematic reviews","Searchable databases of single studies and often systematic reviews as well","Yes","Yes",{"$f":"COUNTIF($D$1:D64,D63)","v":6},"Evidence Synthesis6","Centers for Disease Control and Prevention","Centers for Disease Control and PreventionEvidence SynthesisEvidence syntheses building on systematic reviews"]
[null,"Centers for Disease Control and Prevention","Evidence Synthesis","Rapid reviews","Protocols of single studies that are underway","Yes","Yes",{"$f":"COUNTIF($D$1:D65,D64)","v":3},"Evidence Synthesis3","Centers for Disease Control and Prevention","Centers for Disease Control and PreventionEvidence SynthesisRapid reviews"]
[null,"Centers for Disease Control and Prevention","Recommendations","Recommendations or guidance not reporting using evidence syntheses",null,null,null,{"$f":"COUNTIF($D$1:D66,D65)","v":6},"Recommendations6","Centers for Disease Control and Prevention","Centers for Disease Control and PreventionRecommendationsRecommendations or guidance not reporting using evidence syntheses"]
[null,"Centers for Disease Control and Prevention","Single studies","Clinical trials",null,null,null,{"$f":"COUNTIF($D$1:D67,D66)","v":10},{"$f":"C67&H67","v":"Single studies10"},{"$f":"B67","v":"Centers for Disease Control and Prevention"},{"$f":"B67&C67&D67","v":"Centers for Disease Control and PreventionSingle studiesClinical trials"}]
[null,"Centers for Disease Control and Prevention","Single studies","Searchable databases of single studies and often systematic reviews as well",null,null,null,{"$f":"COUNTIF($D$1:D68,D67)","v":1},"Single studies1","Centers for Disease Control and Prevention","Centers for Disease Control and PreventionSingle studiesSearchable databases of single studies and often systematic reviews as well"]
[null,"Centers for Disease Control and Prevention","Single studies","Protocols of systematic reviews that are underway",null,null,null,{"$f":"COUNTIF($D$1:D69,D68)","v":1},"Single studies1","Centers for Disease Control and Prevention","Centers for Disease Control and PreventionSingle studiesProtocols of systematic reviews that are underway"]
[null,"Centers for Disease Control and Prevention","Single studies","Other primary research studies",null,null,null,{"$f":"COUNTIF($D$1:D70,D69)","v":3},"Single studies3","Centers for Disease Control and Prevention","Centers for Disease Control and PreventionSingle studiesOther primary research studies"]
[null,"Centers for Disease Control and Prevention","Recommendations","Recommendations or guidance that used evidence syntheses",null,null,null,{"$f":"COUNTIF($D$1:D71,D70)","v":5},"Recommendations5","Centers for Disease Control and Prevention","Centers for Disease Control and PreventionRecommendationsRecommendations or guidance that used evidence syntheses"]
["Nkuli","Cochrane Clinical Answers","Evidence Synthesis","Rapid reviews","Non of the above","Yes","No",{"$f":"COUNTIF($D$1:D72,D71)","v":5},"Evidence Synthesis5","Cochrane Clinical Answers","Cochrane Clinical AnswersEvidence SynthesisRapid reviews"]
[null,"Cochrane Clinical Answers","Evidence Synthesis","Evidence syntheses building on systematic reviews",null,"Yes","No",{"$f":"COUNTIF($D$1:D73,D72)","v":7},"Evidence Synthesis7","Cochrane Clinical Answers","Cochrane Clinical AnswersEvidence SynthesisEvidence syntheses building on systematic reviews"]
[null,"Cochrane Clinical Answers","Recommendations","Recommendations or guidance that used evidence syntheses",null,null,null,{"$f":"COUNTIF($D$1:D74,D73)","v":4},"Recommendations4","Cochrane Clinical Answers","Cochrane Clinical AnswersRecommendationsRecommendations or guidance that used evidence syntheses"]
["Andile","Evidence aid","Evidence Synthesis","Systematic reviews","Clinical trials","Yes","No",{"$f":"COUNTIF($D$1:D75,D74)","v":6},"Evidence Synthesis6","Evidence aid","Evidence aidEvidence SynthesisSystematic reviews"]
[null,"Evidence aid","Evidence Synthesis","Rapid reviews",null,"No","Yes",{"$f":"COUNTIF($D$1:D76,D75)","v":7},"Evidence Synthesis7","Evidence aid","Evidence aidEvidence SynthesisRapid reviews"]
[null,"Evidence aid","Single studies","Clinical trials",null,null,null,{"$f":"COUNTIF($D$1:D77,D76)","v":8},"Single studies8","Evidence aid","Evidence aidSingle studiesClinical trials"]
[null,"Evidence aid","Recommendations","Recommendations or guidance not reporting using evidence syntheses",null,null,null,{"$f":"COUNTIF($D$1:D78,D77)","v":2},"Recommendations2","Evidence aid","Evidence aidRecommendationsRecommendations or guidance not reporting using evidence syntheses"]
[null,"Cochrane Covid-19 Study register","Government responses","N/A",null,null,null,{"$f":"COUNTIF($D$1:D79,D78)","v":11},"Government responses11","Cochrane Covid-19 Study register","Cochrane Covid-19 Study registerGovernment responsesN/A"]
[null,"UN Food and Agriculture Organisation(FAO)","Expert opinions","N/A",null,null,null,{"$f":"COUNTIF($D$1:D80,D79)","v":28},"Expert opinions28","UN Food and Agriculture Organisation(FAO)","UN Food and Agriculture Organisation(FAO)Expert opinionsN/A"]
[null,"UN Food and Agriculture Organisation(FAO)","Books or handbooks","N/A",null,null,null,{"$f":"COUNTIF($D$1:D81,D80)","v":29},"Books or handbooks29","UN Food and Agriculture Organisation(FAO)","UN Food and Agriculture Organisation(FAO)Books or handbooksN/A"]
[null,"UN Food and Agriculture Organisation(FAO)","Training resources and events","N/A",null,null,null,{"$f":"COUNTIF($D$1:D82,D81)","v":30},"Training resources and events30","UN Food and Agriculture Organisation(FAO)","UN Food and Agriculture Organisation(FAO)Training resources and eventsN/A"]
[null,"UN Food and Agriculture Organisation(FAO)","Single studies","Other primary research studies",null,null,null,{"$f":"COUNTIF($D$1:D83,D82)","v":30},"Single studies30","UN Food and Agriculture Organisation(FAO)","UN Food and Agriculture Organisation(FAO)Single studiesOther primary research studies"]
["Nkuli","Cochrane Effective Practise and Organisation of Care: Task Shifting","Evidence Synthesis","Rapid reviews","Non of the above","Yes","No",{"$f":"COUNTIF($D$1:D84,D83)","v":6},"Evidence Synthesis6","Cochrane Effective Practise and Organisation of Care: Task Shifting","Cochrane Effective Practise and Organisation of Care: Task ShiftingEvidence SynthesisRapid reviews"]
[null,"Cochrane Effective Practise and Organisation of Care: Task Shifting","Evidence Synthesis","Evidence syntheses building on systematic reviews",null,"Yes","No",{"$f":"COUNTIF($D$1:D85,D84)","v":9},"Evidence Synthesis9","Cochrane Effective Practise and Organisation of Care: Task Shifting","Cochrane Effective Practise and Organisation of Care: Task ShiftingEvidence SynthesisEvidence syntheses building on systematic reviews"]
[null,"Cochrane Effective Practise and Organisation of Care: Task Shifting","Evidence Synthesis","Systematic reviews",null,"Yes","No",{"$f":"COUNTIF($D$1:D86,D85)","v":5},"Evidence Synthesis5","Cochrane Effective Practise and Organisation of Care: Task Shifting","Cochrane Effective Practise and Organisation of Care: Task ShiftingEvidence SynthesisSystematic reviews"]
[null,"Cochrane Effective Practise and Organisation of Care: Task Shifting","Recommendations","Recommendations or guidance that used evidence syntheses",null,null,null,{"$f":"COUNTIF($D$1:D87,D86)","v":8},"Recommendations8","Cochrane Effective Practise and Organisation of Care: Task Shifting","Cochrane Effective Practise and Organisation of Care: Task ShiftingRecommendationsRecommendations or guidance that used evidence syntheses"]
["Promise","UN International Labour Organisation(ILO)","Recommendations","Recommendations or guidance not reporting using evidence syntheses","Non of the above","No","Yes",{"$f":"COUNTIF($D$1:D88,D87)","v":7},"Recommendations7","UN International Labour Organisation(ILO)","UN International Labour Organisation(ILO)RecommendationsRecommendations or guidance not reporting using evidence syntheses"]
[null,"UN International Labour Organisation(ILO)","Training resources and events","N/A",null,null,null,{"$f":"COUNTIF($D$1:D89,D88)","v":12},"Training resources and events12","UN International Labour Organisation(ILO)","UN International Labour Organisation(ILO)Training resources and eventsN/A"]
["Andile","Conflict and Covid-19 Resource Hub","Government responses","N/A",null,null,null,{"$f":"COUNTIF($D$1:D90,D89)","v":32},"Government responses32","Conflict and Covid-19 Resource Hub","Conflict and Covid-19 Resource HubGovernment responsesN/A"]
["Nkuli","McMaster Daily News","Expert opinions","N/A","Non of the above","No","No",{"$f":"COUNTIF($D$1:D91,D90)","v":33},"Expert opinions33","McMaster Daily News","McMaster Daily NewsExpert opinionsN/A"]
[null,"McMaster Daily News","Funding opportunities","N/A",null,null,null,{"$f":"COUNTIF($D$1:D92,D91)","v":34},"Funding opportunities34","McMaster Daily News","McMaster Daily NewsFunding opportunitiesN/A"]
["Andile ","COVID-19 Research Project Tracker by UKCDR & GloPID-R","Analyses of primary data","N/A","Non of the above","No","No",{"$f":"COUNTIF($D$1:D93,D92)","v":35},"Analyses of primary data35","COVID-19 Research Project Tracker by UKCDR & GloPID-R","COVID-19 Research Project Tracker by UKCDR & GloPID-RAnalyses of primary dataN/A"]
[null,"COVID-19 Research Project Tracker by UKCDR & GloPID-R","Funding opportunities","N/A",null,null,null,{"$f":"COUNTIF($D$1:D94,D93)","v":36},"Funding opportunities36","COVID-19 Research Project Tracker by UKCDR & GloPID-R","COVID-19 Research Project Tracker by UKCDR & GloPID-RFunding opportunitiesN/A"]
[null,"COVID-19 Research Project Tracker by UKCDR & GloPID-R","Single studies","Protocols of single studies that are underway",null,null,null,{"$f":"COUNTIF($D$1:D95,D94)","v":36},"Single studies36","COVID-19 Research Project Tracker by UKCDR & GloPID-R","COVID-19 Research Project Tracker by UKCDR & GloPID-RSingle studiesProtocols of single studies that are underway"]
[null,"COVID-19 Research Project Tracker by UKCDR & GloPID-R","Single studies","Clinical trials",null,null,null,{"$f":"COUNTIF($D$1:D96,D95)","v":1},"Single studies1","COVID-19 Research Project Tracker by UKCDR & GloPID-R","COVID-19 Research Project Tracker by UKCDR & GloPID-RSingle studiesClinical trials"]
[null,"COVID-19 Research Project Tracker by UKCDR & GloPID-R","Research projects _ output not clear at the moment","N/A",null,null,null,{"$f":"COUNTIF($D$1:D97,D96)","v":3},"Research projects _ output not clear at the moment3","COVID-19 Research Project Tracker by UKCDR & GloPID-R","COVID-19 Research Project Tracker by UKCDR & GloPID-RResearch projects _ output not clear at the momentN/A"]
["Nkuli","Institute for Health Metrics and Evaluation (IHME)","Single studies","Other primary research studies","Other primary research studies","No","No",{"$f":"COUNTIF($D$1:D98,D97)","v":37},"Single studies37","Institute for Health Metrics and Evaluation (IHME)","Institute for Health Metrics and Evaluation (IHME)Single studiesOther primary research studies"]
[null,"Institute for Health Metrics and Evaluation (IHME)","Analyses of primary data","N/A",null,null,null,{"$f":"COUNTIF($D$1:D99,D98)","v":7},"Analyses of primary data7","Institute for Health Metrics and Evaluation (IHME)","Institute for Health Metrics and Evaluation (IHME)Analyses of primary dataN/A"]
["Andile ","UNESCO COVID-19","Analyses of primary data","N/A","Non of the above","No","No",{"$f":"COUNTIF($D$1:D100,D99)","v":39},"Analyses of primary data39","UNESCO COVID-19","UNESCO COVID-19Analyses of primary dataN/A"]
[null,"UNESCO COVID-20","Training resources and events","N/A",null,null,null,{"$f":"COUNTIF($D$1:D101,D100)","v":40},"Training resources and events40","UNESCO COVID-20","UNESCO COVID-20Training resources and eventsN/A"]
[null,"Coronavirus Tech Handbook","Government responses","N/A",null,null,null,{"$f":"COUNTIF($D$1:D102,D101)","v":41},"Government responses41","Coronavirus Tech Handbook","Coronavirus Tech HandbookGovernment responsesN/A"]
[null,"UNESCO COVID-22","Books or handbooks","N/A",null,null,null,{"$f":"COUNTIF($D$1:D103,D102)","v":42},"Books or handbooks42","UNESCO COVID-22","UNESCO COVID-22Books or handbooksN/A"]
["Andile ","Cochrane COVID Rapid Reviews","Evidence Synthesis","Rapid reviews","Other primary research studies","Yes","No",{"$f":"COUNTIF($D$1:D104,D103)","v":42},"Evidence Synthesis42","Cochrane COVID Rapid Reviews","Cochrane COVID Rapid ReviewsEvidence SynthesisRapid reviews"]
[null,"Cochrane COVID Rapid Reviews","Single studies","Other primary research studies",null,null,null,{"$f":"COUNTIF($D$1:D105,D104)","v":10},"Single studies10","Cochrane COVID Rapid Reviews","Cochrane COVID Rapid ReviewsSingle studiesOther primary research studies"]
[null,"Cochrane COVID Rapid Reviews","Recommendations","Recommendations or guidance that used evidence syntheses",null,null,null,{"$f":"COUNTIF($D$1:D106,D105)","v":8},"Recommendations8","Cochrane COVID Rapid Reviews","Cochrane COVID Rapid ReviewsRecommendationsRecommendations or guidance that used evidence syntheses"]
["Andile","Coronavirus: prison fever","Government responses","N/A",null,null,null,{"$f":"COUNTIF($D$1:D107,D106)","v":8},"Government responses8","Coronavirus: prison fever","Coronavirus: prison feverGovernment responsesN/A"]
[null,"UK Government (Previously put as DFID)","Funding opportunities","N/A",null,null,null,{"$f":"COUNTIF($D$1:D108,D107)","v":44},"Funding opportunities44","UK Government (Previously put as DFID)","UK Government (Previously put as DFID)Funding opportunitiesN/A"]
[null,"UK Government (Previously put as DFID)","Expert opinions","N/A",null,null,null,{"$f":"COUNTIF($D$1:D109,D108)","v":45},"Expert opinions45","UK Government (Previously put as DFID)","UK Government (Previously put as DFID)Expert opinionsN/A"]
[null,"UK Government (Previously put as DFID)","Analyses of primary data","N/A",null,null,null,{"$f":"COUNTIF($D$1:D110,D109)","v":46},"Analyses of primary data46","UK Government (Previously put as DFID)","UK Government (Previously put as DFID)Analyses of primary dataN/A"]
[null,"UK Government (Previously put as DFID)","Recommendations","Recommendations or guidance that used evidence syntheses",null,null,null,{"$f":"COUNTIF($D$1:D111,D110)","v":46},"Recommendations46","UK Government (Previously put as DFID)","UK Government (Previously put as DFID)RecommendationsRecommendations or guidance that used evidence syntheses"]
[null,"UK Government (Previously put as DFID)","Single studies","Other primary research studies",null,null,null,{"$f":"COUNTIF($D$1:D112,D111)","v":9},"Single studies9","UK Government (Previously put as DFID)","UK Government (Previously put as DFID)Single studiesOther primary research studies"]
["Andile ","Johns Hopkins University and Medicine Coronavirus Resource Center","Analyses of primary data","N/A","Non of the above","No","No",{"$f":"COUNTIF($D$1:D113,D112)","v":9},"Analyses of primary data9","Johns Hopkins University and Medicine Coronavirus Resource Center","Johns Hopkins University and Medicine Coronavirus Resource CenterAnalyses of primary dataN/A"]
[null,"Johns Hopkins University and Medicine Coronavirus Resource Center","Expert opinions","N/A",null,null,null,{"$f":"COUNTIF($D$1:D114,D113)","v":48},"Expert opinions48","Johns Hopkins University and Medicine Coronavirus Resource Center","Johns Hopkins University and Medicine Coronavirus Resource CenterExpert opinionsN/A"]
[null,"Johns Hopkins University and Medicine Coronavirus Resource Center","Training resources and events","N/A",null,null,null,{"$f":"COUNTIF($D$1:D115,D114)","v":49},"Training resources and events49","Johns Hopkins University and Medicine Coronavirus Resource Center","Johns Hopkins University and Medicine Coronavirus Resource CenterTraining resources and eventsN/A"]
["Irvine","Covid 19 Africa Watch","Government responses","N/A",null,null,null,{"$f":"COUNTIF($D$1:D116,D115)","v":50},"Government responses50","Covid 19 Africa Watch","Covid 19 Africa WatchGovernment responsesN/A"]
[null,"Kentucky’s response to COVID-19","Expert opinions","N/A",null,null,null,{"$f":"COUNTIF($D$1:D117,D116)","v":51},"Expert opinions51","Kentucky’s response to COVID-19","Kentucky’s response to COVID-19Expert opinionsN/A"]
[null,"Kentucky’s response to COVID-19","Recommendations","Recommendations or guidance not reporting using evidence syntheses",null,null,null,{"$f":"COUNTIF($D$1:D118,D117)","v":51},"Recommendations51","Kentucky’s response to COVID-19","Kentucky’s response to COVID-19RecommendationsRecommendations or guidance not reporting using evidence syntheses"]
["Andile ","Johns Hopkins Medicine POC-IT Guide","Recommendations","Recommendations or guidance not reporting using evidence syntheses","Non of the above","No","Yes",{"$f":"COUNTIF($D$1:D119,D118)","v":14},"Recommendations14","Johns Hopkins Medicine POC-IT Guide","Johns Hopkins Medicine POC-IT GuideRecommendationsRecommendations or guidance not reporting using evidence syntheses"]
["Irvine","IDS K4D Covid resource","Evidence Synthesis","Rapid reviews","Clinical trials","Yes","No",{"$f":"COUNTIF($D$1:D120,D119)","v":14},"Evidence Synthesis14","IDS K4D Covid resource","IDS K4D Covid resourceEvidence SynthesisRapid reviews"]
["Irvine","Covid Prison Data","Government responses","N/A",null,null,null,{"$f":"COUNTIF($D$1:D121,D120)","v":11},"Government responses11","Covid Prison Data","Covid Prison DataGovernment responsesN/A"]
[null,"IDS K4D Covid resource","Funding opportunities","N/A",null,null,null,{"$f":"COUNTIF($D$1:D122,D121)","v":53},"Funding opportunities53","IDS K4D Covid resource","IDS K4D Covid resourceFunding opportunitiesN/A"]
[null,"IDS K4D Covid resource","Analyses of primary data","N/A",null,null,null,{"$f":"COUNTIF($D$1:D123,D122)","v":54},"Analyses of primary data54","IDS K4D Covid resource","IDS K4D Covid resourceAnalyses of primary dataN/A"]
[null,"IDS K4D Covid resource","Recommendations","Recommendations or guidance that used evidence syntheses",null,null,null,{"$f":"COUNTIF($D$1:D124,D123)","v":54},"Recommendations54","IDS K4D Covid resource","IDS K4D Covid resourceRecommendationsRecommendations or guidance that used evidence syntheses"]
[null,"IDS K4D Covid resource","Single studies","Clinical trials",null,null,null,{"$f":"COUNTIF($D$1:D125,D124)","v":10},"Single studies10","IDS K4D Covid resource","IDS K4D Covid resourceSingle studiesClinical trials"]
["Andile ","VHL Regional Portal","Evidence Synthesis","Evidence maps","Non of the above","Yes","No",{"$f":"COUNTIF($D$1:D126,D125)","v":4},"Evidence Synthesis4","VHL Regional Portal","VHL Regional PortalEvidence SynthesisEvidence maps"]
[null,"VHL Regional Portal","Evidence Synthesis","Systematic reviews",null,"Yes","No",{"$f":"COUNTIF($D$1:D127,D126)","v":3},"Evidence Synthesis3","VHL Regional Portal","VHL Regional PortalEvidence SynthesisSystematic reviews"]
[null,"VHL Regional Portal","Evidence Synthesis","Rapid reviews",null,"Yes","No",{"$f":"COUNTIF($D$1:D128,D127)","v":9},"Evidence Synthesis9","VHL Regional Portal","VHL Regional PortalEvidence SynthesisRapid reviews"]
[null,"VHL Regional Portal","Recommendations","Recommendations or guidance that used evidence syntheses",null,null,null,{"$f":"COUNTIF($D$1:D129,D128)","v":12},"Recommendations12","VHL Regional Portal","VHL Regional PortalRecommendationsRecommendations or guidance that used evidence syntheses"]
[null,"VHL Regional Portal","Analyses of primary data","N/A",null,null,null,{"$f":"COUNTIF($D$1:D130,D129)","v":11},"Analyses of primary data11","VHL Regional Portal","VHL Regional PortalAnalyses of primary dataN/A"]
["Andile","Pan American Health Organization","Evidence Synthesis","Rapid reviews",null,"No","No",{"$f":"COUNTIF($D$1:D131,D130)","v":55},{"$f":"C131&H131","v":"Evidence Synthesis55"},{"$f":"B131","v":"Pan American Health Organization"},{"$f":"B131&C131&D131","v":"Pan American Health OrganizationEvidence SynthesisRapid reviews"}]
[null,"Pan American Health Organization","Recommendations","Recommendations or guidance not reporting using evidence syntheses",null,null,null,{"$f":"COUNTIF($D$1:D132,D131)","v":13},"Recommendations13","Pan American Health Organization","Pan American Health OrganizationRecommendationsRecommendations or guidance not reporting using evidence syntheses"]
[null,"Pan American Health Organization","Single studies","Other primary research studies",null,null,null,{"$f":"COUNTIF($D$1:D133,D132)","v":15},"Single studies15","Pan American Health Organization","Pan American Health OrganizationSingle studiesOther primary research studies"]
["Promise","AU","Training resources and events","N/A","Non of the above","No","No",{"$f":"COUNTIF($D$1:D134,D133)","v":10},"Training resources and events10","AU","AUTraining resources and eventsN/A"]
["Irvine","COVID-19 and Citizen Science","Evidence Synthesis","Rapid reviews","Non of the above","Yes","Yes",{"$f":"COUNTIF($D$1:D135,D134)","v":56},"Evidence Synthesis56","COVID-19 and Citizen Science","COVID-19 and Citizen ScienceEvidence SynthesisRapid reviews"]
[null,"COVID-19 and Citizen Science","Evidence Synthesis","Systematic reviews","Non of the above","Yes","Yes",{"$f":"COUNTIF($D$1:D136,D135)","v":14},"Evidence Synthesis14","COVID-19 and Citizen Science","COVID-19 and Citizen ScienceEvidence SynthesisSystematic reviews"]
[null,"COVID-19 and Citizen Science","Evidence Synthesis","Evidence syntheses building on systematic reviews","Non of the above","Yes","Yes",{"$f":"COUNTIF($D$1:D137,D136)","v":10},"Evidence Synthesis10","COVID-19 and Citizen Science","COVID-19 and Citizen ScienceEvidence SynthesisEvidence syntheses building on systematic reviews"]
[null,"COVID-19 and Citizen Science","Recommendations","Recommendations or guidance not reporting using evidence syntheses",null,null,null,{"$f":"COUNTIF($D$1:D138,D137)","v":6},"Recommendations6","COVID-19 and Citizen Science","COVID-19 and Citizen ScienceRecommendationsRecommendations or guidance not reporting using evidence syntheses"]
[null,"COVID-19 and Citizen Science","Recommendations","Recommendations or guidance that used evidence syntheses",null,null,null,{"$f":"COUNTIF($D$1:D139,D138)","v":16},"Recommendations16","COVID-19 and Citizen Science","COVID-19 and Citizen ScienceRecommendationsRecommendations or guidance that used evidence syntheses"]
[null,"Africa Check","Recommendations","Recommendations or guidance not reporting using evidence syntheses","Non of the above","No","No",{"$f":"COUNTIF($D$1:D140,D139)","v":12},"Recommendations12","Africa Check","Africa CheckRecommendationsRecommendations or guidance not reporting using evidence syntheses"]
["Irvine","OECD Knowledge Hub","Evidence Synthesis",null,null,null,null,{"$f":"COUNTIF($D$1:D141,D140)","v":17},"Evidence Synthesis17","OECD Knowledge Hub","OECD Knowledge HubEvidence Synthesis"]
[null,"COVID Scholar","Government responses","N/A",null,null,null,{"$f":"COUNTIF($D$1:D142,D141)","v":0},"Government responses0","COVID Scholar","COVID ScholarGovernment responsesN/A"]
["Irvine","OECD Knowledge Hub","Expert opinions","N/A",null,null,null,{"$f":"COUNTIF($D$1:D143,D142)","v":58},"Expert opinions58","OECD Knowledge Hub","OECD Knowledge HubExpert opinionsN/A"]
["Irvine","OECD Knowledge Hub","Analyses of primary data","N/A",null,null,null,{"$f":"COUNTIF($D$1:D144,D143)","v":59},"Analyses of primary data59","OECD Knowledge Hub","OECD Knowledge HubAnalyses of primary dataN/A"]
["Promise","NMA","Evidence Synthesis","Systematic reviews","Clinical trials","Yes","No",{"$f":"COUNTIF($D$1:D145,D144)","v":59},"Evidence Synthesis59","NMA","NMAEvidence SynthesisSystematic reviews"]
[null,"NMA","Single studies","Clinical trials","Protocols of single studies that are underway",null,null,{"$f":"COUNTIF($D$1:D146,D145)","v":11},"Single studies11","NMA","NMASingle studiesClinical trials"]
[null,"NMA","Single studies","Protocols of single studies that are underway",null,null,null,{"$f":"COUNTIF($D$1:D147,D146)","v":5},"Single studies5","NMA","NMASingle studiesProtocols of single studies that are underway"]
[null,"NMA","Recommendations","Recommendations or guidance that used evidence syntheses",null,null,null,{"$f":"COUNTIF($D$1:D148,D147)","v":2},"Recommendations2","NMA","NMARecommendationsRecommendations or guidance that used evidence syntheses"]
["Andile","McMaster COVID-19 evidence","Evidence Synthesis","Rapid reviews","Non of the above","Yes","No",{"$f":"COUNTIF($D$1:D149,D148)","v":13},"Evidence Synthesis13","McMaster COVID-19 evidence","McMaster COVID-19 evidenceEvidence SynthesisRapid reviews"]
[null,"McMaster COVID-19 evidence","Recommendations","Recommendations or guidance not reporting using evidence syntheses",null,null,null,{"$f":"COUNTIF($D$1:D150,D149)","v":15},"Recommendations15","McMaster COVID-19 evidence","McMaster COVID-19 evidenceRecommendationsRecommendations or guidance not reporting using evidence syntheses"]
["Irvine","COVID-19 and Citizen Science","Government responses","N/A",null,"Yes","Yes",{"$f":"COUNTIF($D$1:D151,D150)","v":18},"Government responses18","COVID-19 and Citizen Science","COVID-19 and Citizen ScienceGovernment responsesN/A"]
[null,"McMaster COVID-19 evidence","Research methods","N/A",null,null,null,{"$f":"COUNTIF($D$1:D152,D151)","v":61},"Research methods61","McMaster COVID-19 evidence","McMaster COVID-19 evidenceResearch methodsN/A"]
["Irvine","MCMaster National Collaborating Centre for Methods and Tools : Canada","Evidence Synthesis","Rapid reviews","Protocols of single studies that are underway","Yes","Yes",{"$f":"COUNTIF($D$1:D153,D152)","v":61},"Evidence Synthesis61","MCMaster National Collaborating Centre for Methods and Tools : Canada","MCMaster National Collaborating Centre for Methods and Tools : CanadaEvidence SynthesisRapid reviews"]
[null,"MCMaster National Collaborating Centre for Methods and Tools : Canada","Analyses of primary data","N/A",null,null,null,{"$f":"COUNTIF($D$1:D154,D153)","v":16},"Analyses of primary data16","MCMaster National Collaborating Centre for Methods and Tools : Canada","MCMaster National Collaborating Centre for Methods and Tools : CanadaAnalyses of primary dataN/A"]
[null,"MCMaster National Collaborating Centre for Methods and Tools : Canada","Expert opinions","N/A",null,null,null,{"$f":"COUNTIF($D$1:D155,D154)","v":63},"Expert opinions63","MCMaster National Collaborating Centre for Methods and Tools : Canada","MCMaster National Collaborating Centre for Methods and Tools : CanadaExpert opinionsN/A"]
[null,"MCMaster National Collaborating Centre for Methods and Tools : Canada","Single studies","Protocols of systematic reviews that are underway",null,null,null,{"$f":"COUNTIF($D$1:D156,D155)","v":63},"Single studies63","MCMaster National Collaborating Centre for Methods and Tools : Canada","MCMaster National Collaborating Centre for Methods and Tools : CanadaSingle studiesProtocols of systematic reviews that are underway"]
[null,"MCMaster National Collaborating Centre for Methods and Tools : Canada","Recommendations","Recommendations or guidance not reporting using evidence syntheses",null,null,null,{"$f":"COUNTIF($D$1:D157,D156)","v":4},"Recommendations4","MCMaster National Collaborating Centre for Methods and Tools : Canada","MCMaster National Collaborating Centre for Methods and Tools : CanadaRecommendationsRecommendations or guidance not reporting using evidence syntheses"]
[null,"MCMaster National Collaborating Centre for Methods and Tools : Canada","Recommendations","Recommendations or guidance that used evidence syntheses",null,null,null,{"$f":"COUNTIF($D$1:D158,D157)","v":19},"Recommendations19","MCMaster National Collaborating Centre for Methods and Tools : Canada","MCMaster National Collaborating Centre for Methods and Tools : CanadaRecommendationsRecommendations or guidance that used evidence syntheses"]
["Irvine","Social Science in Humanitarian Action","Evidence Synthesis","Rapid reviews","Other primary research studies","Yes","Yes",{"$f":"COUNTIF($D$1:D159,D158)","v":14},"Evidence Synthesis14","Social Science in Humanitarian Action","Social Science in Humanitarian ActionEvidence SynthesisRapid reviews"]
[null,"Social Science in Humanitarian Action","Analyses of primary data","N/A",null,null,null,{"$f":"COUNTIF($D$1:D160,D159)","v":17},"Analyses of primary data17","Social Science in Humanitarian Action","Social Science in Humanitarian ActionAnalyses of primary dataN/A"]
[null,"Social Science in Humanitarian Action","Expert opinions","N/A",null,null,null,{"$f":"COUNTIF($D$1:D161,D160)","v":65},"Expert opinions65","Social Science in Humanitarian Action","Social Science in Humanitarian ActionExpert opinionsN/A"]
[null,"Social Science in Humanitarian Action","Training resources and events","N/A",null,null,null,{"$f":"COUNTIF($D$1:D162,D161)","v":66},"Training resources and events66","Social Science in Humanitarian Action","Social Science in Humanitarian ActionTraining resources and eventsN/A"]
[null,"Social Science in Humanitarian Action","Recommendations","Recommendations or guidance not reporting using evidence syntheses",null,null,null,{"$f":"COUNTIF($D$1:D163,D162)","v":66},"Recommendations66","Social Science in Humanitarian Action","Social Science in Humanitarian ActionRecommendationsRecommendations or guidance not reporting using evidence syntheses"]
[null,"Social Science in Humanitarian Action","Recommendations","Recommendations or guidance that used evidence syntheses",null,null,null,{"$f":"COUNTIF($D$1:D164,D163)","v":20},"Recommendations20","Social Science in Humanitarian Action","Social Science in Humanitarian ActionRecommendationsRecommendations or guidance that used evidence syntheses"]
["Promise","EPI-WIN (WHO Information for Network for Epidemics)","Recommendations","Recommendations or guidance not reporting using evidence syntheses","Non of the above","No","Yes",{"$f":"COUNTIF($D$1:D165,D164)","v":15},"Recommendations15","EPI-WIN (WHO Information for Network for Epidemics)","EPI-WIN (WHO Information for Network for Epidemics)RecommendationsRecommendations or guidance not reporting using evidence syntheses"]
[null,"COVID-19 CoronaVirus South African Resource Portal","Government responses","N/A",null,null,null,{"$f":"COUNTIF($D$1:D166,D165)","v":21},"Government responses21","COVID-19 CoronaVirus South African Resource Portal","COVID-19 CoronaVirus South African Resource PortalGovernment responsesN/A"]
["Promise","COVID-19 Disorder Tracker (CDT)","Government responses","N/A",null,null,null,{"$f":"COUNTIF($D$1:D167,D166)","v":68},"Government responses68","COVID-19 Disorder Tracker (CDT)","COVID-19 Disorder Tracker (CDT)Government responsesN/A"]
[null,"COVID-19 Open Research Dataset(CORD-19) (Rayyan in MacMaster HUB)","Expert opinions","N/A",null,null,null,{"$f":"COUNTIF($D$1:D168,D167)","v":69},"Expert opinions69","COVID-19 Open Research Dataset(CORD-19) (Rayyan in MacMaster HUB)","COVID-19 Open Research Dataset(CORD-19) (Rayyan in MacMaster HUB)Expert opinionsN/A"]
[null,"COVID-19 Open Research Dataset(CORD-19) (Rayyan in MacMaster HUB)","Analyses of primary data","N/A",null,null,null,{"$f":"COUNTIF($D$1:D169,D168)","v":70},"Analyses of primary data70","COVID-19 Open Research Dataset(CORD-19) (Rayyan in MacMaster HUB)","COVID-19 Open Research Dataset(CORD-19) (Rayyan in MacMaster HUB)Analyses of primary dataN/A"]
[null,"COVID-19 Open Research Dataset(CORD-19) (Rayyan in MacMaster HUB)","Research methods","N/A",null,null,null,{"$f":"COUNTIF($D$1:D170,D169)","v":71},"Research methods71","COVID-19 Open Research Dataset(CORD-19) (Rayyan in MacMaster HUB)","COVID-19 Open Research Dataset(CORD-19) (Rayyan in MacMaster HUB)Research methodsN/A"]
[null,"COVID-19 Open Research Dataset(CORD-19) (Rayyan in MacMaster HUB)","Single studies","Clinical trials",null,null,null,{"$f":"COUNTIF($D$1:D171,D170)","v":71},"Single studies71","COVID-19 Open Research Dataset(CORD-19) (Rayyan in MacMaster HUB)","COVID-19 Open Research Dataset(CORD-19) (Rayyan in MacMaster HUB)Single studiesClinical trials"]
["Irvine","Hewlett Foundation","Funding opportunities","N/A","Protocols of single studies that are underway","No","Yes",{"$f":"COUNTIF($D$1:D172,D171)","v":6},"Funding opportunities6","Hewlett Foundation","Hewlett FoundationFunding opportunitiesN/A"]
[null,"Hewlett Foundation","Single studies","Protocols of systematic reviews that are underway",null,null,null,{"$f":"COUNTIF($D$1:D173,D172)","v":72},"Single studies72","Hewlett Foundation","Hewlett FoundationSingle studiesProtocols of systematic reviews that are underway"]
[null,"Hewlett Foundation","Recommendations","Recommendations or guidance not reporting using evidence syntheses",null,null,null,{"$f":"COUNTIF($D$1:D174,D173)","v":5},"Recommendations5","Hewlett Foundation","Hewlett FoundationRecommendationsRecommendations or guidance not reporting using evidence syntheses"]
["Andile","EPPI Mega evidence map","Evidence Synthesis","Evidence maps","Other primary research studies","No","No",{"$f":"COUNTIF($D$1:D175,D174)","v":22},"Evidence Synthesis22","EPPI Mega evidence map","EPPI Mega evidence mapEvidence SynthesisEvidence maps"]
[null,"EPPI Mega evidence map","Evidence Synthesis","Systematic reviews",null,"No","No",{"$f":"COUNTIF($D$1:D176,D175)","v":4},"Evidence Synthesis4","EPPI Mega evidence map","EPPI Mega evidence mapEvidence SynthesisSystematic reviews"]
[null,"EPPI Mega evidence map","Research methods","N/A",null,null,null,{"$f":"COUNTIF($D$1:D177,D176)","v":12},"Research methods12","EPPI Mega evidence map","EPPI Mega evidence mapResearch methodsN/A"]
[null,"EPPI Mega evidence map","Single studies","Other primary research studies",null,null,null,{"$f":"COUNTIF($D$1:D178,D177)","v":73},"Single studies73","EPPI Mega evidence map","EPPI Mega evidence mapSingle studiesOther primary research studies"]
["Andile","Economics for Inclusive Prosperity (Econflip)","Other (specify)","N/A","Non of the above","No","No",{"$f":"COUNTIF($D$1:D179,D178)","v":11},"Other (specify)11","Economics for Inclusive Prosperity (Econflip)","Economics for Inclusive Prosperity (Econflip)Other (specify)N/A"]
["Andile","Our World in Data Coronavirus Disease (COVID-19)","Analyses of primary data","N/A","Non of the above","No","No",{"$f":"COUNTIF($D$1:D180,D179)","v":75},"Analyses of primary data75","Our World in Data Coronavirus Disease (COVID-19)","Our World in Data Coronavirus Disease (COVID-19)Analyses of primary dataN/A"]
["Irvine","Fasken Covid 19 Knowledge","Books or handbooks","N/A","Other primary research studies","No","Yes",{"$f":"COUNTIF($D$1:D181,D180)","v":76},"Books or handbooks76","Fasken Covid 19 Knowledge","Fasken Covid 19 KnowledgeBooks or handbooksN/A"]
[null,"Fasken Covid 19 Knowledge","Recommendations","Recommendations or guidance not reporting using evidence syntheses",null,null,null,{"$f":"COUNTIF($D$1:D182,D181)","v":76},"Recommendations76","Fasken Covid 19 Knowledge","Fasken Covid 19 KnowledgeRecommendationsRecommendations or guidance not reporting using evidence syntheses"]
["Andile","COVID-19 CoronaVirus South African Resource Portal","Expert opinions","N/A","Non of the above","No","No",{"$f":"COUNTIF($D$1:D183,D182)","v":23},"Expert opinions23","COVID-19 CoronaVirus South African Resource Portal","COVID-19 CoronaVirus South African Resource PortalExpert opinionsN/A"]
[null,"COVID-19 Economic Stimulus Index","Government responses","N/A",null,null,null,{"$f":"COUNTIF($D$1:D184,D183)","v":78},"Government responses78","COVID-19 Economic Stimulus Index","COVID-19 Economic Stimulus IndexGovernment responsesN/A"]
["Irvine","COVID-19 Open Research Dataset(CORD-19) (Rayyan in MacMaster HUB)","Government responses","N/A","Clinical trials","No","No",{"$f":"COUNTIF($D$1:D185,D184)","v":79},"Government responses79","COVID-19 Open Research Dataset(CORD-19) (Rayyan in MacMaster HUB)","COVID-19 Open Research Dataset(CORD-19) (Rayyan in MacMaster HUB)Government responsesN/A"]
[null,"NICD","Expert opinions","N/A",null,null,null,{"$f":"COUNTIF($D$1:D186,D185)","v":80},"Expert opinions80","NICD","NICDExpert opinionsN/A"]
[null,"NICD","Books or handbooks","N/A",null,null,null,{"$f":"COUNTIF($D$1:D187,D186)","v":81},"Books or handbooks81","NICD","NICDBooks or handbooksN/A"]
[null,"NICD","Analyses of primary data","N/A",null,null,null,{"$f":"COUNTIF($D$1:D188,D187)","v":82},"Analyses of primary data82","NICD","NICDAnalyses of primary dataN/A"]
[null,"NICD","Single studies","Other primary research studies",null,null,null,{"$f":"COUNTIF($D$1:D189,D188)","v":82},"Single studies82","NICD","NICDSingle studiesOther primary research studies"]
[null,"NICD","Recommendations","Recommendations or guidance not reporting using evidence syntheses",null,null,null,{"$f":"COUNTIF($D$1:D190,D189)","v":12},"Recommendations12","NICD","NICDRecommendationsRecommendations or guidance not reporting using evidence syntheses"]
[null,"NICD","Recommendations","Recommendations or guidance that used evidence syntheses",null,null,null,{"$f":"COUNTIF($D$1:D191,D190)","v":24},"Recommendations24","NICD","NICDRecommendationsRecommendations or guidance that used evidence syntheses"]
["Andile","China National Knowledge Infrastructure (CNKI)","Books or handbooks","N/A","Non of the above","No","No",{"$f":"COUNTIF($D$1:D192,D191)","v":16},"Books or handbooks16","China National Knowledge Infrastructure (CNKI)","China National Knowledge Infrastructure (CNKI)Books or handbooksN/A"]
["Andile","Elrha","Evidence Synthesis","Rapid reviews","Non of the above","Yes","No",{"$f":"COUNTIF($D$1:D193,D192)","v":83},"Evidence Synthesis83","Elrha","ElrhaEvidence SynthesisRapid reviews"]
[null,"Elrha","Recommendations","Recommendations or guidance that used evidence syntheses",null,null,null,{"$f":"COUNTIF($D$1:D194,D193)","v":18},"Recommendations18","Elrha","ElrhaRecommendationsRecommendations or guidance that used evidence syntheses"]
[null,"Elrha","Funding opportunities","N/A",null,null,null,{"$f":"COUNTIF($D$1:D195,D194)","v":17},{"$f":"C195&H195","v":"Funding opportunities17"},{"$f":"B195","v":"Elrha"},{"$f":"B195&C195&D195","v":"ElrhaFunding opportunitiesN/A"}]
[null,"Elrha","Research methods","N/A",null,null,null,{"$f":"COUNTIF($D$1:D196,D195)","v":85},"Research methods85","Elrha","ElrhaResearch methodsN/A"]
["Andile","(USA) White House Call to Action to the Tech Community on New Machine Readable COVID-19 Dataset","Recommendations","Recommendations or guidance not reporting using evidence syntheses","Non of the above","No","Yes",{"$f":"COUNTIF($D$1:D197,D196)","v":85},"Recommendations85","(USA) White House Call to Action to the Tech Community on New Machine Readable COVID-19 Dataset","(USA) White House Call to Action to the Tech Community on New Machine Readable COVID-19 DatasetRecommendationsRecommendations or guidance not reporting using evidence syntheses"]
[null,"Covidbase","Government responses","N/A",null,null,null,{"$f":"COUNTIF($D$1:D198,D197)","v":25},"Government responses25","Covidbase","CovidbaseGovernment responsesN/A"]
["Irvine","Public Health Ontario","Evidence Synthesis","Rapid reviews","Clinical trials","No","No",{"$f":"COUNTIF($D$1:D199,D198)","v":86},"Evidence Synthesis86","Public Health Ontario","Public Health OntarioEvidence SynthesisRapid reviews"]
[null,"Public Health Ontario","Evidence Synthesis","Systematic reviews","Searchable databases of single studies and often systematic reviews as well","No","No",{"$f":"COUNTIF($D$1:D200,D199)","v":19},"Evidence Synthesis19","Public Health Ontario","Public Health OntarioEvidence SynthesisSystematic reviews"]
[null,"Public Health Ontario","Evidence Synthesis","Evidence syntheses building on systematic reviews",null,"No","No",{"$f":"COUNTIF($D$1:D201,D200)","v":13},"Evidence Synthesis13","Public Health Ontario","Public Health OntarioEvidence SynthesisEvidence syntheses building on systematic reviews"]
[null,"Public Health Ontario","Evidence Synthesis","Protocols of systematic reviews that are underway",null,"No","No",{"$f":"COUNTIF($D$1:D202,D201)","v":7},"Evidence Synthesis7","Public Health Ontario","Public Health OntarioEvidence SynthesisProtocols of systematic reviews that are underway"]
[null,"Public Health Ontario","Expert opinions","N/A",null,null,null,{"$f":"COUNTIF($D$1:D203,D202)","v":6},"Expert opinions6","Public Health Ontario","Public Health OntarioExpert opinionsN/A"]
[null,"DynaMed","Government responses","N/A",null,null,null,{"$f":"COUNTIF($D$1:D204,D203)","v":88},"Government responses88","DynaMed","DynaMedGovernment responsesN/A"]
[null,"Public Health Ontario","Single studies","Clinical trials",null,null,null,{"$f":"COUNTIF($D$1:D205,D204)","v":88},"Single studies88","Public Health Ontario","Public Health OntarioSingle studiesClinical trials"]
[null,"Public Health Ontario","Single studies","Searchable databases of single studies and often systematic reviews as well",null,null,null,{"$f":"COUNTIF($D$1:D206,D205)","v":7},"Single studies7","Public Health Ontario","Public Health OntarioSingle studiesSearchable databases of single studies and often systematic reviews as well"]
["Andile","European Research Area (ERA) Corona Platform","Funding opportunities","N/A","Non of the above","No","No",{"$f":"COUNTIF($D$1:D207,D206)","v":2},"Funding opportunities2","European Research Area (ERA) Corona Platform","European Research Area (ERA) Corona PlatformFunding opportunitiesN/A"]
[null,"European Research Area (ERA) Corona Platform","Research projects _ output not clear at the moment","N/A",null,null,null,{"$f":"COUNTIF($D$1:D208,D207)","v":90},"Research projects _ output not clear at the moment90","European Research Area (ERA) Corona Platform","European Research Area (ERA) Corona PlatformResearch projects _ output not clear at the momentN/A"]
["Promise","Ghana government","Analyses of primary data","N/A","Non of the above","No","No",{"$f":"COUNTIF($D$1:D209,D208)","v":91},"Analyses of primary data91","Ghana government","Ghana governmentAnalyses of primary dataN/A"]
["Irvine","Cochrane Covid-19 Study register","Evidence Synthesis","Rapid reviews","Clinical trials","Yes","No",{"$f":"COUNTIF($D$1:D210,D209)","v":91},"Evidence Synthesis91","Cochrane Covid-19 Study register","Cochrane Covid-19 Study registerEvidence SynthesisRapid reviews"]
[null,"Cochrane Covid-19 Study register","Evidence Synthesis","Systematic reviews",null,"Yes","No",{"$f":"COUNTIF($D$1:D211,D210)","v":20},"Evidence Synthesis20","Cochrane Covid-19 Study register","Cochrane Covid-19 Study registerEvidence SynthesisSystematic reviews"]
[null,"Cochrane Covid-19 Study register","Evidence Synthesis","Evidence syntheses building on systematic reviews",null,"Yes","No",{"$f":"COUNTIF($D$1:D212,D211)","v":14},"Evidence Synthesis14","Cochrane Covid-19 Study register","Cochrane Covid-19 Study registerEvidence SynthesisEvidence syntheses building on systematic reviews"]
[null,"Cochrane Covid-19 Study register","Analyses of primary data","Other primary research studies",null,null,null,{"$f":"COUNTIF($D$1:D213,D212)","v":8},"Analyses of primary data8","Cochrane Covid-19 Study register","Cochrane Covid-19 Study registerAnalyses of primary dataOther primary research studies"]
["Nkuli","Economic Relief Around the World","Government responses","N/A",null,null,null,{"$f":"COUNTIF($D$1:D214,D213)","v":13},"Government responses13","Economic Relief Around the World","Economic Relief Around the WorldGovernment responsesN/A"]
[null,"Cochrane Covid-19 Study register","Expert opinions","N/A",null,null,null,{"$f":"COUNTIF($D$1:D215,D214)","v":93},"Expert opinions93","Cochrane Covid-19 Study register","Cochrane Covid-19 Study registerExpert opinionsN/A"]
[null,"Cochrane Covid-19 Study register","Books or handbooks","N/A",null,null,null,{"$f":"COUNTIF($D$1:D216,D215)","v":94},"Books or handbooks94","Cochrane Covid-19 Study register","Cochrane Covid-19 Study registerBooks or handbooksN/A"]
[null,"Cochrane Covid-19 Study register","Recommendations","Recommendations or guidance that used evidence syntheses",null,null,null,{"$f":"COUNTIF($D$1:D217,D216)","v":94},"Recommendations94","Cochrane Covid-19 Study register","Cochrane Covid-19 Study registerRecommendationsRecommendations or guidance that used evidence syntheses"]
[null,"Cochrane Covid-19 Study register","Single studies","Clinical trials",null,null,null,{"$f":"COUNTIF($D$1:D218,D217)","v":18},"Single studies18","Cochrane Covid-19 Study register","Cochrane Covid-19 Study registerSingle studiesClinical trials"]
["Andile","COVID-19 Open Research Dataset","Evidence Synthesis","Rapid reviews",null,"No","No",{"$f":"COUNTIF($D$1:D219,D218)","v":8},"Evidence Synthesis8","COVID-19 Open Research Dataset","COVID-19 Open Research DatasetEvidence SynthesisRapid reviews"]
[null,"COVID-19 Open Research Dataset","Evidence Synthesis","Systematic reviews",null,null,null,{"$f":"COUNTIF($D$1:D220,D219)","v":21},"Evidence Synthesis21","COVID-19 Open Research Dataset","COVID-19 Open Research DatasetEvidence SynthesisSystematic reviews"]
[null,"COVID-19 Open Research Dataset","Single studies","Other primary research studies",null,null,null,{"$f":"COUNTIF($D$1:D221,D220)","v":15},"Single studies15","COVID-19 Open Research Dataset","COVID-19 Open Research DatasetSingle studiesOther primary research studies"]
["Andile","Mental Health Commission of Canada","Recommendations","Recommendations or guidance not reporting using evidence syntheses","Non of the above","No","Yes",{"$f":"COUNTIF($D$1:D222,D221)","v":14},"Recommendations14","Mental Health Commission of Canada","Mental Health Commission of CanadaRecommendationsRecommendations or guidance not reporting using evidence syntheses"]
[null,"Mental Health Commission of Canada","Expert opinions","N/A",null,null,null,{"$f":"COUNTIF($D$1:D223,D222)","v":26},"Expert opinions26","Mental Health Commission of Canada","Mental Health Commission of CanadaExpert opinionsN/A"]
["Promise","Coronavirus Tech Handbook","Recommendations","Recommendations or guidance not reporting using evidence syntheses","Non of the above","No","Yes",{"$f":"COUNTIF($D$1:D224,D223)","v":95},"Recommendations95","Coronavirus Tech Handbook","Coronavirus Tech HandbookRecommendationsRecommendations or guidance not reporting using evidence syntheses"]
[null,"Coronavirus Tech Handbook","Training resources and events","N/A",null,null,null,{"$f":"COUNTIF($D$1:D225,D224)","v":27},"Training resources and events27","Coronavirus Tech Handbook","Coronavirus Tech HandbookTraining resources and eventsN/A"]
["Promise","EY COVID-19 Global Trade Considerations tracker ","Government responses","N/A",null,null,null,{"$f":"COUNTIF($D$1:D226,D225)","v":97},"Government responses97","EY COVID-19 Global Trade Considerations tracker ","EY COVID-19 Global Trade Considerations tracker Government responsesN/A"]
[null,"Coronavirus Tech Handbook","Funding opportunities","N/A",null,null,null,{"$f":"COUNTIF($D$1:D227,D226)","v":98},"Funding opportunities98","Coronavirus Tech Handbook","Coronavirus Tech HandbookFunding opportunitiesN/A"]
[null,"Coronavirus Tech Handbook","Books or handbooks","N/A",null,null,null,{"$f":"COUNTIF($D$1:D228,D227)","v":99},"Books or handbooks99","Coronavirus Tech Handbook","Coronavirus Tech HandbookBooks or handbooksN/A"]
["Andile","iHealthFacts","Expert opinions","N/A","Non of the above","No","No",{"$f":"COUNTIF($D$1:D229,D228)","v":100},"Expert opinions100","iHealthFacts","iHealthFactsExpert opinionsN/A"]
[null,"iHealthFacts","Research methods","N/A",null,null,null,{"$f":"COUNTIF($D$1:D230,D229)","v":101},"Research methods101","iHealthFacts","iHealthFactsResearch methodsN/A"]
["Promise","Homelesseness impact","Single studies","Other primary research studies","Other primary research studies","No","Yes",{"$f":"COUNTIF($D$1:D231,D230)","v":101},"Single studies101","Homelesseness impact","Homelesseness impactSingle studiesOther primary research studies"]
[null,"Homelesseness impact","Recommendations","Recommendations or guidance not reporting using evidence syntheses",null,null,null,{"$f":"COUNTIF($D$1:D232,D231)","v":15},"Recommendations15","Homelesseness impact","Homelesseness impactRecommendationsRecommendations or guidance not reporting using evidence syntheses"]
[null,"Homelesseness impact","Analyses of primary data","N/A",null,null,null,{"$f":"COUNTIF($D$1:D233,D232)","v":28},"Analyses of primary data28","Homelesseness impact","Homelesseness impactAnalyses of primary dataN/A"]
[null,"Homelesseness impact","Training resources and events","N/A",null,null,null,{"$f":"COUNTIF($D$1:D234,D233)","v":103},"Training resources and events103","Homelesseness impact","Homelesseness impactTraining resources and eventsN/A"]
["Promise","Covid-19 Innovations","Recommendations","Recommendations or guidance not reporting using evidence syntheses","Non of the above","No","Yes",{"$f":"COUNTIF($D$1:D235,D234)","v":103},"Recommendations103","Covid-19 Innovations","Covid-19 InnovationsRecommendationsRecommendations or guidance not reporting using evidence syntheses"]
["Irvine","Canadian Centre on Substance Use and Addiction","Evidence Synthesis","Rapid reviews","Protocols of single studies that are underway","Yes","Yes",{"$f":"COUNTIF($D$1:D236,D235)","v":29},"Evidence Synthesis29","Canadian Centre on Substance Use and Addiction","Canadian Centre on Substance Use and AddictionEvidence SynthesisRapid reviews"]
[null,"Canadian Centre on Substance Use and Addiction","Expert opinions","N/A",null,null,null,{"$f":"COUNTIF($D$1:D237,D236)","v":22},"Expert opinions22","Canadian Centre on Substance Use and Addiction","Canadian Centre on Substance Use and AddictionExpert opinionsN/A"]
[null,"Canadian Centre on Substance Use and Addiction","Analyses of primary data","N/A",null,null,null,{"$f":"COUNTIF($D$1:D238,D237)","v":105},"Analyses of primary data105","Canadian Centre on Substance Use and Addiction","Canadian Centre on Substance Use and AddictionAnalyses of primary dataN/A"]
[null,"Canadian Centre on Substance Use and Addiction","Books or handbooks","N/A",null,null,null,{"$f":"COUNTIF($D$1:D239,D238)","v":106},"Books or handbooks106","Canadian Centre on Substance Use and Addiction","Canadian Centre on Substance Use and AddictionBooks or handbooksN/A"]
[null,"Canadian Centre on Substance Use and Addiction","Single studies","Protocols of single studies that are underway",null,null,null,{"$f":"COUNTIF($D$1:D240,D239)","v":106},"Single studies106","Canadian Centre on Substance Use and Addiction","Canadian Centre on Substance Use and AddictionSingle studiesProtocols of single studies that are underway"]
[null,"Canadian Centre on Substance Use and Addiction","Recommendations","Recommendations or guidance not reporting using evidence syntheses",null,null,null,{"$f":"COUNTIF($D$1:D241,D240)","v":3},"Recommendations3","Canadian Centre on Substance Use and Addiction","Canadian Centre on Substance Use and AddictionRecommendationsRecommendations or guidance not reporting using evidence syntheses"]
[null,"Canadian Centre on Substance Use and Addiction","Recommendations","Recommendations or guidance that used evidence syntheses",null,null,null,{"$f":"COUNTIF($D$1:D242,D241)","v":30},"Recommendations30","Canadian Centre on Substance Use and Addiction","Canadian Centre on Substance Use and AddictionRecommendationsRecommendations or guidance that used evidence syntheses"]
["Andile","COVID 19 ZA Dashboard","Analyses of primary data","N/A","Non of the above","No","No",{"$f":"COUNTIF($D$1:D243,D242)","v":19},"Analyses of primary data19","COVID 19 ZA Dashboard","COVID 19 ZA DashboardAnalyses of primary dataN/A"]
["Andile","LitCovid","Single studies","Other primary research studies","Non of the above","No","No",{"$f":"COUNTIF($D$1:D244,D243)","v":107},"Single studies107","LitCovid","LitCovidSingle studiesOther primary research studies"]
["Irvine","Centre for Effective Practice","Expert opinions","N/A","Non of the above",null,null,{"$f":"COUNTIF($D$1:D245,D244)","v":16},"Expert opinions16","Centre for Effective Practice","Centre for Effective PracticeExpert opinionsN/A"]
[null,"Centre for Effective Practice","Analyses of primary data","N/A",null,null,null,{"$f":"COUNTIF($D$1:D246,D245)","v":109},"Analyses of primary data109","Centre for Effective Practice","Centre for Effective PracticeAnalyses of primary dataN/A"]
[null,"Centre for Effective Practice","Training resources and events","N/A",null,null,null,{"$f":"COUNTIF($D$1:D247,D246)","v":110},"Training resources and events110","Centre for Effective Practice","Centre for Effective PracticeTraining resources and eventsN/A"]
[null,"Centre for Effective Practice","Recommendations","Recommendations or guidance that used evidence syntheses",null,null,null,{"$f":"COUNTIF($D$1:D248,D247)","v":110},"Recommendations110","Centre for Effective Practice","Centre for Effective PracticeRecommendationsRecommendations or guidance that used evidence syntheses"]
[null,"Centre for Effective Practice","Recommendations","Recommendations or guidance not reporting using evidence syntheses",null,null,null,{"$f":"COUNTIF($D$1:D249,D248)","v":20},"Recommendations20","Centre for Effective Practice","Centre for Effective PracticeRecommendationsRecommendations or guidance not reporting using evidence syntheses"]
["Andile","Global overview of COVID-19: Impact on elections","Government responses","N/A",null,null,null,{"$f":"COUNTIF($D$1:D250,D249)","v":31},"Government responses31","Global overview of COVID-19: Impact on elections","Global overview of COVID-19: Impact on electionsGovernment responsesN/A"]
["Andile","SPOR Evidence Alliance","Evidence Synthesis","Rapid reviews","Other primary research studies","Yes","No",{"$f":"COUNTIF($D$1:D251,D250)","v":111},"Evidence Synthesis111","SPOR Evidence Alliance","SPOR Evidence AllianceEvidence SynthesisRapid reviews"]
[null,"SPOR Evidence Alliance","Single studies","Other primary research studies",null,null,null,{"$f":"COUNTIF($D$1:D252,D251)","v":23},"Single studies23","SPOR Evidence Alliance","SPOR Evidence AllianceSingle studiesOther primary research studies"]
[null,"SPOR Evidence Alliance","Recommendations","Recommendations or guidance that used evidence syntheses",null,null,null,{"$f":"COUNTIF($D$1:D253,D252)","v":17},"Recommendations17","SPOR Evidence Alliance","SPOR Evidence AllianceRecommendationsRecommendations or guidance that used evidence syntheses"]
[null,"SPOR Evidence Alliance","Research methods","N/A",null,null,null,{"$f":"COUNTIF($D$1:D254,D253)","v":21},"Research methods21","SPOR Evidence Alliance","SPOR Evidence AllianceResearch methodsN/A"]
["Nkuli","Inter-American Development Bank","Expert opinions","N/A","Non of the above","No","No",{"$f":"COUNTIF($D$1:D255,D254)","v":113},"Expert opinions113","Inter-American Development Bank","Inter-American Development BankExpert opinionsN/A"]
[null,"Inter-American Development Bank","Expert opinions",null,null,null,null,{"$f":"COUNTIF($D$1:D256,D255)","v":113},"Expert opinions113","Inter-American Development Bank","Inter-American Development BankExpert opinions"]
["Nkuli","Global Policy Responses – Developed Markets ","Government responses","N/A",null,null,null,{"$f":"COUNTIF($D$1:D257,D256)","v":0},"Government responses0","Global Policy Responses – Developed Markets ","Global Policy Responses – Developed Markets Government responsesN/A"]
[null,"Kenyan Government","Training resources and events","N/A",null,null,null,{"$f":"COUNTIF($D$1:D258,D257)","v":115},"Training resources and events115","Kenyan Government","Kenyan GovernmentTraining resources and eventsN/A"]
[null,"Kenyan Government","Books or handbooks","N/A",null,null,null,{"$f":"COUNTIF($D$1:D259,D258)","v":116},{"$f":"C259&H259","v":"Books or handbooks116"},{"$f":"B259","v":"Kenyan Government"},{"$f":"B259&C259&D259","v":"Kenyan GovernmentBooks or handbooksN/A"}]
[null,"Kenyan Government","Recommendations","Recommendations or guidance not reporting using evidence syntheses",null,null,null,{"$f":"COUNTIF($D$1:D260,D259)","v":116},"Recommendations116","Kenyan Government","Kenyan GovernmentRecommendationsRecommendations or guidance not reporting using evidence syntheses"]
["Andile","U.S. National Institutes of Health","Single studies","Clinical trials","Clinical trials","No","Yes",{"$f":"COUNTIF($D$1:D261,D260)","v":32},"Single studies32","U.S. National Institutes of Health","U.S. National Institutes of HealthSingle studiesClinical trials"]
[null,"U.S. National Institutes of Health","Recommendations","Recommendations or guidance not reporting using evidence syntheses",null,null,null,{"$f":"COUNTIF($D$1:D262,D261)","v":9},"Recommendations9","U.S. National Institutes of Health","U.S. National Institutes of HealthRecommendationsRecommendations or guidance not reporting using evidence syntheses"]
["Andile","Government of Canada","Government responses","N/A","Non of the above","No","No",{"$f":"COUNTIF($D$1:D263,D262)","v":33},"Government responses33","Government of Canada","Government of CanadaGovernment responsesN/A"]
[null,"U.S. National Institutes of Health","Funding opportunities","N/A",null,null,null,{"$f":"COUNTIF($D$1:D264,D263)","v":118},"Funding opportunities118","U.S. National Institutes of Health","U.S. National Institutes of HealthFunding opportunitiesN/A"]
[null,"U.S. National Institutes of Health","Research methods","N/A",null,null,null,{"$f":"COUNTIF($D$1:D265,D264)","v":119},"Research methods119","U.S. National Institutes of Health","U.S. National Institutes of HealthResearch methodsN/A"]
["Promise","OECD Science and innovation policy responses by country","Recommendations","Recommendations or guidance not reporting using evidence syntheses","Non of the above","No","Yes",{"$f":"COUNTIF($D$1:D266,D265)","v":119},"Recommendations119","OECD Science and innovation policy responses by country","OECD Science and innovation policy responses by countryRecommendationsRecommendations or guidance not reporting using evidence syntheses"]
["Nkuli","GovPredict Federal, State, and Local Responses to the Coronavirus\nFocus","Government responses","N/A",null,null,null,{"$f":"COUNTIF($D$1:D267,D266)","v":34},"Government responses34","GovPredict Federal, State, and Local Responses to the Coronavirus\nFocus","GovPredict Federal, State, and Local Responses to the Coronavirus\nFocusGovernment responsesN/A"]
["Andile","Ontario Ministry of Health ,Ministry of Long-Term Care","Recommendations","Recommendations or guidance not reporting using evidence syntheses","Non of the above","No","Yes",{"$f":"COUNTIF($D$1:D268,D267)","v":120},"Recommendations120","Ontario Ministry of Health ,Ministry of Long-Term Care","Ontario Ministry of Health ,Ministry of Long-Term CareRecommendationsRecommendations or guidance not reporting using evidence syntheses"]
["Andile","GULAGECHOES","Government responses","N/A",null,null,null,{"$f":"COUNTIF($D$1:D269,D268)","v":35},"Government responses35","GULAGECHOES","GULAGECHOESGovernment responsesN/A"]
["Irvine","CHAIN","Evidence Synthesis","Evidence maps","Clinical trials","No","No",{"$f":"COUNTIF($D$1:D270,D269)","v":121},"Evidence Synthesis121","CHAIN","CHAINEvidence SynthesisEvidence maps"]
[null,"CHAIN","Analyses of primary data","N/A",null,null,null,{"$f":"COUNTIF($D$1:D271,D270)","v":5},"Analyses of primary data5","CHAIN","CHAINAnalyses of primary dataN/A"]
[null,"CHAIN","Expert opinions","N/A",null,null,null,{"$f":"COUNTIF($D$1:D272,D271)","v":123},"Expert opinions123","CHAIN","CHAINExpert opinionsN/A"]
[null,"CHAIN","Research methods","N/A",null,null,null,{"$f":"COUNTIF($D$1:D273,D272)","v":124},"Research methods124","CHAIN","CHAINResearch methodsN/A"]
[null,"CHAIN","Single studies","Clinical trials",null,null,null,{"$f":"COUNTIF($D$1:D274,D273)","v":124},"Single studies124","CHAIN","CHAINSingle studiesClinical trials"]
["Irvine","eCancer","Evidence Synthesis","Rapid reviews","Protocols of single studies that are underway","Yes","Yes",{"$f":"COUNTIF($D$1:D275,D274)","v":10},"Evidence Synthesis10","eCancer","eCancerEvidence SynthesisRapid reviews"]
[null,"eCancer","Expert opinions","N/A",null,null,null,{"$f":"COUNTIF($D$1:D276,D275)","v":24},"Expert opinions24","eCancer","eCancerExpert opinionsN/A"]
[null,"eCancer","Training resources and events","N/A",null,null,null,{"$f":"COUNTIF($D$1:D277,D276)","v":126},"Training resources and events126","eCancer","eCancerTraining resources and eventsN/A"]
[null,"eCancer","Analyses of primary data","N/A",null,null,null,{"$f":"COUNTIF($D$1:D278,D277)","v":127},"Analyses of primary data127","eCancer","eCancerAnalyses of primary dataN/A"]
[null,"eCancer","Single studies","Protocols of single studies that are underway",null,"Yes","Yes",{"$f":"COUNTIF($D$1:D279,D278)","v":127},"Single studies127","eCancer","eCancerSingle studiesProtocols of single studies that are underway"]
[null,"eCancer","Recommendations","Recommendations or guidance not reporting using evidence syntheses",null,null,null,{"$f":"COUNTIF($D$1:D280,D279)","v":4},"Recommendations4","eCancer","eCancerRecommendationsRecommendations or guidance not reporting using evidence syntheses"]
[null,"eCancer","Recommendations","Recommendations or guidance that used evidence syntheses",null,null,null,{"$f":"COUNTIF($D$1:D281,D280)","v":36},"Recommendations36","eCancer","eCancerRecommendationsRecommendations or guidance that used evidence syntheses"]
["Promise","COVID-19 Economic Stimulus Index","Single studies","Other primary research studies","Other primary research studies","No","No",{"$f":"COUNTIF($D$1:D282,D281)","v":22},"Single studies22","COVID-19 Economic Stimulus Index","COVID-19 Economic Stimulus IndexSingle studiesOther primary research studies"]
["Promise","Health Economics, Policy and Law blog series on country responses","Government responses","Non of the above","Non of the above","No","No",{"$f":"COUNTIF($D$1:D283,D282)","v":18},"Government responses18","Health Economics, Policy and Law blog series on country responses","Health Economics, Policy and Law blog series on country responsesGovernment responsesNon of the above"]
[null,"COVID-19 Economic Stimulus Index","Analyses of primary data","N/A",null,null,null,{"$f":"COUNTIF($D$1:D284,D283)","v":1},"Analyses of primary data1","COVID-19 Economic Stimulus Index","COVID-19 Economic Stimulus IndexAnalyses of primary dataN/A"]
[null,"Health Information and Quality Authority","Government responses","N/A",null,null,null,{"$f":"COUNTIF($D$1:D285,D284)","v":129},"Government responses129","Health Information and Quality Authority","Health Information and Quality AuthorityGovernment responsesN/A"]
[null,"Government of Canada","Books or handbooks","N/A",null,null,null,{"$f":"COUNTIF($D$1:D286,D285)","v":130},"Books or handbooks130","Government of Canada","Government of CanadaBooks or handbooksN/A"]
["Promise","Nigerian government","Recommendations","Recommendations or guidance not reporting using evidence syntheses","Non of the above","No","Yes",{"$f":"COUNTIF($D$1:D287,D286)","v":130},"Recommendations130","Nigerian government","Nigerian governmentRecommendationsRecommendations or guidance not reporting using evidence syntheses"]
["Irvine","Oxford Evidence Service","Evidence Synthesis","Rapid reviews","Clinical trials","Yes","No",{"$f":"COUNTIF($D$1:D288,D287)","v":37},"Evidence Synthesis37","Oxford Evidence Service","Oxford Evidence ServiceEvidence SynthesisRapid reviews"]
["Irvine","Oxford Evidence Service","Evidence Synthesis","Evidence maps",null,null,null,{"$f":"COUNTIF($D$1:D289,D288)","v":25},"Evidence Synthesis25","Oxford Evidence Service","Oxford Evidence ServiceEvidence SynthesisEvidence maps"]
[null,"Oxford Evidence Service","Expert opinions","N/A",null,null,null,{"$f":"COUNTIF($D$1:D290,D289)","v":6},"Expert opinions6","Oxford Evidence Service","Oxford Evidence ServiceExpert opinionsN/A"]
[null,"Oxford Evidence Service","Analyses of primary data","N/A",null,null,null,{"$f":"COUNTIF($D$1:D291,D290)","v":132},"Analyses of primary data132","Oxford Evidence Service","Oxford Evidence ServiceAnalyses of primary dataN/A"]
[null,"Oxford Evidence Service","Training resources and events","N/A",null,null,null,{"$f":"COUNTIF($D$1:D292,D291)","v":133},"Training resources and events133","Oxford Evidence Service","Oxford Evidence ServiceTraining resources and eventsN/A"]
[null,"Oxford Evidence Service","Recommendations","Recommendations or guidance that used evidence syntheses",null,null,null,{"$f":"COUNTIF($D$1:D293,D292)","v":133},"Recommendations133","Oxford Evidence Service","Oxford Evidence ServiceRecommendationsRecommendations or guidance that used evidence syntheses"]
["Andile","Cochrane Oral Health","Evidence Synthesis","Systematic reviews",null,null,null,{"$f":"COUNTIF($D$1:D294,D293)","v":23},"Evidence Synthesis23","Cochrane Oral Health","Cochrane Oral HealthEvidence SynthesisSystematic reviews"]
[null,"Cochrane Oral Health","Evidence Synthesis","Rapid reviews",null,null,null,{"$f":"COUNTIF($D$1:D295,D294)","v":16},"Evidence Synthesis16","Cochrane Oral Health","Cochrane Oral HealthEvidence SynthesisRapid reviews"]
[null,"Cochrane Oral Health","Recommendations","Recommendations or guidance not reporting using evidence syntheses",null,null,null,{"$f":"COUNTIF($D$1:D296,D295)","v":26},"Recommendations26","Cochrane Oral Health","Cochrane Oral HealthRecommendationsRecommendations or guidance not reporting using evidence syntheses"]
[null,"Cochrane Oral Health","Single studies","Clinical trials",null,null,null,{"$f":"COUNTIF($D$1:D297,D296)","v":38},"Single studies38","Cochrane Oral Health","Cochrane Oral HealthSingle studiesClinical trials"]
["Promise","Cell Press Coronavirus Resource Hub","Single studies","Other primary research studies",null,null,null,{"$f":"COUNTIF($D$1:D298,D297)","v":11},"Single studies11","Cell Press Coronavirus Resource Hub","Cell Press Coronavirus Resource HubSingle studiesOther primary research studies"]
[null,"Cell Press Coronavirus Resource Hub","Analyses of primary data","N/A",null,null,null,{"$f":"COUNTIF($D$1:D299,D298)","v":19},"Analyses of primary data19","Cell Press Coronavirus Resource Hub","Cell Press Coronavirus Resource HubAnalyses of primary dataN/A"]
["Andile","Public Health England","Evidence Synthesis","Rapid reviews",null,null,null,{"$f":"COUNTIF($D$1:D300,D299)","v":134},"Evidence Synthesis134","Public Health England","Public Health EnglandEvidence SynthesisRapid reviews"]
[null,"Public Health England","Evidence Synthesis","Systematic reviews",null,null,null,{"$f":"COUNTIF($D$1:D301,D300)","v":27},"Evidence Synthesis27","Public Health England","Public Health EnglandEvidence SynthesisSystematic reviews"]
[null,"Public Health England","Evidence Synthesis","Evidence maps",null,null,null,{"$f":"COUNTIF($D$1:D302,D301)","v":17},"Evidence Synthesis17","Public Health England","Public Health EnglandEvidence SynthesisEvidence maps"]
[null,"Public Health England","Recommendations","Recommendations or guidance not reporting using evidence syntheses",null,null,null,{"$f":"COUNTIF($D$1:D303,D302)","v":7},"Recommendations7","Public Health England","Public Health EnglandRecommendationsRecommendations or guidance not reporting using evidence syntheses"]
[null,"Public Health England","Single studies","Clinical trials",null,null,null,{"$f":"COUNTIF($D$1:D304,D303)","v":39},"Single studies39","Public Health England","Public Health EnglandSingle studiesClinical trials"]
[null,"Public Health England","Training resources and events","N/A",null,null,null,{"$f":"COUNTIF($D$1:D305,D304)","v":12},"Training resources and events12","Public Health England","Public Health EnglandTraining resources and eventsN/A"]
["Nkuli","Health Technology Assessment International","Government responses","N/A",null,null,null,{"$f":"COUNTIF($D$1:D306,D305)","v":136},"Government responses136","Health Technology Assessment International","Health Technology Assessment InternationalGovernment responsesN/A"]
[null,"COVID-19 and Citizen Science","Training resources and events","N/A",null,null,null,{"$f":"COUNTIF($D$1:D307,D306)","v":137},"Training resources and events137","COVID-19 and Citizen Science","COVID-19 and Citizen ScienceTraining resources and eventsN/A"]
[null,"COVID-19 and Citizen Science","Research methods","N/A",null,null,null,{"$f":"COUNTIF($D$1:D308,D307)","v":138},"Research methods138","COVID-19 and Citizen Science","COVID-19 and Citizen ScienceResearch methodsN/A"]
[null,"Oxford Evidence Service","Books or handbooks","N/A",null,null,null,{"$f":"COUNTIF($D$1:D309,D308)","v":139},"Books or handbooks139","Oxford Evidence Service","Oxford Evidence ServiceBooks or handbooksN/A"]
[null,"Oxford Evidence Service","Recommendations","Recommendations or guidance not reporting using evidence syntheses",null,null,null,{"$f":"COUNTIF($D$1:D310,D309)","v":139},"Recommendations139","Oxford Evidence Service","Oxford Evidence ServiceRecommendationsRecommendations or guidance not reporting using evidence syntheses"]
["Irvine","Cochrane Covid 19 Pregnancy and Fertility","Analyses of primary data","N/A",null,null,null,{"$f":"COUNTIF($D$1:D311,D310)","v":40},"Analyses of primary data40","Cochrane Covid 19 Pregnancy and Fertility","Cochrane Covid 19 Pregnancy and FertilityAnalyses of primary dataN/A"]
[null,"IDS K4D Covid resource","Government responses","N/A",null,null,null,{"$f":"COUNTIF($D$1:D312,D311)","v":141},"Government responses141","IDS K4D Covid resource","IDS K4D Covid resourceGovernment responsesN/A"]
[null,"Cochrane Covid 19 Pregnancy and Fertility","Funding opportunities","N/A",null,null,null,{"$f":"COUNTIF($D$1:D313,D312)","v":142},"Funding opportunities142","Cochrane Covid 19 Pregnancy and Fertility","Cochrane Covid 19 Pregnancy and FertilityFunding opportunitiesN/A"]
[null,"Cochrane Covid 19 Pregnancy and Fertility","Expert opinions","N/A",null,null,null,{"$f":"COUNTIF($D$1:D314,D313)","v":143},"Expert opinions143","Cochrane Covid 19 Pregnancy and Fertility","Cochrane Covid 19 Pregnancy and FertilityExpert opinionsN/A"]
[null,"Cochrane Covid 19 Pregnancy and Fertility","Research methods","N/A",null,null,null,{"$f":"COUNTIF($D$1:D315,D314)","v":144},"Research methods144","Cochrane Covid 19 Pregnancy and Fertility","Cochrane Covid 19 Pregnancy and FertilityResearch methodsN/A"]
[null,"Cochrane Covid 19 Pregnancy and Fertility","Books or handbooks","N/A",null,null,null,{"$f":"COUNTIF($D$1:D316,D315)","v":145},"Books or handbooks145","Cochrane Covid 19 Pregnancy and Fertility","Cochrane Covid 19 Pregnancy and FertilityBooks or handbooksN/A"]
[null,"Cochrane Covid 19 Pregnancy and Fertility","Recommendations","Recommendations or guidance that used evidence syntheses",null,null,null,{"$f":"COUNTIF($D$1:D317,D316)","v":145},"Recommendations145","Cochrane Covid 19 Pregnancy and Fertility","Cochrane Covid 19 Pregnancy and FertilityRecommendationsRecommendations or guidance that used evidence syntheses"]
["Irvine","Johanna Briggs Institute","Research methods","N/A","Non of the above","Yes","Yes",{"$f":"COUNTIF($D$1:D318,D317)","v":24},"Research methods24","Johanna Briggs Institute","Johanna Briggs InstituteResearch methodsN/A"]
[null,"Johanna Briggs Institute","Training resources and events","N/A",null,null,null,{"$f":"COUNTIF($D$1:D319,D318)","v":147},"Training resources and events147","Johanna Briggs Institute","Johanna Briggs InstituteTraining resources and eventsN/A"]
[null,"Johanna Briggs Institute","Analyses of primary data","N/A",null,null,null,{"$f":"COUNTIF($D$1:D320,D319)","v":148},"Analyses of primary data148","Johanna Briggs Institute","Johanna Briggs InstituteAnalyses of primary dataN/A"]
[null,"Johanna Briggs Institute","Expert opinions","N/A",null,null,null,{"$f":"COUNTIF($D$1:D321,D320)","v":149},"Expert opinions149","Johanna Briggs Institute","Johanna Briggs InstituteExpert opinionsN/A"]
[null,"Johanna Briggs Institute","Recommendations","Recommendations or guidance not reporting using evidence syntheses",null,null,null,{"$f":"COUNTIF($D$1:D322,D321)","v":149},"Recommendations149","Johanna Briggs Institute","Johanna Briggs InstituteRecommendationsRecommendations or guidance not reporting using evidence syntheses"]
[null,"Johanna Briggs Institute","Recommendations","Recommendations or guidance that used evidence syntheses",null,null,null,{"$f":"COUNTIF($D$1:D323,D322)","v":41},{"$f":"C323&H323","v":"Recommendations41"},{"$f":"B323","v":"Johanna Briggs Institute"},{"$f":"B323&C323&D323","v":"Johanna Briggs InstituteRecommendationsRecommendations or guidance that used evidence syntheses"}]
["Andile","Ontario Hospital Association","Recommendations","Recommendations or guidance not reporting using evidence syntheses",null,null,null,{"$f":"COUNTIF($D$1:D324,D323)","v":25},"Recommendations25","Ontario Hospital Association","Ontario Hospital AssociationRecommendationsRecommendations or guidance not reporting using evidence syntheses"]
["Promise","IFPRI Covid 19 Food Trade Policy Tracker","Government responses","N/A",null,null,null,{"$f":"COUNTIF($D$1:D325,D324)","v":42},"Government responses42","IFPRI Covid 19 Food Trade Policy Tracker","IFPRI Covid 19 Food Trade Policy TrackerGovernment responsesN/A"]
["Irvine","Development aid","Funding opportunities","N/A","Non of the above","No","No",{"$f":"COUNTIF($D$1:D326,D325)","v":151},"Funding opportunities151","Development aid","Development aidFunding opportunitiesN/A"]
["Andile","SAGE","Recommendations","Recommendations or guidance not reporting using evidence syntheses",null,null,null,{"$f":"COUNTIF($D$1:D327,D326)","v":151},"Recommendations151","SAGE","SAGERecommendationsRecommendations or guidance not reporting using evidence syntheses"]
["Promise","SYREAF","Evidence Synthesis","Rapid reviews",null,null,null,{"$f":"COUNTIF($D$1:D328,D327)","v":43},"Evidence Synthesis43","SYREAF","SYREAFEvidence SynthesisRapid reviews"]
["Andile","ILO Social Protection Monitor","Government responses","N/A",null,null,null,{"$f":"COUNTIF($D$1:D329,D328)","v":28},"Government responses28","ILO Social Protection Monitor","ILO Social Protection MonitorGovernment responsesN/A"]
["Irvine","EUI Covid Knowledge Hub","Analyses of primary data","N/A",null,null,null,{"$f":"COUNTIF($D$1:D330,D329)","v":153},"Analyses of primary data153","EUI Covid Knowledge Hub","EUI Covid Knowledge HubAnalyses of primary dataN/A"]
[null,"EUI Covid Knowledge Hub","Research methods","N/A",null,null,null,{"$f":"COUNTIF($D$1:D331,D330)","v":154},"Research methods154","EUI Covid Knowledge Hub","EUI Covid Knowledge HubResearch methodsN/A"]
[null,"EUI Covid Knowledge Hub","Single studies","Other primary research studies",null,null,null,{"$f":"COUNTIF($D$1:D332,D331)","v":154},"Single studies154","EUI Covid Knowledge Hub","EUI Covid Knowledge HubSingle studiesOther primary research studies"]
["Andile","RCVS Knowledge","Recommendations","Recommendations or guidance not reporting using evidence syntheses",null,null,null,{"$f":"COUNTIF($D$1:D333,D332)","v":20},"Recommendations20","RCVS Knowledge","RCVS KnowledgeRecommendationsRecommendations or guidance not reporting using evidence syntheses"]
[null,"RCVS Knowledge","Evidence Synthesis","Rapid reviews",null,null,null,{"$f":"COUNTIF($D$1:D334,D333)","v":44},"Evidence Synthesis44","RCVS Knowledge","RCVS KnowledgeEvidence SynthesisRapid reviews"]
[null,"RCVS Knowledge","Evidence Synthesis","Systematic reviews",null,null,null,{"$f":"COUNTIF($D$1:D335,D334)","v":29},"Evidence Synthesis29","RCVS Knowledge","RCVS KnowledgeEvidence SynthesisSystematic reviews"]
[null,"RCVS Knowledge","Evidence Synthesis","Evidence maps",null,null,null,{"$f":"COUNTIF($D$1:D336,D335)","v":18},"Evidence Synthesis18","RCVS Knowledge","RCVS KnowledgeEvidence SynthesisEvidence maps"]
["Promise","Journal of the American College of Cardiology","Single studies","Other primary research studies",null,null,null,{"$f":"COUNTIF($D$1:D337,D336)","v":8},"Single studies8","Journal of the American College of Cardiology","Journal of the American College of CardiologySingle studiesOther primary research studies"]
["Andile","Health Information and Quality Authority","Evidence Synthesis","Rapid reviews",null,null,null,{"$f":"COUNTIF($D$1:D338,D337)","v":21},"Evidence Synthesis21","Health Information and Quality Authority","Health Information and Quality AuthorityEvidence SynthesisRapid reviews"]
[null,"Health Information and Quality Authority","Evidence Synthesis","Protocols of systematic reviews that are underway",null,null,null,{"$f":"COUNTIF($D$1:D339,D338)","v":30},"Evidence Synthesis30","Health Information and Quality Authority","Health Information and Quality AuthorityEvidence SynthesisProtocols of systematic reviews that are underway"]
[null,"Health Information and Quality Authority","Recommendations","Recommendations or guidance not reporting using evidence syntheses",null,null,null,{"$f":"COUNTIF($D$1:D340,D339)","v":7},"Recommendations7","Health Information and Quality Authority","Health Information and Quality AuthorityRecommendationsRecommendations or guidance not reporting using evidence syntheses"]
[null,"International Centre for not-for-profit law","Government responses","N/A",null,null,null,{"$f":"COUNTIF($D$1:D341,D340)","v":45},"Government responses45","International Centre for not-for-profit law","International Centre for not-for-profit lawGovernment responsesN/A"]
[null,"Health Information and Quality Authority","Single studies","Clinical trials",null,null,null,{"$f":"COUNTIF($D$1:D342,D341)","v":155},"Single studies155","Health Information and Quality Authority","Health Information and Quality AuthoritySingle studiesClinical trials"]
["Promise","New England Journal of Medicine","Single studies","Other primary research studies",null,null,null,{"$f":"COUNTIF($D$1:D343,D342)","v":13},"Single studies13","New England Journal of Medicine","New England Journal of MedicineSingle studiesOther primary research studies"]
[null,"New England Journal of Medicine","Analyses of primary data","N/A",null,null,null,{"$f":"COUNTIF($D$1:D344,D343)","v":22},"Analyses of primary data22","New England Journal of Medicine","New England Journal of MedicineAnalyses of primary dataN/A"]
[null,"New England Journal of Medicine","Recommendations","Recommendations or guidance not reporting using evidence syntheses",null,null,null,{"$f":"COUNTIF($D$1:D345,D344)","v":156},"Recommendations156","New England Journal of Medicine","New England Journal of MedicineRecommendationsRecommendations or guidance not reporting using evidence syntheses"]
["Irvine","American Chemistry Society","Expert opinions","N/A",null,null,null,{"$f":"COUNTIF($D$1:D346,D345)","v":46},"Expert opinions46","American Chemistry Society","American Chemistry SocietyExpert opinionsN/A"]
[null,"American Chemistry Society","Recommendations","Recommendations or guidance not reporting using evidence syntheses",null,null,null,{"$f":"COUNTIF($D$1:D347,D346)","v":157},"Recommendations157","American Chemistry Society","American Chemistry SocietyRecommendationsRecommendations or guidance not reporting using evidence syntheses"]
[null,"American Chemistry Society","Single studies","Other primary research studies",null,null,null,{"$f":"COUNTIF($D$1:D348,D347)","v":47},"Single studies47","American Chemistry Society","American Chemistry SocietySingle studiesOther primary research studies"]
["Irvine","International Growth Centre(ICG)","Government responses","N/A",null,null,null,{"$f":"COUNTIF($D$1:D349,D348)","v":23},"Government responses23","International Growth Centre(ICG)","International Growth Centre(ICG)Government responsesN/A"]
[null,"TEPHINET Coronavirus Knowledge Hub","Training resources and events","N/A",null,null,null,{"$f":"COUNTIF($D$1:D350,D349)","v":159},"Training resources and events159","TEPHINET Coronavirus Knowledge Hub","TEPHINET Coronavirus Knowledge HubTraining resources and eventsN/A"]
[null,"TEPHINET Coronavirus Knowledge Hub","Funding opportunities","N/A",null,null,null,{"$f":"COUNTIF($D$1:D351,D350)","v":160},"Funding opportunities160","TEPHINET Coronavirus Knowledge Hub","TEPHINET Coronavirus Knowledge HubFunding opportunitiesN/A"]
[null,"TEPHINET Coronavirus Knowledge Hub","Evidence Synthesis","Evidence maps",null,null,null,{"$f":"COUNTIF($D$1:D352,D351)","v":160},"Evidence Synthesis160","TEPHINET Coronavirus Knowledge Hub","TEPHINET Coronavirus Knowledge HubEvidence SynthesisEvidence maps"]
[null,"TEPHINET Coronavirus Knowledge Hub","Recommendations","Recommendations or guidance not reporting using evidence syntheses",null,null,null,{"$f":"COUNTIF($D$1:D353,D352)","v":9},"Recommendations9","TEPHINET Coronavirus Knowledge Hub","TEPHINET Coronavirus Knowledge HubRecommendationsRecommendations or guidance not reporting using evidence syntheses"]
["Promise","LANCET COVID-19 Resource Centre","Evidence Synthesis","Systematic reviews",null,null,null,{"$f":"COUNTIF($D$1:D354,D353)","v":48},"Evidence Synthesis48","LANCET COVID-19 Resource Centre","LANCET COVID-19 Resource CentreEvidence SynthesisSystematic reviews"]
[null,"LANCET COVID-19 Resource Centre","Single studies","Other primary research studies",null,null,null,{"$f":"COUNTIF($D$1:D355,D354)","v":19},"Single studies19","LANCET COVID-19 Resource Centre","LANCET COVID-19 Resource CentreSingle studiesOther primary research studies"]
["Irvine","Makerere University","Single studies","Other primary research studies",null,null,null,{"$f":"COUNTIF($D$1:D356,D355)","v":25},"Single studies25","Makerere University","Makerere UniversitySingle studiesOther primary research studies"]
[null,"Makerere University","Recommendations","Recommendations or guidance not reporting using evidence syntheses",null,null,null,{"$f":"COUNTIF($D$1:D357,D356)","v":25},"Recommendations25","Makerere University","Makerere UniversityRecommendationsRecommendations or guidance not reporting using evidence syntheses"]
[null,"Makerere University","Books or handbooks","N/A",null,null,null,{"$f":"COUNTIF($D$1:D358,D357)","v":49},"Books or handbooks49","Makerere University","Makerere UniversityBooks or handbooksN/A"]
["Irvine","McMasterer Plus","Single studies","Other primary research studies",null,null,null,{"$f":"COUNTIF($D$1:D359,D358)","v":161},"Single studies161","McMasterer Plus","McMasterer PlusSingle studiesOther primary research studies"]
[null,"McMasterer Plus","Single studies","Clinical trials",null,null,null,{"$f":"COUNTIF($D$1:D360,D359)","v":26},"Single studies26","McMasterer Plus","McMasterer PlusSingle studiesClinical trials"]
[null,"McMasterer Plus","Recommendations","Recommendations or guidance not reporting using evidence syntheses",null,null,null,{"$f":"COUNTIF($D$1:D361,D360)","v":14},"Recommendations14","McMasterer Plus","McMasterer PlusRecommendationsRecommendations or guidance not reporting using evidence syntheses"]
[null,"McMasterer Plus","Research methods","N/A",null,null,null,{"$f":"COUNTIF($D$1:D362,D361)","v":50},"Research methods50","McMasterer Plus","McMasterer PlusResearch methodsN/A"]
[null,"International Long Term Care Policy Network","Government responses","N/A",null,null,null,{"$f":"COUNTIF($D$1:D363,D362)","v":163},"Government responses163","International Long Term Care Policy Network","International Long Term Care Policy NetworkGovernment responsesN/A"]
[null,"World Bank Education","Recommendations","Recommendations or guidance not reporting using evidence syntheses",null,null,null,{"$f":"COUNTIF($D$1:D364,D363)","v":163},"Recommendations163","World Bank Education","World Bank EducationRecommendationsRecommendations or guidance not reporting using evidence syntheses"]
[null,"World Bank Education","Training resources and events","N/A",null,null,null,{"$f":"COUNTIF($D$1:D365,D364)","v":51},"Training resources and events51","World Bank Education","World Bank EducationTraining resources and eventsN/A"]
["Promise","Canadian Agency for Drugs and Technologies in Health","Evidence Synthesis","Systematic reviews",null,null,null,{"$f":"COUNTIF($D$1:D366,D365)","v":164},"Evidence Synthesis164","Canadian Agency for Drugs and Technologies in Health","Canadian Agency for Drugs and Technologies in HealthEvidence SynthesisSystematic reviews"]
[null,"Canadian Agency for Drugs and Technologies in Health","Evidence Synthesis","Rapid reviews",null,null,null,{"$f":"COUNTIF($D$1:D367,D366)","v":20},"Evidence Synthesis20","Canadian Agency for Drugs and Technologies in Health","Canadian Agency for Drugs and Technologies in HealthEvidence SynthesisRapid reviews"]
[null,"Canadian Agency for Drugs and Technologies in Health","Single studies","Protocols of single studies that are underway",null,null,null,{"$f":"COUNTIF($D$1:D368,D367)","v":31},"Single studies31","Canadian Agency for Drugs and Technologies in Health","Canadian Agency for Drugs and Technologies in HealthSingle studiesProtocols of single studies that are underway"]
[null,"Canadian Agency for Drugs and Technologies in Health","Training resources and events","N/A",null,null,null,{"$f":"COUNTIF($D$1:D369,D368)","v":5},"Training resources and events5","Canadian Agency for Drugs and Technologies in Health","Canadian Agency for Drugs and Technologies in HealthTraining resources and eventsN/A"]
[null,"Canadian Agency for Drugs and Technologies in Health","Evidence Synthesis","Protocols of systematic reviews that are underway",null,null,null,{"$f":"COUNTIF($D$1:D370,D369)","v":165},"Evidence Synthesis165","Canadian Agency for Drugs and Technologies in Health","Canadian Agency for Drugs and Technologies in HealthEvidence SynthesisProtocols of systematic reviews that are underway"]
[null,"Canadian Agency for Drugs and Technologies in Health","Recommendations","Recommendations or guidance that used evidence syntheses",null,null,null,{"$f":"COUNTIF($D$1:D371,D370)","v":8},"Recommendations8","Canadian Agency for Drugs and Technologies in Health","Canadian Agency for Drugs and Technologies in HealthRecommendationsRecommendations or guidance that used evidence syntheses"]
["Andile","International Monetory Fund(IMF)","Government responses","N/A","Non of the above","No","No",{"$f":"COUNTIF($D$1:D372,D371)","v":26},"Government responses26","International Monetory Fund(IMF)","International Monetory Fund(IMF)Government responsesN/A"]
[null,"Covid 19 Africa Watch","Funding opportunities","N/A",null,null,null,{"$f":"COUNTIF($D$1:D373,D372)","v":167},"Funding opportunities167","Covid 19 Africa Watch","Covid 19 Africa WatchFunding opportunitiesN/A"]
["Irvine","American College of Cardiology","Expert opinions","N/A",null,null,null,{"$f":"COUNTIF($D$1:D374,D373)","v":168},"Expert opinions168","American College of Cardiology","American College of CardiologyExpert opinionsN/A"]
["Andile","International Network for Government Science Advice (INGSA)","Government responses","N/A",null,null,null,{"$f":"COUNTIF($D$1:D375,D374)","v":169},"Government responses169","International Network for Government Science Advice (INGSA)","International Network for Government Science Advice (INGSA)Government responsesN/A"]
[null,"American College of Cardiology","Books or handbooks","N/A",null,null,null,{"$f":"COUNTIF($D$1:D376,D375)","v":170},"Books or handbooks170","American College of Cardiology","American College of CardiologyBooks or handbooksN/A"]
["Promise","International trade centre","Government responses","N/A",null,null,null,{"$f":"COUNTIF($D$1:D377,D376)","v":171},"Government responses171","International trade centre","International trade centreGovernment responsesN/A"]
[null,"Wits Hub","Analyses of primary data","N/A",null,null,null,{"$f":"COUNTIF($D$1:D378,D377)","v":172},"Analyses of primary data172","Wits Hub","Wits HubAnalyses of primary dataN/A"]
["Promise","Cochrane ENT, Hearing & Balance","Recommendations","Recommendations or guidance not reporting using evidence syntheses",null,null,null,{"$f":"COUNTIF($D$1:D379,D378)","v":172},"Recommendations172","Cochrane ENT, Hearing & Balance","Cochrane ENT, Hearing & BalanceRecommendationsRecommendations or guidance not reporting using evidence syntheses"]
[null,"Cochrane ENT, Hearing & Balance","Single studies","Other primary research studies",null,null,null,{"$f":"COUNTIF($D$1:D380,D379)","v":52},"Single studies52","Cochrane ENT, Hearing & Balance","Cochrane ENT, Hearing & BalanceSingle studiesOther primary research studies"]
["Andile","Irish Longitudinal Study on Ageing","Recommendations","Recommendations or guidance not reporting using evidence syntheses",null,null,null,{"$f":"COUNTIF($D$1:D381,D380)","v":27},"Recommendations27","Irish Longitudinal Study on Ageing","Irish Longitudinal Study on AgeingRecommendationsRecommendations or guidance not reporting using evidence syntheses"]
["Irvine","American College of Cardiology","Expert opinions",null,null,null,null,{"$f":"COUNTIF($D$1:D382,D381)","v":53},"Expert opinions53","American College of Cardiology","American College of CardiologyExpert opinions"]
[null,"American College of Cardiology","Recommendations","Recommendations or guidance not reporting using evidence syntheses",null,null,null,{"$f":"COUNTIF($D$1:D383,D382)","v":0},"Recommendations0","American College of Cardiology","American College of CardiologyRecommendationsRecommendations or guidance not reporting using evidence syntheses"]
[null,"American College of Cardiology","Single studies","Other primary research studies",null,null,null,{"$f":"COUNTIF($D$1:D384,D383)","v":54},"Single studies54","American College of Cardiology","American College of CardiologySingle studiesOther primary research studies"]
["Promise","International Long Term Care Policy Network","Recommendations","Recommendations or guidance not reporting using evidence syntheses",null,null,null,{"$f":"COUNTIF($D$1:D385,D384)","v":28},"Recommendations28","International Long Term Care Policy Network","International Long Term Care Policy NetworkRecommendationsRecommendations or guidance not reporting using evidence syntheses"]
[null,"International Long Term Care Policy Network","Recommendations","Recommendations or guidance that used evidence syntheses",null,null,null,{"$f":"COUNTIF($D$1:D386,D385)","v":55},"Recommendations55","International Long Term Care Policy Network","International Long Term Care Policy NetworkRecommendationsRecommendations or guidance that used evidence syntheses"]
[null,"International Long Term Care Policy Network","Single studies","Other primary research studies",null,null,null,{"$f":"COUNTIF($D$1:D387,D386)","v":27},{"$f":"C387&H387","v":"Single studies27"},{"$f":"B387","v":"International Long Term Care Policy Network"},{"$f":"B387&C387&D387","v":"International Long Term Care Policy NetworkSingle studiesOther primary research studies"}]
["Irvine","Kentucky’s response to COVID-19","Government responses","N/A","Non of the above","No","Yes",{"$f":"COUNTIF($D$1:D388,D387)","v":29},"Government responses29","Kentucky’s response to COVID-19","Kentucky’s response to COVID-19Government responsesN/A"]
[null,"International Long Term Care Policy Network","Training resources and events","N/A",null,null,null,{"$f":"COUNTIF($D$1:D389,D388)","v":174},"Training resources and events174","International Long Term Care Policy Network","International Long Term Care Policy NetworkTraining resources and eventsN/A"]
[null,"International Long Term Care Policy Network","Evidence Synthesis","Rapid reviews",null,null,null,{"$f":"COUNTIF($D$1:D390,D389)","v":174},"Evidence Synthesis174","International Long Term Care Policy Network","International Long Term Care Policy NetworkEvidence SynthesisRapid reviews"]
[null,"International Long Term Care Policy Network","Books or handbooks","N/A",null,null,null,{"$f":"COUNTIF($D$1:D391,D390)","v":32},"Books or handbooks32","International Long Term Care Policy Network","International Long Term Care Policy NetworkBooks or handbooksN/A"]
["Promise","Frontiers Coronavirus Knowledge Hub","Single studies","Other primary research studies",null,null,null,{"$f":"COUNTIF($D$1:D392,D391)","v":175},"Single studies175","Frontiers Coronavirus Knowledge Hub","Frontiers Coronavirus Knowledge HubSingle studiesOther primary research studies"]
[null,"Frontiers Coronavirus Knowledge Hub","Evidence Synthesis","Systematic reviews",null,null,null,{"$f":"COUNTIF($D$1:D393,D392)","v":30},"Evidence Synthesis30","Frontiers Coronavirus Knowledge Hub","Frontiers Coronavirus Knowledge HubEvidence SynthesisSystematic reviews"]
[null,"Frontiers Coronavirus Knowledge Hub","Expert opinions","N/A",null,null,null,{"$f":"COUNTIF($D$1:D394,D393)","v":21},"Expert opinions21","Frontiers Coronavirus Knowledge Hub","Frontiers Coronavirus Knowledge HubExpert opinionsN/A"]
[null,"Frontiers Coronavirus Knowledge Hub","Training resources and events","N/A",null,null,null,{"$f":"COUNTIF($D$1:D395,D394)","v":177},"Training resources and events177","Frontiers Coronavirus Knowledge Hub","Frontiers Coronavirus Knowledge HubTraining resources and eventsN/A"]
["Andile","DynaMed","Recommendations","Recommendations or guidance not reporting using evidence syntheses",null,null,null,{"$f":"COUNTIF($D$1:D396,D395)","v":177},"Recommendations177","DynaMed","DynaMedRecommendationsRecommendations or guidance not reporting using evidence syntheses"]
["Irvine","Kenyan Government","Government responses","N/A","Non of the above","No","Yes",{"$f":"COUNTIF($D$1:D397,D396)","v":56},"Government responses56","Kenyan Government","Kenyan GovernmentGovernment responsesN/A"]
[null,"DynaMed","Evidence Synthesis","Systematic reviews",null,null,null,{"$f":"COUNTIF($D$1:D398,D397)","v":178},"Evidence Synthesis178","DynaMed","DynaMedEvidence SynthesisSystematic reviews"]
[null,"DynaMed","Single studies","Clinical trials",null,null,null,{"$f":"COUNTIF($D$1:D399,D398)","v":22},"Single studies22","DynaMed","DynaMedSingle studiesClinical trials"]
["Irvine","American Society of Microbiology","Books or handbooks","N/A",null,null,null,{"$f":"COUNTIF($D$1:D400,D399)","v":15},"Books or handbooks15","American Society of Microbiology","American Society of MicrobiologyBooks or handbooksN/A"]
[null,"American Society of Microbiology","Research methods","N/A",null,null,null,{"$f":"COUNTIF($D$1:D401,D400)","v":180},"Research methods180","American Society of Microbiology","American Society of MicrobiologyResearch methodsN/A"]
[null,"American Society of Microbiology","Funding opportunities","N/A",null,null,null,{"$f":"COUNTIF($D$1:D402,D401)","v":181},"Funding opportunities181","American Society of Microbiology","American Society of MicrobiologyFunding opportunitiesN/A"]
[null,"American Society of Microbiology","Training resources and events","N/A",null,null,null,{"$f":"COUNTIF($D$1:D403,D402)","v":182},"Training resources and events182","American Society of Microbiology","American Society of MicrobiologyTraining resources and eventsN/A"]
[null,"American Society of Microbiology","Expert opinions","N/A",null,null,null,{"$f":"COUNTIF($D$1:D404,D403)","v":183},"Expert opinions183","American Society of Microbiology","American Society of MicrobiologyExpert opinionsN/A"]
[null,"American Society of Microbiology","Analyses of primary data","N/A",null,null,null,{"$f":"COUNTIF($D$1:D405,D404)","v":184},"Analyses of primary data184","American Society of Microbiology","American Society of MicrobiologyAnalyses of primary dataN/A"]
[null,"American Society of Microbiology","Single studies","N/A",null,null,null,{"$f":"COUNTIF($D$1:D406,D405)","v":185},"Single studies185","American Society of Microbiology","American Society of MicrobiologySingle studiesN/A"]
[null,"American Society of Microbiology","Recommendations","Recommendations or guidance that used evidence syntheses",null,null,null,{"$f":"COUNTIF($D$1:D407,D406)","v":185},"Recommendations185","American Society of Microbiology","American Society of MicrobiologyRecommendationsRecommendations or guidance that used evidence syntheses"]
[null,"American Society of Microbiology","Recommendations","Recommendations or guidance not reporting using evidence syntheses",null,null,null,{"$f":"COUNTIF($D$1:D408,D407)","v":28},"Recommendations28","American Society of Microbiology","American Society of MicrobiologyRecommendationsRecommendations or guidance not reporting using evidence syntheses"]
[null,"American Society of Microbiology","Single studies","Other primary research studies",null,null,null,{"$f":"COUNTIF($D$1:D409,D408)","v":57},"Single studies57","American Society of Microbiology","American Society of MicrobiologySingle studiesOther primary research studies"]
[null,"American Society of Microbiology","Evidence Synthesis","Rapid reviews",null,null,null,{"$f":"COUNTIF($D$1:D410,D409)","v":31},"Evidence Synthesis31","American Society of Microbiology","American Society of MicrobiologyEvidence SynthesisRapid reviews"]
["Irvine","Elsevier Novel Coronavirus Information Center","Analyses of primary data","Other primary research studies",null,null,null,{"$f":"COUNTIF($D$1:D411,D410)","v":33},"Analyses of primary data33","Elsevier Novel Coronavirus Information Center","Elsevier Novel Coronavirus Information CenterAnalyses of primary dataOther primary research studies"]
[null,"Elsevier Novel Coronavirus Information Center","Research methods","N/A",null,null,null,{"$f":"COUNTIF($D$1:D412,D411)","v":32},"Research methods32","Elsevier Novel Coronavirus Information Center","Elsevier Novel Coronavirus Information CenterResearch methodsN/A"]
[null,"Elsevier Novel Coronavirus Information Center","Expert opinions","N/A",null,null,null,{"$f":"COUNTIF($D$1:D413,D412)","v":187},"Expert opinions187","Elsevier Novel Coronavirus Information Center","Elsevier Novel Coronavirus Information CenterExpert opinionsN/A"]
[null,"Elsevier Novel Coronavirus Information Center","Recommendations","Recommendations or guidance not reporting using evidence syntheses",null,null,null,{"$f":"COUNTIF($D$1:D414,D413)","v":187},"Recommendations187","Elsevier Novel Coronavirus Information Center","Elsevier Novel Coronavirus Information CenterRecommendationsRecommendations or guidance not reporting using evidence syntheses"]
[null,"Elsevier Novel Coronavirus Information Center","Analyses of primary data","Clinical trials",null,null,null,{"$f":"COUNTIF($D$1:D415,D414)","v":58},"Analyses of primary data58","Elsevier Novel Coronavirus Information Center","Elsevier Novel Coronavirus Information CenterAnalyses of primary dataClinical trials"]
["Andile","Malcolm Wiener Centre for Social Policy Monitoring the Covid-19 Employment Response: Policy Approaches Across Countries","Government responses","N/A",null,null,null,{"$f":"COUNTIF($D$1:D416,D415)","v":16},"Government responses16","Malcolm Wiener Centre for Social Policy Monitoring the Covid-19 Employment Response: Policy Approaches Across Countries","Malcolm Wiener Centre for Social Policy Monitoring the Covid-19 Employment Response: Policy Approaches Across CountriesGovernment responsesN/A"]
[null,"McMaster COVID-19 evidence","Government responses","N/A",null,null,null,{"$f":"COUNTIF($D$1:D417,D416)","v":189},"Government responses189","McMaster COVID-19 evidence","McMaster COVID-19 evidenceGovernment responsesN/A"]
["Promise","UK government","Analyses of primary data","N/A",null,null,null,{"$f":"COUNTIF($D$1:D418,D417)","v":190},"Analyses of primary data190","UK government","UK governmentAnalyses of primary dataN/A"]
[null,"UK government","Single studies","Other primary research studies",null,null,null,{"$f":"COUNTIF($D$1:D419,D418)","v":190},"Single studies190","UK government","UK governmentSingle studiesOther primary research studies"]
["Andile","NEJM's Coronavirus (Covid-19)","Government responses","N/A",null,null,null,{"$f":"COUNTIF($D$1:D420,D419)","v":33},"Government responses33","NEJM's Coronavirus (Covid-19)","NEJM's Coronavirus (Covid-19)Government responsesN/A"]
[null,"SocArxi Corona Net","Analyses of primary data","N/A",null,null,null,{"$f":"COUNTIF($D$1:D421,D420)","v":192},"Analyses of primary data192","SocArxi Corona Net","SocArxi Corona NetAnalyses of primary dataN/A"]
[null,"SocArxi Corona Net","Single studies","Pre-print services",null,null,null,{"$f":"COUNTIF($D$1:D422,D421)","v":192},"Single studies192","SocArxi Corona Net","SocArxi Corona NetSingle studiesPre-print services"]
["Irvine","WHO R & D","Single studies","Other primary research studies",null,null,null,{"$f":"COUNTIF($D$1:D423,D422)","v":1},"Single studies1","WHO R & D","WHO R & DSingle studiesOther primary research studies"]
[null,"WHO R & D","Recommendations","Recommendations or guidance not reporting using evidence syntheses",null,null,null,{"$f":"COUNTIF($D$1:D424,D423)","v":34},"Recommendations34","WHO R & D","WHO R & DRecommendationsRecommendations or guidance not reporting using evidence syntheses"]
[null,"WHO R & D","Research methods","N/A",null,null,null,{"$f":"COUNTIF($D$1:D425,D424)","v":59},"Research methods59","WHO R & D","WHO R & DResearch methodsN/A"]
[null,"WHO R & D","Books or handbooks","N/A",null,null,null,{"$f":"COUNTIF($D$1:D426,D425)","v":194},"Books or handbooks194","WHO R & D","WHO R & DBooks or handbooksN/A"]
[null,"WHO R & D","Expert opinions","N/A",null,null,null,{"$f":"COUNTIF($D$1:D427,D426)","v":195},"Expert opinions195","WHO R & D","WHO R & DExpert opinionsN/A"]
[null,"WHO R & D","Evidence Synthesis","Rapid reviews",null,null,null,{"$f":"COUNTIF($D$1:D428,D427)","v":195},"Evidence Synthesis195","WHO R & D","WHO R & DEvidence SynthesisRapid reviews"]
[null,"WHO R & D","Evidence Synthesis","Pre-print services",null,null,null,{"$f":"COUNTIF($D$1:D429,D428)","v":34},"Evidence Synthesis34","WHO R & D","WHO R & DEvidence SynthesisPre-print services"]
["Irvine","NICD","Government responses","N/A","Other primary research studies","Yes","Yes",{"$f":"COUNTIF($D$1:D430,D429)","v":2},"Government responses2","NICD","NICDGovernment responsesN/A"]
["Irvine","UNIDO","Expert opinions","N/A",null,null,null,{"$f":"COUNTIF($D$1:D431,D430)","v":197},"Expert opinions197","UNIDO","UNIDOExpert opinionsN/A"]
[null,"UNIDO","Recommendations","Recommendations or guidance not reporting using evidence syntheses",null,null,null,{"$f":"COUNTIF($D$1:D432,D431)","v":197},"Recommendations197","UNIDO","UNIDORecommendationsRecommendations or guidance not reporting using evidence syntheses"]
[null,"UNIDO","Single studies","Other primary research studies",null,null,null,{"$f":"COUNTIF($D$1:D433,D432)","v":60},"Single studies60","UNIDO","UNIDOSingle studiesOther primary research studies"]
["Nkuli","OECD Cities responses","Government responses","N/A",null,null,null,{"$f":"COUNTIF($D$1:D434,D433)","v":35},"Government responses35","OECD Cities responses","OECD Cities responsesGovernment responsesN/A"]
[null,"International Centre for not-for-profit law","Evidence Synthesis","Evidence maps",null,null,null,{"$f":"COUNTIF($D$1:D435,D434)","v":198},"Evidence Synthesis198","International Centre for not-for-profit law","International Centre for not-for-profit lawEvidence SynthesisEvidence maps"]
["Andile","Communication Initiative","Recommendations","Recommendations or guidance not reporting using evidence syntheses",null,null,null,{"$f":"COUNTIF($D$1:D436,D435)","v":10},"Recommendations10","Communication Initiative","Communication InitiativeRecommendationsRecommendations or guidance not reporting using evidence syntheses"]
[null,"OECD Country Policy Tracker","Government responses","N/A",null,null,null,{"$f":"COUNTIF($D$1:D437,D436)","v":61},"Government responses61","OECD Country Policy Tracker","OECD Country Policy TrackerGovernment responsesN/A"]
[null,"OECD Health System Response Tracker","Government responses","N/A",null,null,null,{"$f":"COUNTIF($D$1:D438,D437)","v":200},"Government responses200","OECD Health System Response Tracker","OECD Health System Response TrackerGovernment responsesN/A"]
[null,"Zimbabwe COVID-19 Support Hub","Expert opinions","N/A",null,null,null,{"$f":"COUNTIF($D$1:D439,D438)","v":201},"Expert opinions201","Zimbabwe COVID-19 Support Hub","Zimbabwe COVID-19 Support HubExpert opinionsN/A"]
[null,"Zimbabwe COVID-19 Support Hub","Recommendations","Recommendations or guidance not reporting using evidence syntheses",null,null,null,{"$f":"COUNTIF($D$1:D440,D439)","v":201},"Recommendations201","Zimbabwe COVID-19 Support Hub","Zimbabwe COVID-19 Support HubRecommendationsRecommendations or guidance not reporting using evidence syntheses"]
["Promise","Knowledge to Policy Center, American University of Beirut","Evidence Synthesis","Rapid reviews",null,null,null,{"$f":"COUNTIF($D$1:D441,D440)","v":62},"Evidence Synthesis62","Knowledge to Policy Center, American University of Beirut","Knowledge to Policy Center, American University of BeirutEvidence SynthesisRapid reviews"]
["Andile","American Psychological Association: Education","Recommendations","Recommendations or guidance not reporting using evidence syntheses",null,null,null,{"$f":"COUNTIF($D$1:D442,D441)","v":35},"Recommendations35","American Psychological Association: Education","American Psychological Association: EducationRecommendationsRecommendations or guidance not reporting using evidence syntheses"]
[null,"American Psychological Association: Education","Training resources and events","N/A",null,null,null,{"$f":"COUNTIF($D$1:D443,D442)","v":63},"Training resources and events63","American Psychological Association: Education","American Psychological Association: EducationTraining resources and eventsN/A"]
[null,"American Psychological Association: Education","Single studies","Other primary research studies",null,null,null,{"$f":"COUNTIF($D$1:D444,D443)","v":202},"Single studies202","American Psychological Association: Education","American Psychological Association: EducationSingle studiesOther primary research studies"]
["Andile ","Guidelines Network International","Evidence Synthesis","Evidence maps",null,null,null,{"$f":"COUNTIF($D$1:D445,D444)","v":36},"Evidence Synthesis36","Guidelines Network International","Guidelines Network InternationalEvidence SynthesisEvidence maps"]
[null,"Guidelines Network International","Evidence Synthesis","Systematic reviews",null,null,null,{"$f":"COUNTIF($D$1:D446,D445)","v":11},"Evidence Synthesis11","Guidelines Network International","Guidelines Network InternationalEvidence SynthesisSystematic reviews"]
[null,"Guidelines Network International","Single studies","Clinical trials",null,null,null,{"$f":"COUNTIF($D$1:D447,D446)","v":23},"Single studies23","Guidelines Network International","Guidelines Network InternationalSingle studiesClinical trials"]
[null,"Guidelines Network International","Evidence Synthesis","Rapid reviews",null,null,null,{"$f":"COUNTIF($D$1:D448,D447)","v":17},"Evidence Synthesis17","Guidelines Network International","Guidelines Network InternationalEvidence SynthesisRapid reviews"]
[null,"Guidelines Network International","Single studies","Other primary research studies",null,null,null,{"$f":"COUNTIF($D$1:D449,D448)","v":36},"Single studies36","Guidelines Network International","Guidelines Network InternationalSingle studiesOther primary research studies"]
[null,"Guidelines Network International","Recommendations","Recommendations or guidance not reporting using evidence syntheses",null,null,null,{"$f":"COUNTIF($D$1:D450,D449)","v":37},"Recommendations37","Guidelines Network International","Guidelines Network InternationalRecommendationsRecommendations or guidance not reporting using evidence syntheses"]
[null,"Guidelines Network International","Single studies","Pre-print services",null,null,null,{"$f":"COUNTIF($D$1:D451,D450)","v":64},{"$f":"C451&H451","v":"Single studies64"},{"$f":"B451","v":"Guidelines Network International"},{"$f":"B451&C451&D451","v":"Guidelines Network InternationalSingle studiesPre-print services"}]
["Andile","ECRI Guidelines Trust COVID-19 Resource Center","Recommendations","Recommendations or guidance not reporting using evidence syntheses",null,null,null,{"$f":"COUNTIF($D$1:D452,D451)","v":3},"Recommendations3","ECRI Guidelines Trust COVID-19 Resource Center","ECRI Guidelines Trust COVID-19 Resource CenterRecommendationsRecommendations or guidance not reporting using evidence syntheses"]
[null,"ECRI Guidelines Trust COVID-19 Resource Center","Evidence Synthesis","Systematic reviews",null,null,null,{"$f":"COUNTIF($D$1:D453,D452)","v":65},"Evidence Synthesis65","ECRI Guidelines Trust COVID-19 Resource Center","ECRI Guidelines Trust COVID-19 Resource CenterEvidence SynthesisSystematic reviews"]
[null,"ECRI Guidelines Trust COVID-19 Resource Center","Single studies","Clinical trials",null,null,null,{"$f":"COUNTIF($D$1:D454,D453)","v":24},"Single studies24","ECRI Guidelines Trust COVID-19 Resource Center","ECRI Guidelines Trust COVID-19 Resource CenterSingle studiesClinical trials"]
["Irvine","OECD Knowledge Hub","Government responses","N/A",null,null,null,{"$f":"COUNTIF($D$1:D455,D454)","v":18},"Government responses18","OECD Knowledge Hub","OECD Knowledge HubGovernment responsesN/A"]
[null,"Zimbabwe COVID-19 Support Hub","Recommendations","Recommendations or guidance not reporting using evidence syntheses",null,null,null,{"$f":"COUNTIF($D$1:D456,D455)","v":203},"Recommendations203","Zimbabwe COVID-19 Support Hub","Zimbabwe COVID-19 Support HubRecommendationsRecommendations or guidance not reporting using evidence syntheses"]
[null,"Zimbabwe COVID-19 Support Hub","Expert opinions","N/A",null,null,null,{"$f":"COUNTIF($D$1:D457,D456)","v":66},"Expert opinions66","Zimbabwe COVID-19 Support Hub","Zimbabwe COVID-19 Support HubExpert opinionsN/A"]
["Irvine","Regional Educational Laboratories (RELs)","Training resources and events","N/A",null,null,null,{"$f":"COUNTIF($D$1:D458,D457)","v":205},"Training resources and events205","Regional Educational Laboratories (RELs)","Regional Educational Laboratories (RELs)Training resources and eventsN/A"]
[null,"Regional Educational Laboratories (RELs)","Recommendations","Recommendations or guidance not reporting using evidence syntheses",null,null,null,{"$f":"COUNTIF($D$1:D459,D458)","v":205},"Recommendations205","Regional Educational Laboratories (RELs)","Regional Educational Laboratories (RELs)RecommendationsRecommendations or guidance not reporting using evidence syntheses"]
[null,"Regional Educational Laboratories (RELs)","Expert opinions","N/A",null,null,null,{"$f":"COUNTIF($D$1:D460,D459)","v":67},"Expert opinions67","Regional Educational Laboratories (RELs)","Regional Educational Laboratories (RELs)Expert opinionsN/A"]
["Andile","OECD Multilevel Governance","Government responses","N/A",null,null,null,{"$f":"COUNTIF($D$1:D461,D460)","v":207},"Government responses207","OECD Multilevel Governance","OECD Multilevel GovernanceGovernment responsesN/A"]
["Andile","MAGICapp","Recommendations","Recommendations or guidance that used evidence syntheses",null,null,null,{"$f":"COUNTIF($D$1:D462,D461)","v":207},"Recommendations207","MAGICapp","MAGICappRecommendationsRecommendations or guidance that used evidence syntheses"]
[null,"MAGICapp","Recommendations","Recommendations or guidance not reporting using evidence syntheses",null,null,null,{"$f":"COUNTIF($D$1:D463,D462)","v":29},"Recommendations29","MAGICapp","MAGICappRecommendationsRecommendations or guidance not reporting using evidence syntheses"]
["Irvine","Havard Dataverse","Single studies","Other primary research studies",null,null,null,{"$f":"COUNTIF($D$1:D464,D463)","v":68},"Single studies68","Havard Dataverse","Havard DataverseSingle studiesOther primary research studies"]
[null,"Havard Dataverse","Evidence Synthesis","Systematic reviews",null,null,null,{"$f":"COUNTIF($D$1:D465,D464)","v":38},"Evidence Synthesis38","Havard Dataverse","Havard DataverseEvidence SynthesisSystematic reviews"]
[null,"Havard Dataverse","Analyses of primary data","N/A",null,null,null,{"$f":"COUNTIF($D$1:D466,D465)","v":25},"Analyses of primary data25","Havard Dataverse","Havard DataverseAnalyses of primary dataN/A"]
[null,"Havard Dataverse","Research methods","N/A",null,null,null,{"$f":"COUNTIF($D$1:D467,D466)","v":209},"Research methods209","Havard Dataverse","Havard DataverseResearch methodsN/A"]
[null,"Havard Dataverse","Funding opportunities","N/A",null,null,null,{"$f":"COUNTIF($D$1:D468,D467)","v":210},"Funding opportunities210","Havard Dataverse","Havard DataverseFunding opportunitiesN/A"]
["Irvine","PROSPERO","Evidence Synthesis","Rapid reviews",null,null,null,{"$f":"COUNTIF($D$1:D469,D468)","v":210},"Evidence Synthesis210","PROSPERO","PROSPEROEvidence SynthesisRapid reviews"]
[null,"PROSPERO","Evidence Synthesis","Systematic reviews",null,null,null,{"$f":"COUNTIF($D$1:D470,D469)","v":37},"Evidence Synthesis37","PROSPERO","PROSPEROEvidence SynthesisSystematic reviews"]
[null,"PROSPERO","Other (specify)",null,null,null,null,{"$f":"COUNTIF($D$1:D471,D470)","v":26},"Other (specify)26","PROSPERO","PROSPEROOther (specify)"]
[null,"PROSPERO","Analyses of primary data","N/A",null,null,null,{"$f":"COUNTIF($D$1:D472,D471)","v":0},"Analyses of primary data0","PROSPERO","PROSPEROAnalyses of primary dataN/A"]
[null,"PROSPERO","Research methods","N/A",null,null,null,{"$f":"COUNTIF($D$1:D473,D472)","v":212},"Research methods212","PROSPERO","PROSPEROResearch methodsN/A"]
["Promise","Turning Research Into Practice (TRIP)","Evidence Synthesis","Systematic reviews",null,null,null,{"$f":"COUNTIF($D$1:D474,D473)","v":212},"Evidence Synthesis212","Turning Research Into Practice (TRIP)","Turning Research Into Practice (TRIP)Evidence SynthesisSystematic reviews"]
[null,"Turning Research Into Practice (TRIP)","Evidence Synthesis","Protocols of systematic reviews that are underway",null,null,null,{"$f":"COUNTIF($D$1:D475,D474)","v":27},"Evidence Synthesis27","Turning Research Into Practice (TRIP)","Turning Research Into Practice (TRIP)Evidence SynthesisProtocols of systematic reviews that are underway"]
[null,"Turning Research Into Practice (TRIP)","Single studies","Protocols of single studies that are underway",null,null,null,{"$f":"COUNTIF($D$1:D476,D475)","v":9},"Single studies9","Turning Research Into Practice (TRIP)","Turning Research Into Practice (TRIP)Single studiesProtocols of single studies that are underway"]
[null,"Turning Research Into Practice (TRIP)","Single studies","Clinical trials",null,null,null,{"$f":"COUNTIF($D$1:D477,D476)","v":6},"Single studies6","Turning Research Into Practice (TRIP)","Turning Research Into Practice (TRIP)Single studiesClinical trials"]
[null,"Turning Research Into Practice (TRIP)","Single studies","Searchable databases of single studies and often systematic reviews as well",null,null,null,{"$f":"COUNTIF($D$1:D478,D477)","v":19},"Single studies19","Turning Research Into Practice (TRIP)","Turning Research Into Practice (TRIP)Single studiesSearchable databases of single studies and often systematic reviews as well"]
[null,"Turning Research Into Practice (TRIP)","Single studies","Other primary research studies",null,null,null,{"$f":"COUNTIF($D$1:D479,D478)","v":3},"Single studies3","Turning Research Into Practice (TRIP)","Turning Research Into Practice (TRIP)Single studiesOther primary research studies"]
[null,"Turning Research Into Practice (TRIP)","Recommendations","Recommendations or guidance that used evidence syntheses",null,null,null,{"$f":"COUNTIF($D$1:D480,D479)","v":39},"Recommendations39","Turning Research Into Practice (TRIP)","Turning Research Into Practice (TRIP)RecommendationsRecommendations or guidance that used evidence syntheses"]
[null,"Turning Research Into Practice (TRIP)","Recommendations","Recommendations or guidance not reporting using evidence syntheses",null,null,null,{"$f":"COUNTIF($D$1:D481,D480)","v":30},"Recommendations30","Turning Research Into Practice (TRIP)","Turning Research Into Practice (TRIP)RecommendationsRecommendations or guidance not reporting using evidence syntheses"]
["Nkuli","WHO Global research on coronavirus disease (COVID-19)","Single studies","Clinical trials",null,null,null,{"$f":"COUNTIF($D$1:D482,D481)","v":69},"Single studies69","WHO Global research on coronavirus disease (COVID-19)","WHO Global research on coronavirus disease (COVID-19)Single studiesClinical trials"]
[null,"WHO Global research on coronavirus disease (COVID-19)","Single studies","Other primary research studies",null,null,null,{"$f":"COUNTIF($D$1:D483,D482)","v":20},"Single studies20","WHO Global research on coronavirus disease (COVID-19)","WHO Global research on coronavirus disease (COVID-19)Single studiesOther primary research studies"]
[null,"WHO Global research on coronavirus disease (COVID-19)","Evidence Synthesis","Systematic reviews",null,null,null,{"$f":"COUNTIF($D$1:D484,D483)","v":40},"Evidence Synthesis40","WHO Global research on coronavirus disease (COVID-19)","WHO Global research on coronavirus disease (COVID-19)Evidence SynthesisSystematic reviews"]
[null,"WHO Global research on coronavirus disease (COVID-19)","Recommendations","Recommendations or guidance not reporting using evidence syntheses",null,null,null,{"$f":"COUNTIF($D$1:D485,D484)","v":28},"Recommendations28","WHO Global research on coronavirus disease (COVID-19)","WHO Global research on coronavirus disease (COVID-19)RecommendationsRecommendations or guidance not reporting using evidence syntheses"]
[null,"WHO Global research on coronavirus disease (COVID-19)","Single studies","Searchable databases of single studies and often systematic reviews as well",null,null,null,{"$f":"COUNTIF($D$1:D486,D485)","v":70},"Single studies70","WHO Global research on coronavirus disease (COVID-19)","WHO Global research on coronavirus disease (COVID-19)Single studiesSearchable databases of single studies and often systematic reviews as well"]
["Andile","George Institute","Evidence Synthesis","Systematic reviews",null,null,null,{"$f":"COUNTIF($D$1:D487,D486)","v":4},"Evidence Synthesis4","George Institute","George InstituteEvidence SynthesisSystematic reviews"]
[null,"George Institute","Recommendations","Recommendations or guidance not reporting using evidence syntheses",null,null,null,{"$f":"COUNTIF($D$1:D488,D487)","v":29},"Recommendations29","George Institute","George InstituteRecommendationsRecommendations or guidance not reporting using evidence syntheses"]
["Irvine","World Health Organization (WHO) technical guidelines","Recommendations","Recommendations or guidance not reporting using evidence syntheses",null,null,null,{"$f":"COUNTIF($D$1:D489,D488)","v":72},"Recommendations72","World Health Organization (WHO) technical guidelines","World Health Organization (WHO) technical guidelinesRecommendationsRecommendations or guidance not reporting using evidence syntheses"]
[null,"World Health Organization (WHO) technical guidelines","Expert opinions","N/A",null,null,null,{"$f":"COUNTIF($D$1:D490,D489)","v":72},"Expert opinions72","World Health Organization (WHO) technical guidelines","World Health Organization (WHO) technical guidelinesExpert opinionsN/A"]
[null,"World Health Organization (WHO) technical guidelines","Training resources and events","N/A",null,null,null,{"$f":"COUNTIF($D$1:D491,D490)","v":214},"Training resources and events214","World Health Organization (WHO) technical guidelines","World Health Organization (WHO) technical guidelinesTraining resources and eventsN/A"]
[null,"World Health Organization (WHO) technical guidelines","Books or handbooks","N/A",null,null,null,{"$f":"COUNTIF($D$1:D492,D491)","v":215},"Books or handbooks215","World Health Organization (WHO) technical guidelines","World Health Organization (WHO) technical guidelinesBooks or handbooksN/A"]
["Andile","European Respiratory Society","Recommendations","Recommendations or guidance not reporting using evidence syntheses",null,null,null,{"$f":"COUNTIF($D$1:D493,D492)","v":215},"Recommendations215","European Respiratory Society","European Respiratory SocietyRecommendationsRecommendations or guidance not reporting using evidence syntheses"]
["Promise","Love Platform","Single studies","Clinical trials",null,null,null,{"$f":"COUNTIF($D$1:D494,D493)","v":73},"Single studies73","Love Platform","Love PlatformSingle studiesClinical trials"]
[null,"Love Platform","Evidence Synthesis","Systematic reviews",null,null,null,{"$f":"COUNTIF($D$1:D495,D494)","v":21},"Evidence Synthesis21","Love Platform","Love PlatformEvidence SynthesisSystematic reviews"]
["Nkuli","Southern Voice","Single studies","Other primary research studies",null,null,null,{"$f":"COUNTIF($D$1:D496,D495)","v":30},"Single studies30","Southern Voice","Southern VoiceSingle studiesOther primary research studies"]
[null,"Southern Voice","Analyses of primary data","N/A",null,null,null,{"$f":"COUNTIF($D$1:D497,D496)","v":41},"Analyses of primary data41","Southern Voice","Southern VoiceAnalyses of primary dataN/A"]
[null,"Southern Voice","Expert opinions","N/A",null,null,null,{"$f":"COUNTIF($D$1:D498,D497)","v":217},"Expert opinions217","Southern Voice","Southern VoiceExpert opinionsN/A"]
[null,"OECD Science and innovation policy responses by country","Government responses","N/A",null,null,null,{"$f":"COUNTIF($D$1:D499,D498)","v":218},"Government responses218","OECD Science and innovation policy responses by country","OECD Science and innovation policy responses by countryGovernment responsesN/A"]
["Andile","OECD SME Policy Responses","Government responses","N/A",null,null,null,{"$f":"COUNTIF($D$1:D500,D499)","v":219},"Government responses219","OECD SME Policy Responses","OECD SME Policy ResponsesGovernment responsesN/A"]
["Andile","Chinese Center for Disease Control and Prevention","Recommendations","Recommendations or guidance not reporting using evidence syntheses",null,null,null,{"$f":"COUNTIF($D$1:D501,D500)","v":219},"Recommendations219","Chinese Center for Disease Control and Prevention","Chinese Center for Disease Control and PreventionRecommendationsRecommendations or guidance not reporting using evidence syntheses"]
["Promise","Annals of Internal Medicine","Evidence Synthesis","Systematic reviews",null,null,null,{"$f":"COUNTIF($D$1:D502,D501)","v":74},"Evidence Synthesis74","Annals of Internal Medicine","Annals of Internal MedicineEvidence SynthesisSystematic reviews"]
[null,"Annals of Internal Medicine","Evidence Synthesis","Rapid reviews",null,null,null,{"$f":"COUNTIF($D$1:D503,D502)","v":31},"Evidence Synthesis31","Annals of Internal Medicine","Annals of Internal MedicineEvidence SynthesisRapid reviews"]
[null,"Annals of Internal Medicine","Single studies","Other primary research studies",null,null,null,{"$f":"COUNTIF($D$1:D504,D503)","v":38},"Single studies38","Annals of Internal Medicine","Annals of Internal MedicineSingle studiesOther primary research studies"]
[null,"Annals of Internal Medicine","Expert opinions","N/A",null,null,null,{"$f":"COUNTIF($D$1:D505,D504)","v":42},"Expert opinions42","Annals of Internal Medicine","Annals of Internal MedicineExpert opinionsN/A"]
["Irvine","Antimicrobial Stewardship","Recommendations","Recommendations or guidance not reporting using evidence syntheses",null,null,null,{"$f":"COUNTIF($D$1:D506,D505)","v":220},"Recommendations220","Antimicrobial Stewardship","Antimicrobial StewardshipRecommendationsRecommendations or guidance not reporting using evidence syntheses"]
[null,"Antimicrobial Stewardship","Expert opinions","N/A",null,null,null,{"$f":"COUNTIF($D$1:D507,D506)","v":75},"Expert opinions75","Antimicrobial Stewardship","Antimicrobial StewardshipExpert opinionsN/A"]
[null,"Antimicrobial Stewardship","Books or handbooks","N/A",null,null,null,{"$f":"COUNTIF($D$1:D508,D507)","v":222},"Books or handbooks222","Antimicrobial Stewardship","Antimicrobial StewardshipBooks or handbooksN/A"]
["Irvine","U.S. Veterans’ Affairs (VA) Evidence Synthesis Program","Evidence Synthesis","Systematic reviews",null,null,null,{"$f":"COUNTIF($D$1:D509,D508)","v":222},"Evidence Synthesis222","U.S. Veterans’ Affairs (VA) Evidence Synthesis Program","U.S. Veterans’ Affairs (VA) Evidence Synthesis ProgramEvidence SynthesisSystematic reviews"]
[null,"U.S. Veterans’ Affairs (VA) Evidence Synthesis Program","Evidence Synthesis","Rapid reviews",null,null,null,{"$f":"COUNTIF($D$1:D510,D509)","v":32},"Evidence Synthesis32","U.S. Veterans’ Affairs (VA) Evidence Synthesis Program","U.S. Veterans’ Affairs (VA) Evidence Synthesis ProgramEvidence SynthesisRapid reviews"]
[null,"U.S. Veterans’ Affairs (VA) Evidence Synthesis Program","Expert opinions","N/A",null,null,null,{"$f":"COUNTIF($D$1:D511,D510)","v":39},"Expert opinions39","U.S. Veterans’ Affairs (VA) Evidence Synthesis Program","U.S. Veterans’ Affairs (VA) Evidence Synthesis ProgramExpert opinionsN/A"]
[null,"U.S. Veterans’ Affairs (VA) Evidence Synthesis Program","Single studies","Other primary research studies",null,null,null,{"$f":"COUNTIF($D$1:D512,D511)","v":223},"Single studies223","U.S. Veterans’ Affairs (VA) Evidence Synthesis Program","U.S. Veterans’ Affairs (VA) Evidence Synthesis ProgramSingle studiesOther primary research studies"]
[null,"U.S. Veterans’ Affairs (VA) Evidence Synthesis Program","Analyses of primary data","N/A",null,null,null,{"$f":"COUNTIF($D$1:D513,D512)","v":43},"Analyses of primary data43","U.S. Veterans’ Affairs (VA) Evidence Synthesis Program","U.S. Veterans’ Affairs (VA) Evidence Synthesis ProgramAnalyses of primary dataN/A"]
["Irvine","OECD SME Policy Responses","Government responses","N/A",null,null,null,{"$f":"COUNTIF($D$1:D514,D513)","v":225},"Government responses225","OECD SME Policy Responses","OECD SME Policy ResponsesGovernment responsesN/A"]
[null,"Weekly Social Protection Links","Analyses of primary data","N/A",null,null,null,{"$f":"COUNTIF($D$1:D515,D514)","v":226},{"$f":"C515&H515","v":"Analyses of primary data226"},{"$f":"B515","v":"Weekly Social Protection Links"},{"$f":"B515&C515&D515","v":"Weekly Social Protection LinksAnalyses of primary dataN/A"}]
["Andile","OECD Tax policy responses by country","Government responses","N/A","Non of the above","No","No",{"$f":"COUNTIF($D$1:D516,D515)","v":227},"Government responses227","OECD Tax policy responses by country","OECD Tax policy responses by countryGovernment responsesN/A"]
["Nkuli","OECD Tourism Summary","Government responses","N/A",null,null,null,{"$f":"COUNTIF($D$1:D517,D516)","v":228},"Government responses228","OECD Tourism Summary","OECD Tourism SummaryGovernment responsesN/A"]
[null,"Ontario Hospital Association","Government responses","N/A",null,null,null,{"$f":"COUNTIF($D$1:D518,D517)","v":229},"Government responses229","Ontario Hospital Association","Ontario Hospital AssociationGovernment responsesN/A"]
["Nkuli","Call for Action: COVID-19 Data Collaboratives","Single studies","Other primary research studies",null,null,null,{"$f":"COUNTIF($D$1:D519,D518)","v":229},"Single studies229","Call for Action: COVID-19 Data Collaboratives","Call for Action: COVID-19 Data CollaborativesSingle studiesOther primary research studies"]
["Nkuli","Santé Public France","Single studies","Other primary research studies",null,null,null,{"$f":"COUNTIF($D$1:D520,D519)","v":45},"Single studies45","Santé Public France","Santé Public FranceSingle studiesOther primary research studies"]
[null,"Santé Public France","Single studies","Clinical trials",null,null,null,{"$f":"COUNTIF($D$1:D521,D520)","v":45},"Single studies45","Santé Public France","Santé Public FranceSingle studiesClinical trials"]
[null,"Santé Public France","Evidence Synthesis","Rapid reviews",null,null,null,{"$f":"COUNTIF($D$1:D522,D521)","v":22},"Evidence Synthesis22","Santé Public France","Santé Public FranceEvidence SynthesisRapid reviews"]
["Andile","Institut national d’excellence en santé et en services sociaux","Single studies","Clinical trials",null,null,null,{"$f":"COUNTIF($D$1:D523,D522)","v":40},"Single studies40","Institut national d’excellence en santé et en services sociaux","Institut national d’excellence en santé et en services sociauxSingle studiesClinical trials"]
[null,"Institut national d’excellence en santé et en services sociaux","Research methods","N/A",null,null,null,{"$f":"COUNTIF($D$1:D524,D523)","v":23},"Research methods23","Institut national d’excellence en santé et en services sociaux","Institut national d’excellence en santé et en services sociauxResearch methodsN/A"]
[null,"Institut national d’excellence en santé et en services sociaux","Analyses of primary data","N/A",null,null,null,{"$f":"COUNTIF($D$1:D525,D524)","v":231},"Analyses of primary data231","Institut national d’excellence en santé et en services sociaux","Institut national d’excellence en santé et en services sociauxAnalyses of primary dataN/A"]
["Andile","Ontario Ministry of Health","Government responses","N/A","Non of the above","No","No",{"$f":"COUNTIF($D$1:D526,D525)","v":232},"Government responses232","Ontario Ministry of Health","Ontario Ministry of HealthGovernment responsesN/A"]
[null,"GULAGECHOES","Analyses of primary data","N/A",null,null,null,{"$f":"COUNTIF($D$1:D527,D526)","v":233},"Analyses of primary data233","GULAGECHOES","GULAGECHOESAnalyses of primary dataN/A"]
["Promise","CareSearch: Palliative Care Knowledge Network","Recommendations","Recommendations or guidance not reporting using evidence syntheses",null,null,null,{"$f":"COUNTIF($D$1:D528,D527)","v":233},"Recommendations233","CareSearch: Palliative Care Knowledge Network","CareSearch: Palliative Care Knowledge NetworkRecommendationsRecommendations or guidance not reporting using evidence syntheses"]
["Nkuli","Campbell UK and Ireland","Analyses of primary data","Clinical trials",null,null,null,{"$f":"COUNTIF($D$1:D529,D528)","v":76},"Analyses of primary data76","Campbell UK and Ireland","Campbell UK and IrelandAnalyses of primary dataClinical trials"]
[null,"Campbell UK and Ireland","Evidence Synthesis","Evidence maps",null,null,null,{"$f":"COUNTIF($D$1:D530,D529)","v":24},"Evidence Synthesis24","Campbell UK and Ireland","Campbell UK and IrelandEvidence SynthesisEvidence maps"]
[null,"Campbell UK and Ireland","Evidence Synthesis","Rapid reviews",null,null,null,{"$f":"COUNTIF($D$1:D531,D530)","v":12},"Evidence Synthesis12","Campbell UK and Ireland","Campbell UK and IrelandEvidence SynthesisRapid reviews"]
[null,"Campbell UK and Ireland","Evidence Synthesis","Systematic reviews",null,null,null,{"$f":"COUNTIF($D$1:D532,D531)","v":41},"Evidence Synthesis41","Campbell UK and Ireland","Campbell UK and IrelandEvidence SynthesisSystematic reviews"]
[null,"Ontario Ministry of Health ,Ministry of Long-Term Care","Government responses","N/A",null,null,null,{"$f":"COUNTIF($D$1:D533,D532)","v":33},"Government responses33","Ontario Ministry of Health ,Ministry of Long-Term Care","Ontario Ministry of Health ,Ministry of Long-Term CareGovernment responsesN/A"]
["Andile","Open government partnership","Government responses","N/A",null,null,null,{"$f":"COUNTIF($D$1:D534,D533)","v":235},"Government responses235","Open government partnership","Open government partnershipGovernment responsesN/A"]
["Irvine","Distiller SR : Evidence Summary","Analyses of primary data","N/A",null,null,null,{"$f":"COUNTIF($D$1:D535,D534)","v":236},"Analyses of primary data236","Distiller SR : Evidence Summary","Distiller SR : Evidence SummaryAnalyses of primary dataN/A"]
[null,"Distiller SR : Evidence Summary","Evidence Synthesis","Rapid reviews",null,null,null,{"$f":"COUNTIF($D$1:D536,D535)","v":236},"Evidence Synthesis236","Distiller SR : Evidence Summary","Distiller SR : Evidence SummaryEvidence SynthesisRapid reviews"]
[null,"Distiller SR : Evidence Summary","Evidence Synthesis","Systematic reviews",null,null,null,{"$f":"COUNTIF($D$1:D537,D536)","v":42},"Evidence Synthesis42","Distiller SR : Evidence Summary","Distiller SR : Evidence SummaryEvidence SynthesisSystematic reviews"]
[null,"Distiller SR : Evidence Summary","Single studies","Clinical trials",null,null,null,{"$f":"COUNTIF($D$1:D538,D537)","v":34},"Single studies34","Distiller SR : Evidence Summary","Distiller SR : Evidence SummarySingle studiesClinical trials"]
[null,"Distiller SR : Evidence Summary","Research methods","N/A",null,null,null,{"$f":"COUNTIF($D$1:D539,D538)","v":25},"Research methods25","Distiller SR : Evidence Summary","Distiller SR : Evidence SummaryResearch methodsN/A"]
[null,"Distiller SR : Evidence Summary","Books or handbooks","N/A",null,null,null,{"$f":"COUNTIF($D$1:D540,D539)","v":238},"Books or handbooks238","Distiller SR : Evidence Summary","Distiller SR : Evidence SummaryBooks or handbooksN/A"]
["Promise","National COVID-19 Living Evidence Task Force","Recommendations","Recommendations or guidance that used evidence syntheses",null,null,null,{"$f":"COUNTIF($D$1:D541,D540)","v":238},"Recommendations238","National COVID-19 Living Evidence Task Force","National COVID-19 Living Evidence Task ForceRecommendationsRecommendations or guidance that used evidence syntheses"]
[null,"National COVID-19 Living Evidence Task Force","Recommendations","Recommendations or guidance not reporting using evidence syntheses",null,null,null,{"$f":"COUNTIF($D$1:D542,D541)","v":31},"Recommendations31","National COVID-19 Living Evidence Task Force","National COVID-19 Living Evidence Task ForceRecommendationsRecommendations or guidance not reporting using evidence syntheses"]
[null,"Our World In data Policy Responses to the Coronavirus Pandemic","Government responses","N/A",null,null,null,{"$f":"COUNTIF($D$1:D543,D542)","v":77},"Government responses77","Our World In data Policy Responses to the Coronavirus Pandemic","Our World In data Policy Responses to the Coronavirus PandemicGovernment responsesN/A"]
[null,"Vera Institute of Justice","Analyses of primary data","N/A",null,null,null,{"$f":"COUNTIF($D$1:D544,D543)","v":240},"Analyses of primary data240","Vera Institute of Justice","Vera Institute of JusticeAnalyses of primary dataN/A"]
[null,"Oxford Government response tracker","Government responses","N/A",null,null,null,{"$f":"COUNTIF($D$1:D545,D544)","v":241},"Government responses241","Oxford Government response tracker","Oxford Government response trackerGovernment responsesN/A"]
[null,"Brennan Center for Justice",null,null,null,null,null,{"$f":"COUNTIF($D$1:D546,D545)","v":241},"241","Brennan Center for Justice","Brennan Center for Justice"]
["Irvine","Africaxiv","Books or handbooks","N/A",null,null,null,{"$f":"COUNTIF($D$1:D547,D546)","v":0},"Books or handbooks0","Africaxiv","AfricaxivBooks or handbooksN/A"]
[null,"Africaxiv","Research methods","N/A",null,null,null,{"$f":"COUNTIF($D$1:D548,D547)","v":243},"Research methods243","Africaxiv","AfricaxivResearch methodsN/A"]
[null,"Africaxiv","Expert opinions","N/A",null,null,null,{"$f":"COUNTIF($D$1:D549,D548)","v":244},"Expert opinions244","Africaxiv","AfricaxivExpert opinionsN/A"]
[null,"Africaxiv","Analyses of primary data","N/A",null,null,null,{"$f":"COUNTIF($D$1:D550,D549)","v":245},"Analyses of primary data245","Africaxiv","AfricaxivAnalyses of primary dataN/A"]
[null,"Africaxiv","Recommendations","Recommendations or guidance not reporting using evidence syntheses",null,null,null,{"$f":"COUNTIF($D$1:D551,D550)","v":245},"Recommendations245","Africaxiv","AfricaxivRecommendationsRecommendations or guidance not reporting using evidence syntheses"]
[null,"Africaxiv","Single studies","Other primary research studies",null,null,null,{"$f":"COUNTIF($D$1:D552,D551)","v":78},"Single studies78","Africaxiv","AfricaxivSingle studiesOther primary research studies"]
["Nkuli","Prison Policy Initiative","Government responses","N/A",null,null,null,{"$f":"COUNTIF($D$1:D553,D552)","v":46},"Government responses46","Prison Policy Initiative","Prison Policy InitiativeGovernment responsesN/A"]
[null,"ILO Social Protection Monitor","Analyses of primary data","N/A",null,null,null,{"$f":"COUNTIF($D$1:D554,D553)","v":247},"Analyses of primary data247","ILO Social Protection Monitor","ILO Social Protection MonitorAnalyses of primary dataN/A"]
["Promise","Wolters Kluwer Global Infectious Diseases and Epidemiology Online Network (GIDEON)","Evidence Synthesis","Systematic reviews",null,null,null,{"$f":"COUNTIF($D$1:D555,D554)","v":247},"Evidence Synthesis247","Wolters Kluwer Global Infectious Diseases and Epidemiology Online Network (GIDEON)","Wolters Kluwer Global Infectious Diseases and Epidemiology Online Network (GIDEON)Evidence SynthesisSystematic reviews"]
[null,"Wolters Kluwer Global Infectious Diseases and Epidemiology Online Network (GIDEON)","Single studies","Other primary research studies",null,null,null,{"$f":"COUNTIF($D$1:D556,D555)","v":35},"Single studies35","Wolters Kluwer Global Infectious Diseases and Epidemiology Online Network (GIDEON)","Wolters Kluwer Global Infectious Diseases and Epidemiology Online Network (GIDEON)Single studiesOther primary research studies"]
["Nkuli","COVID 19 Inequality Project","Analyses of primary data","N/A",null,null,null,{"$f":"COUNTIF($D$1:D557,D556)","v":47},"Analyses of primary data47","COVID 19 Inequality Project","COVID 19 Inequality ProjectAnalyses of primary dataN/A"]
["Irvine","Our World In data Policy Responses to the Coronavirus Pandemic","Recommendations","Recommendations or guidance not reporting using evidence syntheses",null,null,null,{"$f":"COUNTIF($D$1:D558,D557)","v":248},"Recommendations248","Our World In data Policy Responses to the Coronavirus Pandemic","Our World In data Policy Responses to the Coronavirus PandemicRecommendationsRecommendations or guidance not reporting using evidence syntheses"]
[null,"Public Health Ontario","Government responses","N/A",null,null,null,{"$f":"COUNTIF($D$1:D559,D558)","v":79},"Government responses79","Public Health Ontario","Public Health OntarioGovernment responsesN/A"]
[null,"Our World In data Policy Responses to the Coronavirus Pandemic","Expert opinions","N/A",null,null,null,{"$f":"COUNTIF($D$1:D560,D559)","v":250},"Expert opinions250","Our World In data Policy Responses to the Coronavirus Pandemic","Our World In data Policy Responses to the Coronavirus PandemicExpert opinionsN/A"]
[null,"Our World In data Policy Responses to the Coronavirus Pandemic","Books or handbooks","N/A",null,null,null,{"$f":"COUNTIF($D$1:D561,D560)","v":251},"Books or handbooks251","Our World In data Policy Responses to the Coronavirus Pandemic","Our World In data Policy Responses to the Coronavirus PandemicBooks or handbooksN/A"]
["Andile","SocArxi Corona Net","Government responses","N/A",null,null,null,{"$f":"COUNTIF($D$1:D562,D561)","v":252},"Government responses252","SocArxi Corona Net","SocArxi Corona NetGovernment responsesN/A"]
["Irvine","European Society of Intensive Care Medicine","Expert opinions","N/A",null,null,null,{"$f":"COUNTIF($D$1:D563,D562)","v":253},"Expert opinions253","European Society of Intensive Care Medicine","European Society of Intensive Care MedicineExpert opinionsN/A"]
[null,"European Society of Intensive Care Medicine","Training resources and events","N/A",null,null,null,{"$f":"COUNTIF($D$1:D564,D563)","v":254},"Training resources and events254","European Society of Intensive Care Medicine","European Society of Intensive Care MedicineTraining resources and eventsN/A"]
[null,"European Society of Intensive Care Medicine","Books or handbooks","N/A",null,null,null,{"$f":"COUNTIF($D$1:D565,D564)","v":255},"Books or handbooks255","European Society of Intensive Care Medicine","European Society of Intensive Care MedicineBooks or handbooksN/A"]
["Promise","National Institutes of Health treatment guidelines","Recommendations","Recommendations or guidance not reporting using evidence syntheses",null,null,null,{"$f":"COUNTIF($D$1:D566,D565)","v":255},"Recommendations255","National Institutes of Health treatment guidelines","National Institutes of Health treatment guidelinesRecommendationsRecommendations or guidance not reporting using evidence syntheses"]
["Nkuli","IIASA COVID-19 : Visualizing regional socioeconomic indicators for Europe","Analyses of primary data","N/A",null,null,null,{"$f":"COUNTIF($D$1:D567,D566)","v":80},"Analyses of primary data80","IIASA COVID-19 : Visualizing regional socioeconomic indicators for Europe","IIASA COVID-19 : Visualizing regional socioeconomic indicators for EuropeAnalyses of primary dataN/A"]
["Andile","Global Health 5050 COVID-19 sex-disaggregated data tracker","Analyses of primary data","N/A",null,null,null,{"$f":"COUNTIF($D$1:D568,D567)","v":257},"Analyses of primary data257","Global Health 5050 COVID-19 sex-disaggregated data tracker","Global Health 5050 COVID-19 sex-disaggregated data trackerAnalyses of primary dataN/A"]
["Nkuli","COVID Racial Data Tracker","Analyses of primary data","N/A",null,null,null,{"$f":"COUNTIF($D$1:D569,D568)","v":258},"Analyses of primary data258","COVID Racial Data Tracker","COVID Racial Data TrackerAnalyses of primary dataN/A"]
[null,"Southern Voice","Government responses","N/A",null,null,null,{"$f":"COUNTIF($D$1:D570,D569)","v":259},"Government responses259","Southern Voice","Southern VoiceGovernment responsesN/A"]
["Nkuli","World Pandemic Research Network (WPRN) ","Single studies","Protocols of single studies that are underway",null,null,null,{"$f":"COUNTIF($D$1:D571,D570)","v":259},"Single studies259","World Pandemic Research Network (WPRN) ","World Pandemic Research Network (WPRN) Single studiesProtocols of single studies that are underway"]
[null,"World Pandemic Research Network (WPRN) ","Analyses of primary data","N/A",null,null,null,{"$f":"COUNTIF($D$1:D572,D571)","v":7},"Analyses of primary data7","World Pandemic Research Network (WPRN) ","World Pandemic Research Network (WPRN) Analyses of primary dataN/A"]
[null,"World Pandemic Research Network (WPRN) ","Funding opportunities","N/A",null,null,null,{"$f":"COUNTIF($D$1:D573,D572)","v":261},"Funding opportunities261","World Pandemic Research Network (WPRN) ","World Pandemic Research Network (WPRN) Funding opportunitiesN/A"]
["Andile","Dimensions COVID-19","Single studies","Clinical trials",null,null,null,{"$f":"COUNTIF($D$1:D574,D573)","v":261},"Single studies261","Dimensions COVID-19","Dimensions COVID-19Single studiesClinical trials"]
[null,"Dimensions COVID-19","Single studies","Other primary research studies",null,null,null,{"$f":"COUNTIF($D$1:D575,D574)","v":26},"Single studies26","Dimensions COVID-19","Dimensions COVID-19Single studiesOther primary research studies"]
[null,"Dimensions COVID-19","Funding opportunities","N/A",null,null,null,{"$f":"COUNTIF($D$1:D576,D575)","v":48},"Funding opportunities48","Dimensions COVID-19","Dimensions COVID-19Funding opportunitiesN/A"]
[null,"Dimensions COVID-19","Evidence Synthesis","Systematic reviews",null,null,null,{"$f":"COUNTIF($D$1:D577,D576)","v":262},"Evidence Synthesis262","Dimensions COVID-19","Dimensions COVID-19Evidence SynthesisSystematic reviews"]
["Nkuli","COVID Scholar","Single studies","Clinical trials",null,null,null,{"$f":"COUNTIF($D$1:D578,D577)","v":36},"Single studies36","COVID Scholar","COVID ScholarSingle studiesClinical trials"]
[null,"COVID Scholar","Single studies","Other primary research studies",null,null,null,{"$f":"COUNTIF($D$1:D579,D578)","v":27},{"$f":"C579&H579","v":"Single studies27"},{"$f":"B579","v":"COVID Scholar"},{"$f":"B579&C579&D579","v":"COVID ScholarSingle studiesOther primary research studies"}]
[null,"COVID Scholar","Other (specify)","Searchable databases of single studies and often systematic reviews as well",null,null,null,{"$f":"COUNTIF($D$1:D580,D579)","v":49},"Other (specify)49","COVID Scholar","COVID ScholarOther (specify)Searchable databases of single studies and often systematic reviews as well"]
[null,"COVID Scholar","Evidence Synthesis","Systematic reviews",null,null,null,{"$f":"COUNTIF($D$1:D581,D580)","v":5},"Evidence Synthesis5","COVID Scholar","COVID ScholarEvidence SynthesisSystematic reviews"]
[null,"COVID Scholar","Evidence Synthesis","Rapid reviews",null,null,null,{"$f":"COUNTIF($D$1:D582,D581)","v":37},"Evidence Synthesis37","COVID Scholar","COVID ScholarEvidence SynthesisRapid reviews"]
[null,"COVID Scholar","Analyses of primary data","N/A",null,null,null,{"$f":"COUNTIF($D$1:D583,D582)","v":43},"Analyses of primary data43","COVID Scholar","COVID ScholarAnalyses of primary dataN/A"]
["Promise","Tableau Public","Government responses","N/A",null,null,null,{"$f":"COUNTIF($D$1:D584,D583)","v":264},"Government responses264","Tableau Public","Tableau PublicGovernment responsesN/A"]
[null,"COVID Scholar","Books or handbooks","N/A",null,null,null,{"$f":"COUNTIF($D$1:D585,D584)","v":265},"Books or handbooks265","COVID Scholar","COVID ScholarBooks or handbooksN/A"]
["Andile","TEPHINET Coronavirus Knowledge Hub","Government responses","N/A",null,null,null,{"$f":"COUNTIF($D$1:D586,D585)","v":266},"Government responses266","TEPHINET Coronavirus Knowledge Hub","TEPHINET Coronavirus Knowledge HubGovernment responsesN/A"]
["Andile","The Marshall Project Coronavirus Tracker","Government responses","N/A",null,null,null,{"$f":"COUNTIF($D$1:D587,D586)","v":267},"Government responses267","The Marshall Project Coronavirus Tracker","The Marshall Project Coronavirus TrackerGovernment responsesN/A"]
["Irvine","Health Data Research UK","Expert opinions","N/A",null,null,null,{"$f":"COUNTIF($D$1:D588,D587)","v":268},"Expert opinions268","Health Data Research UK","Health Data Research UKExpert opinionsN/A"]
[null,"Health Data Research UK","Single studies","Clinical trials",null,null,null,{"$f":"COUNTIF($D$1:D589,D588)","v":268},"Single studies268","Health Data Research UK","Health Data Research UKSingle studiesClinical trials"]
[null,"Health Data Research UK","Books or handbooks","N/A",null,null,null,{"$f":"COUNTIF($D$1:D590,D589)","v":28},"Books or handbooks28","Health Data Research UK","Health Data Research UKBooks or handbooksN/A"]
[null,"Health Data Research UK","Recommendations","Recommendations or guidance not reporting using evidence syntheses",null,null,null,{"$f":"COUNTIF($D$1:D591,D590)","v":269},"Recommendations269","Health Data Research UK","Health Data Research UKRecommendationsRecommendations or guidance not reporting using evidence syntheses"]
[null,"U.S. National Institutes of Health","Government responses","N/A",null,null,null,{"$f":"COUNTIF($D$1:D592,D591)","v":81},"Government responses81","U.S. National Institutes of Health","U.S. National Institutes of HealthGovernment responsesN/A"]
["Nkuli","UCLA Law Covid-19 Behind Bars Data Project","Government responses","N/A",null,null,null,{"$f":"COUNTIF($D$1:D593,D592)","v":271},"Government responses271","UCLA Law Covid-19 Behind Bars Data Project","UCLA Law Covid-19 Behind Bars Data ProjectGovernment responsesN/A"]
[null,null,"Expert opinions","N/A",null,null,null,{"$f":"COUNTIF($D$1:D594,D593)","v":272},"Expert opinions272",0,"Expert opinionsN/A"]
["Irvine","UK Government (Previously put as DFID)","Government responses","N/A","Other primary research studies","No","Yes",{"$f":"COUNTIF($D$1:D595,D594)","v":273},"Government responses273","UK Government (Previously put as DFID)","UK Government (Previously put as DFID)Government responsesN/A"]
["Irvine","UN Food and Agriculture Organisation(FAO)","Government responses","N/A","Other primary research studies","No","No",{"$f":"COUNTIF($D$1:D596,D595)","v":274},"Government responses274","UN Food and Agriculture Organisation(FAO)","UN Food and Agriculture Organisation(FAO)Government responsesN/A"]
[null,"UN Habitat","Government responses","N/A",null,null,null,{"$f":"COUNTIF($D$1:D597,D596)","v":275},"Government responses275","UN Habitat","UN HabitatGovernment responsesN/A"]
["Promise","Global Health Network Covid-19 Research Implementation Hub","Recommendations","Recommendations or guidance not reporting using evidence syntheses",null,null,null,{"$f":"COUNTIF($D$1:D598,D597)","v":275},"Recommendations275","Global Health Network Covid-19 Research Implementation Hub","Global Health Network Covid-19 Research Implementation HubRecommendationsRecommendations or guidance not reporting using evidence syntheses"]
[null,"Global Health Network Covid-19 Research Implementation Hub","Evidence Synthesis","Systematic reviews",null,null,null,{"$f":"COUNTIF($D$1:D599,D598)","v":82},"Evidence Synthesis82","Global Health Network Covid-19 Research Implementation Hub","Global Health Network Covid-19 Research Implementation HubEvidence SynthesisSystematic reviews"]
[null,"Global Health Network Covid-19 Research Implementation Hub","Single studies","Clinical trials",null,null,null,{"$f":"COUNTIF($D$1:D600,D599)","v":38},"Single studies38","Global Health Network Covid-19 Research Implementation Hub","Global Health Network Covid-19 Research Implementation HubSingle studiesClinical trials"]
[null,"Global Health Network Covid-19 Research Implementation Hub","Single studies","Other primary research studies",null,null,null,{"$f":"COUNTIF($D$1:D601,D600)","v":29},"Single studies29","Global Health Network Covid-19 Research Implementation Hub","Global Health Network Covid-19 Research Implementation HubSingle studiesOther primary research studies"]
[null,"Global Health Network Covid-19 Research Implementation Hub","Books or handbooks","N/A",null,null,null,{"$f":"COUNTIF($D$1:D602,D601)","v":50},"Books or handbooks50","Global Health Network Covid-19 Research Implementation Hub","Global Health Network Covid-19 Research Implementation HubBooks or handbooksN/A"]
[null,"Global Health Network Covid-19 Research Implementation Hub","Training resources and events","N/A",null,null,null,{"$f":"COUNTIF($D$1:D603,D602)","v":277},"Training resources and events277","Global Health Network Covid-19 Research Implementation Hub","Global Health Network Covid-19 Research Implementation HubTraining resources and eventsN/A"]
[null,"Global Health Network Covid-19 Research Implementation Hub","Funding opportunities","N/A",null,null,null,{"$f":"COUNTIF($D$1:D604,D603)","v":278},"Funding opportunities278","Global Health Network Covid-19 Research Implementation Hub","Global Health Network Covid-19 Research Implementation HubFunding opportunitiesN/A"]
[null,"UN International Labour Organisation(ILO)","Government responses","N/A",null,null,null,{"$f":"COUNTIF($D$1:D605,D604)","v":279},"Government responses279","UN International Labour Organisation(ILO)","UN International Labour Organisation(ILO)Government responsesN/A"]
[null,"OECD SME Policy Responses","Analyses of primary data","N/A",null,null,null,{"$f":"COUNTIF($D$1:D606,D605)","v":280},"Analyses of primary data280","OECD SME Policy Responses","OECD SME Policy ResponsesAnalyses of primary dataN/A"]
[null,"UNDP COVID 19 Dashboard","Government responses","N/A",null,null,null,{"$f":"COUNTIF($D$1:D607,D606)","v":281},"Government responses281","UNDP COVID 19 Dashboard","UNDP COVID 19 DashboardGovernment responsesN/A"]
[null,"UNESCO COVID-21","Government responses","N/A",null,null,null,{"$f":"COUNTIF($D$1:D608,D607)","v":282},"Government responses282","UNESCO COVID-21","UNESCO COVID-21Government responsesN/A"]
[null,"Global overview of COVID-19: Impact on elections","Analyses of primary data","N/A",null,null,null,{"$f":"COUNTIF($D$1:D609,D608)","v":283},"Analyses of primary data283","Global overview of COVID-19: Impact on elections","Global overview of COVID-19: Impact on electionsAnalyses of primary dataN/A"]
["Nkuli","UNESCO Planipolis","Government responses","N/A",null,null,null,{"$f":"COUNTIF($D$1:D610,D609)","v":284},"Government responses284","UNESCO Planipolis","UNESCO PlanipolisGovernment responsesN/A"]
[null,"OECD SME Policy Responses","Expert opinions","N/A",null,null,null,{"$f":"COUNTIF($D$1:D611,D610)","v":285},"Expert opinions285","OECD SME Policy Responses","OECD SME Policy ResponsesExpert opinionsN/A"]
["Promise","Society of Critical Care Medicine","Recommendations","Recommendations or guidance not reporting using evidence syntheses",null,null,null,{"$f":"COUNTIF($D$1:D612,D611)","v":285},"Recommendations285","Society of Critical Care Medicine","Society of Critical Care MedicineRecommendationsRecommendations or guidance not reporting using evidence syntheses"]
[null,"Society of Critical Care Medicine","Single studies","Other primary research studies",null,null,null,{"$f":"COUNTIF($D$1:D613,D612)","v":83},"Single studies83","Society of Critical Care Medicine","Society of Critical Care MedicineSingle studiesOther primary research studies"]
[null,"Society of Critical Care Medicine","Training resources and events","N/A",null,null,null,{"$f":"COUNTIF($D$1:D614,D613)","v":51},"Training resources and events51","Society of Critical Care Medicine","Society of Critical Care MedicineTraining resources and eventsN/A"]
["Irvine","Covid 19 Research Explorer","Analyses of primary data","N/A",null,null,null,{"$f":"COUNTIF($D$1:D615,D614)","v":287},"Analyses of primary data287","Covid 19 Research Explorer","Covid 19 Research ExplorerAnalyses of primary dataN/A"]
[null,"Covid 19 Research Explorer","Recommendations","Recommendations or guidance not reporting using evidence syntheses",null,null,null,{"$f":"COUNTIF($D$1:D616,D615)","v":287},"Recommendations287","Covid 19 Research Explorer","Covid 19 Research ExplorerRecommendationsRecommendations or guidance not reporting using evidence syntheses"]
[null,"Covid 19 Research Explorer","Research methods",null,null,null,null,{"$f":"COUNTIF($D$1:D617,D616)","v":84},"Research methods84","Covid 19 Research Explorer","Covid 19 Research ExplorerResearch methods"]
[null,"Covid 19 Research Explorer","Recommendations","Recommendations or guidance that used evidence syntheses",null,null,null,{"$f":"COUNTIF($D$1:D618,D617)","v":0},"Recommendations0","Covid 19 Research Explorer","Covid 19 Research ExplorerRecommendationsRecommendations or guidance that used evidence syntheses"]
["Nkuli","Covid19 Behaviour Tracker\n","Analyses of primary data","N/A",null,null,null,{"$f":"COUNTIF($D$1:D619,D618)","v":32},"Analyses of primary data32","Covid19 Behaviour Tracker\n","Covid19 Behaviour Tracker\nAnalyses of primary dataN/A"]
["Andile","Open COVID-19 policy dataset","Evidence Synthesis","Evidence maps",null,null,null,{"$f":"COUNTIF($D$1:D620,D619)","v":288},"Evidence Synthesis288","Open COVID-19 policy dataset","Open COVID-19 policy datasetEvidence SynthesisEvidence maps"]
[null,"Open COVID-19 policy dataset","Single studies","Other primary research studies",null,null,null,{"$f":"COUNTIF($D$1:D621,D620)","v":13},"Single studies13","Open COVID-19 policy dataset","Open COVID-19 policy datasetSingle studiesOther primary research studies"]
[null,"Open COVID-19 policy dataset","Recommendations","Recommendations or guidance not reporting using evidence syntheses",null,null,null,{"$f":"COUNTIF($D$1:D622,D621)","v":52},"Recommendations52","Open COVID-19 policy dataset","Open COVID-19 policy datasetRecommendationsRecommendations or guidance not reporting using evidence syntheses"]
["Irvine","Kaggle","Single studies","Other primary research studies",null,null,null,{"$f":"COUNTIF($D$1:D623,D622)","v":85},"Single studies85","Kaggle","KaggleSingle studiesOther primary research studies"]
[null,"Kaggle","Recommendations","Recommendations or guidance not reporting using evidence syntheses",null,null,null,{"$f":"COUNTIF($D$1:D624,D623)","v":53},"Recommendations53","Kaggle","KaggleRecommendationsRecommendations or guidance not reporting using evidence syntheses"]
[null,"Kaggle","Expert opinions","N/A",null,null,null,{"$f":"COUNTIF($D$1:D625,D624)","v":86},"Expert opinions86","Kaggle","KaggleExpert opinionsN/A"]
[null,"Kaggle","Analyses of primary data","N/A",null,null,null,{"$f":"COUNTIF($D$1:D626,D625)","v":290},"Analyses of primary data290","Kaggle","KaggleAnalyses of primary dataN/A"]
["Nkuli","Google Covid-19 Community Mobility Reports","Analyses of primary data","N/A",null,null,null,{"$f":"COUNTIF($D$1:D627,D626)","v":291},"Analyses of primary data291","Google Covid-19 Community Mobility Reports","Google Covid-19 Community Mobility ReportsAnalyses of primary dataN/A"]
["Promise","United Nations Office for the Coordination of Humanitarian Affairs","Government responses","N/A",null,null,null,{"$f":"COUNTIF($D$1:D628,D627)","v":292},"Government responses292","United Nations Office for the Coordination of Humanitarian Affairs","United Nations Office for the Coordination of Humanitarian AffairsGovernment responsesN/A"]
["Andile","Vera Institute of Justice","Government responses","N/A",null,null,null,{"$f":"COUNTIF($D$1:D629,D628)","v":293},"Government responses293","Vera Institute of Justice","Vera Institute of JusticeGovernment responsesN/A"]
["Andile","Weekly Social Protection Links","Government responses","N/A",null,null,null,{"$f":"COUNTIF($D$1:D630,D629)","v":294},"Government responses294","Weekly Social Protection Links","Weekly Social Protection LinksGovernment responsesN/A"]
["Irvine","Wiley Covid-19: Novel Coronavirus Outbreak","Single studies","Other primary research studies",null,null,null,{"$f":"COUNTIF($D$1:D631,D630)","v":294},"Single studies294","Wiley Covid-19: Novel Coronavirus Outbreak","Wiley Covid-19: Novel Coronavirus OutbreakSingle studiesOther primary research studies"]
[null,"Wiley Covid-19: Novel Coronavirus Outbreak","Evidence Synthesis","Rapid reviews",null,null,null,{"$f":"COUNTIF($D$1:D632,D631)","v":54},"Evidence Synthesis54","Wiley Covid-19: Novel Coronavirus Outbreak","Wiley Covid-19: Novel Coronavirus OutbreakEvidence SynthesisRapid reviews"]
[null,"Wiley Covid-19: Novel Coronavirus Outbreak","Expert opinions","N/A",null,null,null,{"$f":"COUNTIF($D$1:D633,D632)","v":44},"Expert opinions44","Wiley Covid-19: Novel Coronavirus Outbreak","Wiley Covid-19: Novel Coronavirus OutbreakExpert opinionsN/A"]
[null,"Wiley Covid-19: Novel Coronavirus Outbreak","Recommendations","Recommendations or guidance not reporting using evidence syntheses",null,null,null,{"$f":"COUNTIF($D$1:D634,D633)","v":295},"Recommendations295","Wiley Covid-19: Novel Coronavirus Outbreak","Wiley Covid-19: Novel Coronavirus OutbreakRecommendationsRecommendations or guidance not reporting using evidence syntheses"]
[null,"Wiley Covid-19: Novel Coronavirus Outbreak","Recommendations","Recommendations or guidance that used evidence syntheses",null,null,null,{"$f":"COUNTIF($D$1:D635,D634)","v":87},"Recommendations87","Wiley Covid-19: Novel Coronavirus Outbreak","Wiley Covid-19: Novel Coronavirus OutbreakRecommendationsRecommendations or guidance that used evidence syntheses"]
["Nkuli","WHO Regional Office for Europe (technical guidance)","Government responses","N/A",null,null,null,{"$f":"COUNTIF($D$1:D636,D635)","v":33},"Government responses33","WHO Regional Office for Europe (technical guidance)","WHO Regional Office for Europe (technical guidance)Government responsesN/A"]
["Andile","Wits Hub","Government responses","N/A",null,null,null,{"$f":"COUNTIF($D$1:D637,D636)","v":297},"Government responses297","Wits Hub","Wits HubGovernment responsesN/A"]
["Promise","World Bank Education","Government responses","N/A",null,null,null,{"$f":"COUNTIF($D$1:D638,D637)","v":298},"Government responses298","World Bank Education","World Bank EducationGovernment responsesN/A"]
["Irvine","Yale School of Management's Program COVID-19 Financial Response Tracker (CFRT)","Government responses","N/A","Other primary research studies","No","No",{"$f":"COUNTIF($D$1:D639,D638)","v":299},"Government responses299","Yale School of Management's Program COVID-19 Financial Response Tracker (CFRT)","Yale School of Management's Program COVID-19 Financial Response Tracker (CFRT)Government responsesN/A"]
["Andile","Candid Philanthropic Funding Data","Analyses of primary data","N/A",null,null,null,{"$f":"COUNTIF($D$1:D640,D639)","v":300},"Analyses of primary data300","Candid Philanthropic Funding Data","Candid Philanthropic Funding DataAnalyses of primary dataN/A"]
[null,"Candid Philanthropic Funding Data","Funding opportunities","N/A",null,null,null,{"$f":"COUNTIF($D$1:D641,D640)","v":301},"Funding opportunities301","Candid Philanthropic Funding Data","Candid Philanthropic Funding DataFunding opportunitiesN/A"]
["Promise","John Hopkins Bloomberg School of Public Health","Evidence Synthesis","Rapid reviews",null,null,null,{"$f":"COUNTIF($D$1:D642,D641)","v":301},"Evidence Synthesis301","John Hopkins Bloomberg School of Public Health","John Hopkins Bloomberg School of Public HealthEvidence SynthesisRapid reviews"]
[null,"John Hopkins Bloomberg School of Public Health","Single studies","Clinical trials",null,null,null,{"$f":"COUNTIF($D$1:D643,D642)","v":45},{"$f":"C643&H643","v":"Single studies45"},{"$f":"B643","v":"John Hopkins Bloomberg School of Public Health"},{"$f":"B643&C643&D643","v":"John Hopkins Bloomberg School of Public HealthSingle studiesClinical trials"}]
[null,"Zimbabwe COVID-19 Support Hub","Government responses","N/A",null,null,null,{"$f":"COUNTIF($D$1:D644,D643)","v":30},"Government responses30","Zimbabwe COVID-19 Support Hub","Zimbabwe COVID-19 Support HubGovernment responsesN/A"]
["Irvine","Zimbabwe COVID-19 Support Hub","Government responses","N/A",null,null,null,{"$f":"COUNTIF($D$1:D645,D644)","v":303},"Government responses303","Zimbabwe COVID-19 Support Hub","Zimbabwe COVID-19 Support HubGovernment responsesN/A"]
[null,"Covid Prison Data","Expert opinions","N/A",null,null,null,{"$f":"COUNTIF($D$1:D646,D645)","v":304},"Expert opinions304","Covid Prison Data","Covid Prison DataExpert opinionsN/A"]
["Andile","Coronavirus Research Repository","Evidence Synthesis","Systematic reviews",null,null,null,{"$f":"COUNTIF($D$1:D647,D646)","v":304},"Evidence Synthesis304","Coronavirus Research Repository","Coronavirus Research RepositoryEvidence SynthesisSystematic reviews"]
[null,"Coronavirus Research Repository","Single studies","Other primary research studies",null,null,null,{"$f":"COUNTIF($D$1:D648,D647)","v":39},"Single studies39","Coronavirus Research Repository","Coronavirus Research RepositorySingle studiesOther primary research studies"]
["Andile","BioRxiv & MedRxiv","Single studies","Pre-print services",null,null,null,{"$f":"COUNTIF($D$1:D649,D648)","v":55},"Single studies55","BioRxiv & MedRxiv","BioRxiv & MedRxivSingle studiesPre-print services"]
[null,null,"Evidence Synthesis","Systematic reviews",null,null,null,{"$f":"COUNTIF($D$1:D650,D649)","v":4},"Evidence Synthesis4",0,"Evidence SynthesisSystematic reviews"]
["Promise","UNDP HDR Global Preparedness and Vulnerability Dashboard","Other ","N/A",null,null,null,{"$f":"COUNTIF($D$1:D651,D650)","v":40},"Other 40","UNDP HDR Global Preparedness and Vulnerability Dashboard","UNDP HDR Global Preparedness and Vulnerability DashboardOther N/A"]
["Nkuli","EBSCO Medical","Evidence Synthesis","Systematic reviews",null,null,null,{"$f":"COUNTIF($D$1:D652,D651)","v":305},"Evidence Synthesis305","EBSCO Medical","EBSCO MedicalEvidence SynthesisSystematic reviews"]
[null,"EBSCO Medical","Single studies","Clinical trials",null,null,null,{"$f":"COUNTIF($D$1:D653,D652)","v":41},"Single studies41","EBSCO Medical","EBSCO MedicalSingle studiesClinical trials"]
[null,"EBSCO Medical","Recommendations","Recommendations or guidance that used evidence syntheses",null,null,null,{"$f":"COUNTIF($D$1:D654,D653)","v":31},"Recommendations31","EBSCO Medical","EBSCO MedicalRecommendationsRecommendations or guidance that used evidence syntheses"]
[null,"EBSCO Medical","Recommendations","Recommendations or guidance not reporting using evidence syntheses",null,null,null,{"$f":"COUNTIF($D$1:D655,D654)","v":34},"Recommendations34","EBSCO Medical","EBSCO MedicalRecommendationsRecommendations or guidance not reporting using evidence syntheses"]
[null,"EBSCO Medical","Single studies","Other primary research studies",null,null,null,{"$f":"COUNTIF($D$1:D656,D655)","v":88},"Single studies88","EBSCO Medical","EBSCO MedicalSingle studiesOther primary research studies"]
[null,"EBSCO Medical","Evidence Synthesis","Rapid reviews",null,null,null,{"$f":"COUNTIF($D$1:D657,D656)","v":56},"Evidence Synthesis56","EBSCO Medical","EBSCO MedicalEvidence SynthesisRapid reviews"]
[null,"EBSCO Medical","Evidence Synthesis","Evidence syntheses building on systematic reviews",null,null,null,{"$f":"COUNTIF($D$1:D658,D657)","v":46},"Evidence Synthesis46","EBSCO Medical","EBSCO MedicalEvidence SynthesisEvidence syntheses building on systematic reviews"]
[null,"EBSCO Medical","Evidence Synthesis","Protocols of systematic reviews that are underway",null,null,null,{"$f":"COUNTIF($D$1:D659,D658)","v":9},"Evidence Synthesis9","EBSCO Medical","EBSCO MedicalEvidence SynthesisProtocols of systematic reviews that are underway"]
[null,"EBSCO Medical","Single studies","Protocols of single studies that are underway",null,null,null,{"$f":"COUNTIF($D$1:D660,D659)","v":10},"Single studies10","EBSCO Medical","EBSCO MedicalSingle studiesProtocols of single studies that are underway"]
["Irvine","Impact Peace Resources on Covid","Single studies","Other primary research studies",null,null,null,{"$f":"COUNTIF($D$1:D661,D660)","v":8},"Single studies8","Impact Peace Resources on Covid","Impact Peace Resources on CovidSingle studiesOther primary research studies"]
[null,"Impact Peace Resources on Covid","Recommendations","Recommendations or guidance not reporting using evidence syntheses",null,null,null,{"$f":"COUNTIF($D$1:D662,D661)","v":57},"Recommendations57","Impact Peace Resources on Covid","Impact Peace Resources on CovidRecommendationsRecommendations or guidance not reporting using evidence syntheses"]
[null,"Impact Peace Resources on Covid","Books or handbooks","N/A",null,null,null,{"$f":"COUNTIF($D$1:D663,D662)","v":89},"Books or handbooks89","Impact Peace Resources on Covid","Impact Peace Resources on CovidBooks or handbooksN/A"]
[null,"Impact Peace Resources on Covid","Expert opinions","N/A",null,null,null,{"$f":"COUNTIF($D$1:D664,D663)","v":307},"Expert opinions307","Impact Peace Resources on Covid","Impact Peace Resources on CovidExpert opinionsN/A"]
[null,"Springer Nature","Single studies","Searchable databases of single studies and often systematic reviews as well",null,null,null,{"$f":"COUNTIF($D$1:D665,D664)","v":307},"Single studies307","Springer Nature","Springer NatureSingle studiesSearchable databases of single studies and often systematic reviews as well"]
[null,"Springer Nature","Recommendations","Recommendations or guidance not reporting using evidence syntheses",null,null,null,{"$f":"COUNTIF($D$1:D666,D665)","v":6},"Recommendations6","Springer Nature","Springer NatureRecommendationsRecommendations or guidance not reporting using evidence syntheses"]
[null,"Springer Nature","Recommendations","Recommendations or guidance that used evidence syntheses",null,null,null,{"$f":"COUNTIF($D$1:D667,D666)","v":90},"Recommendations90","Springer Nature","Springer NatureRecommendationsRecommendations or guidance that used evidence syntheses"]
[null,"Springer Nature","Single studies","Protocols of single studies that are underway",null,null,null,{"$f":"COUNTIF($D$1:D668,D667)","v":35},"Single studies35","Springer Nature","Springer NatureSingle studiesProtocols of single studies that are underway"]
[null,"Springer Nature","Evidence Synthesis","Systematic reviews",null,null,null,{"$f":"COUNTIF($D$1:D669,D668)","v":9},"Evidence Synthesis9","Springer Nature","Springer NatureEvidence SynthesisSystematic reviews"]
[null,"Springer Nature","Evidence Synthesis","Rapid reviews",null,null,null,{"$f":"COUNTIF($D$1:D670,D669)","v":42},"Evidence Synthesis42","Springer Nature","Springer NatureEvidence SynthesisRapid reviews"]
[null,"Springer Nature","Analyses of primary data","Other primary research studies",null,null,null,{"$f":"COUNTIF($D$1:D671,D670)","v":47},"Analyses of primary data47","Springer Nature","Springer NatureAnalyses of primary dataOther primary research studies"]
[null,"Springer Nature","Expert opinions","N/A",null,null,null,{"$f":"COUNTIF($D$1:D672,D671)","v":58},"Expert opinions58","Springer Nature","Springer NatureExpert opinionsN/A"]
[null,"Springer Nature","Research methods","N/A",null,null,null,{"$f":"COUNTIF($D$1:D673,D672)","v":309},"Research methods309","Springer Nature","Springer NatureResearch methodsN/A"]
[null,"Springer Nature","Books or handbooks","N/A",null,null,null,{"$f":"COUNTIF($D$1:D674,D673)","v":310},"Books or handbooks310","Springer Nature","Springer NatureBooks or handbooksN/A"]
[null,"Springer Nature","Other ","Pre-print services",null,null,null,{"$f":"COUNTIF($D$1:D675,D674)","v":310},"Other 310","Springer Nature","Springer NatureOther Pre-print services"]
["Nkuli","Education Endowment Foundation","Evidence Synthesis","Rapid reviews",null,null,null,{"$f":"COUNTIF($D$1:D676,D675)","v":5},"Evidence Synthesis5","Education Endowment Foundation","Education Endowment FoundationEvidence SynthesisRapid reviews"]
[null,"Education Endowment Foundation","Recommendations","Recommendations or guidance that used evidence syntheses",null,null,null,{"$f":"COUNTIF($D$1:D677,D676)","v":48},"Recommendations48","Education Endowment Foundation","Education Endowment FoundationRecommendationsRecommendations or guidance that used evidence syntheses"]
[null,"Education Endowment Foundation","Recommendations","Recommendations or guidance not reporting using evidence syntheses",null,null,null,{"$f":"COUNTIF($D$1:D678,D677)","v":36},"Recommendations36","Education Endowment Foundation","Education Endowment FoundationRecommendationsRecommendations or guidance not reporting using evidence syntheses"]

{"sheet":"5. Decisions","index":5,"n_rows":494,"n_cols":4,"rows_kept":494,"cut":false,"hidden":true,"merged":[]}
["Person extracting","Name of Hub","Broad category"]
[null,"(USA) White House Call to Action to the Tech Community on New Machine Readable COVID-19 Dataset","Public-health measures",{"$f":"B2&C2","v":"(USA) White House Call to Action to the Tech Community on New Machine Readable COVID-19 DatasetPublic-health measures"}]
["Andile","(USA) White House Call to Action to the Tech Community on New Machine Readable COVID-19 Dataset","Clinical management",{"$f":"B3&C3","v":"(USA) White House Call to Action to the Tech Community on New Machine Readable COVID-19 DatasetClinical management"}]
["Nkuli","AEN Hub","Public-health measures","AEN HubPublic-health measures"]
[null,"African Policy Monitor","Public-health measures","African Policy MonitorPublic-health measures"]
[null,"Africaxiv","Public-health measures","AfricaxivPublic-health measures"]
[null,"Africaxiv","Clinical management","AfricaxivClinical management"]
[null,"American Chemistry Society","Clinical management","American Chemistry SocietyClinical management"]
["Irvine","American Chemistry Society","Public-health measures","American Chemistry SocietyPublic-health measures"]
[null,"American Psychological Association: Education","Public-health measures","American Psychological Association: EducationPublic-health measures"]
[null,"American Society of Microbiology","Public-health measures","American Society of MicrobiologyPublic-health measures"]
["Promise","American Society of Microbiology","Clinical management","American Society of MicrobiologyClinical management"]
["Irvine","Annals of Internal Medicine","Clinical management","Annals of Internal MedicineClinical management"]
["Andile","Annals of Internal Medicine","Public-health measures","Annals of Internal MedicinePublic-health measures"]
[null,"Antimicrobial Stewardship","Clinical management","Antimicrobial StewardshipClinical management"]
["Andile","Asian Development Bank","Public-health measures","Asian Development BankPublic-health measures"]
["Promise","AU","Public-health measures","AUPublic-health measures"]
[null,"Call for Action: COVID-19 Data Collaboratives","Public-health measures","Call for Action: COVID-19 Data CollaborativesPublic-health measures"]
["Promise","Campbell UK and Ireland","Clinical management","Campbell UK and IrelandClinical management"]
[null,"Campbell UK and Ireland","Public-health measures","Campbell UK and IrelandPublic-health measures"]
[null,"Canadian Agency for Drugs and Technologies in Health","Public-health measures","Canadian Agency for Drugs and Technologies in HealthPublic-health measures"]
[null,"CareSearch: Palliative Care Knowledge Network","Clinical management","CareSearch: Palliative Care Knowledge NetworkClinical management"]
["Andile","CareSearch: Palliative Care Knowledge Network","Public-health measures","CareSearch: Palliative Care Knowledge NetworkPublic-health measures"]
["Irvine","Cell Press Coronavirus Resource Hub","Public-health measures","Cell Press Coronavirus Resource HubPublic-health measures"]
["Irvine","Cell Press Coronavirus Resource Hub","Clinical management","Cell Press Coronavirus Resource HubClinical management"]
[null,"Centers for Disease Control and Prevention","Clinical management","Centers for Disease Control and PreventionClinical management"]
[null,"Centers for Disease Control and Prevention","Public-health measures","Centers for Disease Control and PreventionPublic-health measures"]
["Andile","CHAIN","Public-health measures","CHAINPublic-health measures"]
[null,"CHAIN","Clinical management","CHAINClinical management"]
[null,"China National Knowledge Infrastructure (CNKI)","Clinical management","China National Knowledge Infrastructure (CNKI)Clinical management"]
[null,"China National Knowledge Infrastructure (CNKI)","Public-health measures","China National Knowledge Infrastructure (CNKI)Public-health measures"]
["Irvine","Chinese Center for Disease Control and Prevention","Public-health measures","Chinese Center for Disease Control and PreventionPublic-health measures"]
["Irvine","Chinese Center for Disease Control and Prevention","Clinical management","Chinese Center for Disease Control and PreventionClinical management"]
[null,"Civic Space Watch: Solidarity amid the COVID-19 crisis","Public-health measures","Civic Space Watch: Solidarity amid the COVID-19 crisisPublic-health measures"]
["Nkuli","Cochrane Clinical Answers","Public-health measures","Cochrane Clinical AnswersPublic-health measures"]
[null,"Cochrane Clinical Answers","Clinical management","Cochrane Clinical AnswersClinical management"]
[null,"Cochrane COVID Rapid Reviews","Clinical management","Cochrane COVID Rapid ReviewsClinical management"]
[null,"Cochrane COVID Rapid Reviews","Public-health measures","Cochrane COVID Rapid ReviewsPublic-health measures"]
[null,"Cochrane Effective Practise and Organisation of Care: Task Shifting","Clinical management","Cochrane Effective Practise and Organisation of Care: Task ShiftingClinical management"]
["Andile","Cochrane ENT, Hearing & Balance","Clinical management","Cochrane ENT, Hearing & BalanceClinical management"]
[null,"Cochrane Library","Public-health measures","Cochrane LibraryPublic-health measures"]
[null,"Cochrane Library","Clinical management","Cochrane LibraryClinical management"]
["Irvine","Cochrane Oral Health","Public-health measures","Cochrane Oral HealthPublic-health measures"]
[null,"Communication Initiative","Public-health measures","Communication InitiativePublic-health measures"]
["Irvine","Conflict and Covid-19 Resource Hub","Public-health measures","Conflict and Covid-19 Resource HubPublic-health measures"]
["Irvine","Coronavirus Research Repository","Public-health measures","Coronavirus Research RepositoryPublic-health measures"]
[null,"Coronavirus Tech Handbook","Public-health measures","Coronavirus Tech HandbookPublic-health measures"]
["Irvine","Coronavirus: prison fever","Public-health measures","Coronavirus: prison feverPublic-health measures"]
["Irvine","COVID 19 ZA Dashboard","Public-health measures","COVID 19 ZA DashboardPublic-health measures"]
[null,"Covid Prison Data","Public-health measures","Covid Prison DataPublic-health measures"]
[null,"COVID Racial Data Tracker","Public-health measures","COVID Racial Data TrackerPublic-health measures"]
[null,"COVID Scholar","Public-health measures","COVID ScholarPublic-health measures"]
["Andile","COVID Scholar","Clinical management","COVID ScholarClinical management"]
["Promise","Covid19 Behaviour Tracker\n","Public-health measures","Covid19 Behaviour Tracker\nPublic-health measures"]
["Pomise","COVID-19 CoronaVirus South African Resource Portal","Public-health measures","COVID-19 CoronaVirus South African Resource PortalPublic-health measures"]
["Irvine","Covid-19 Innovations","Clinical management","Covid-19 InnovationsClinical management"]
["Irvine","Covid-19 Innovations","Public-health measures","Covid-19 InnovationsPublic-health measures"]
[null,"COVID-19 Open Research Dataset","Public-health measures","COVID-19 Open Research DatasetPublic-health measures"]
[null,"COVID-19 Research Project Tracker by UKCDR & GloPID-R","Clinical management","COVID-19 Research Project Tracker by UKCDR & GloPID-RClinical management"]
[null,"COVID-19 Research Project Tracker by UKCDR & GloPID-R","Public-health measures","COVID-19 Research Project Tracker by UKCDR & GloPID-RPublic-health measures"]
["Andile","Covidbase","Public-health measures","CovidbasePublic-health measures"]
[null,"Covidbase","Clinical management","CovidbaseClinical management"]
["Promise","Dimensions COVID-19","Public-health measures","Dimensions COVID-19Public-health measures"]
[null,"Distiller SR : Evidence Summary ","Clinical management","Distiller SR : Evidence Summary Clinical management"]
[null,"Distiller SR : Evidence Summary ","Public-health measures","Distiller SR : Evidence Summary Public-health measures"]
[null,"DynaMed","Public-health measures","DynaMedPublic-health measures"]
["Promise","EBSCO Medical","Clinical management",{"$f":"B67&C67","v":"EBSCO MedicalClinical management"}]
["Andile","EBSCO Medical","Public-health measures","EBSCO MedicalPublic-health measures"]
[null,"ECRI Guidelines Trust COVID-19 Resource Center","Clinical management","ECRI Guidelines Trust COVID-19 Resource CenterClinical management"]
["Irvine","ECRI Guidelines Trust COVID-19 Resource Center","Public-health measures","ECRI Guidelines Trust COVID-19 Resource CenterPublic-health measures"]
["Andile","Education Endowment Foundation","Public-health measures","Education Endowment FoundationPublic-health measures"]
["Andile","Elsevier Novel Coronavirus Information Center","Public-health measures","Elsevier Novel Coronavirus Information CenterPublic-health measures"]
["Irvine","Elsevier Novel Coronavirus Information Center","Clinical management","Elsevier Novel Coronavirus Information CenterClinical management"]
[null,"EPI-WIN (WHO Information for Network for Epidemics)","Clinical management","EPI-WIN (WHO Information for Network for Epidemics)Clinical management"]
[null,"EPI-WIN (WHO Information for Network for Epidemics)","Public-health measures","EPI-WIN (WHO Information for Network for Epidemics)Public-health measures"]
[null,"EPPI Mega evidence map","Public-health measures","EPPI Mega evidence mapPublic-health measures"]
["Irvine","EUI Covid Knowledge Hub","Public-health measures","EUI Covid Knowledge HubPublic-health measures"]
["Irvine","EUI Covid Knowledge Hub","Clinical management","EUI Covid Knowledge HubClinical management"]
["Irvine","European Respiratory Society","Public-health measures","European Respiratory SocietyPublic-health measures"]
["Irvine","European Respiratory Society","Clinical management","European Respiratory SocietyClinical management"]
["Andile","Evidence Aid","Clinical management","Evidence AidClinical management"]
[null,"Evidence Aid","Public-health measures","Evidence AidPublic-health measures"]
[null,"Fasken Covid 19 Knowledge","Public-health measures","Fasken Covid 19 KnowledgePublic-health measures"]
[null,"Frontiers Coronavirus Knowledge Hub","Clinical management","Frontiers Coronavirus Knowledge HubClinical management"]
["Promise","Frontiers Coronavirus Knowledge Hub","Public-health measures","Frontiers Coronavirus Knowledge HubPublic-health measures"]
[null,"George Institute","Public-health measures","George InstitutePublic-health measures"]
[null,"Ghana government","Public-health measures","Ghana governmentPublic-health measures"]
["Promise","Global Health 5050 COVID-19 sex-disaggregated data tracker","Public-health measures","Global Health 5050 COVID-19 sex-disaggregated data trackerPublic-health measures"]
[null,"Global Health Network Covid-19 Research Implementation Hub","Public-health measures","Global Health Network Covid-19 Research Implementation HubPublic-health measures"]
[null,"Global Health Network Covid-19 Research Implementation Hub","Clinical management","Global Health Network Covid-19 Research Implementation HubClinical management"]
[null,"Global overview of COVID-19: Impact on elections","Public-health measures","Global overview of COVID-19: Impact on electionsPublic-health measures"]
[null,"Global Policy Responses – Developed Markets ","Public-health measures","Global Policy Responses – Developed Markets Public-health measures"]
[null,"Google Covid-19 Community Mobility Reports","Public-health measures","Google Covid-19 Community Mobility ReportsPublic-health measures"]
["Nkuli","Government of Canada","Public-health measures","Government of CanadaPublic-health measures"]
["Andile","GovPredict Federal, State, and Local Responses to the Coronavirus\nFocus","Clinical management","GovPredict Federal, State, and Local Responses to the Coronavirus\nFocusClinical management"]
["Irvine","Guidelines Network International","Public-health measures","Guidelines Network InternationalPublic-health measures"]
[null,"GULAGECHOES","Public-health measures","GULAGECHOESPublic-health measures"]
[null,"Havard Dataverse","Public-health measures","Havard DataversePublic-health measures"]
[null,"Havard Dataverse","Clinical management","Havard DataverseClinical management"]
["Andile","Health Data Research UK","Clinical management","Health Data Research UKClinical management"]
[null,"Health Data Research UK","Public-health measures","Health Data Research UKPublic-health measures"]
["Irvine","Health Economics, Policy and Law blog series on country responses","Public-health measures","Health Economics, Policy and Law blog series on country responsesPublic-health measures"]
[null,"Health Information and Quality Authority","Public-health measures","Health Information and Quality AuthorityPublic-health measures"]
[null,"iHealthFacts","Public-health measures","iHealthFactsPublic-health measures"]
[null,"IIASA COVID-19 : Visualizing regional socioeconomic indicators for Europe","Public-health measures","IIASA COVID-19 : Visualizing regional socioeconomic indicators for EuropePublic-health measures"]
["Promise","Institute for Health Metrics and Evaluation (IHME)","Public-health measures","Institute for Health Metrics and Evaluation (IHME)Public-health measures"]
[null,"Inter-American Development Bank","Public-health measures","Inter-American Development BankPublic-health measures"]
[null,"International Centre for not-for-profit law","Public-health measures","International Centre for not-for-profit lawPublic-health measures"]
[null,"International Long Term Care Policy Network","Public-health measures","International Long Term Care Policy NetworkPublic-health measures"]
["Andile","International Long Term Care Policy Network","Clinical management","International Long Term Care Policy NetworkClinical management"]
[null,"International Monetary Fund","Public-health measures","International Monetary FundPublic-health measures"]
[null,"International Monetary Fund","Health-system arrangements","International Monetary FundHealth-system arrangements"]
[null,"International Monetary Fund","Economic and social responses","International Monetary FundEconomic and social responses"]
[null,"International Network for Government Science Advice (INGSA)","Public-health measures","International Network for Government Science Advice (INGSA)Public-health measures"]
[null,"Irish Longitudinal Study on Ageing","Public-health measures","Irish Longitudinal Study on AgeingPublic-health measures"]
[null,"John Hopkins Bloomberg School of Public Health","Clinical management","John Hopkins Bloomberg School of Public HealthClinical management"]
[null,"Johns Hopkins Medicine POC-IT Guide","Clinical management","Johns Hopkins Medicine POC-IT GuideClinical management"]
[null,"Johns Hopkins Medicine POC-IT Guide","Public-health measures","Johns Hopkins Medicine POC-IT GuidePublic-health measures"]
[null,"Johns Hopkins University and Medicine Coronavirus Resource Center","Public-health measures","Johns Hopkins University and Medicine Coronavirus Resource CenterPublic-health measures"]
["Andile","Journal of the American College of Cardiology","Clinical management","Journal of the American College of CardiologyClinical management"]
["Promise","Kaggle","Clinical management","KaggleClinical management"]
["Andile","Kaggle","Public-health measures","KagglePublic-health measures"]
[null,"Kentucky’s response to COVID-19","Public-health measures","Kentucky’s response to COVID-19Public-health measures"]
[null,"Kentucky’s response to COVID-20","Public-health measures","Kentucky’s response to COVID-20Public-health measures"]
["Andile","Kentucky’s response to COVID-21","Public-health measures","Kentucky’s response to COVID-21Public-health measures"]
[null,"Kentucky’s response to COVID-22","Public-health measures","Kentucky’s response to COVID-22Public-health measures"]
[null,"Kentucky’s response to COVID-23","Public-health measures","Kentucky’s response to COVID-23Public-health measures"]
[null,"Kenyan government","Public-health measures","Kenyan governmentPublic-health measures"]
[null,"Knowledge to Policy Center, American University of Beirut","Public-health measures","Knowledge to Policy Center, American University of BeirutPublic-health measures"]
["Andile","Knowledge to Policy Center, American University of Beirut","Clinical management","Knowledge to Policy Center, American University of BeirutClinical management"]
["Irvine","LANCET COVID-19 Resource Centre","Public-health measures",{"$f":"B131&C131","v":"LANCET COVID-19 Resource CentrePublic-health measures"}]
["Irvine","LANCET COVID-19 Resource Centre","Clinical management","LANCET COVID-19 Resource CentreClinical management"]
["Irvine","Love Platform","Clinical management","Love PlatformClinical management"]
["Irvine","Love Platform","Public-health measures","Love PlatformPublic-health measures"]
[null,"MAGICapp","Clinical management","MAGICappClinical management"]
["Irvine","Makerere University","Public-health measures","Makerere UniversityPublic-health measures"]
[null,"McMaster COVID-19 evidence","Public-health measures","McMaster COVID-19 evidencePublic-health measures"]
[null,"McMaster Daily News","Public-health measures","McMaster Daily NewsPublic-health measures"]
["Nkuli","MCMaster National Collaborating Centre for Methods and Tools : Canada","Public-health measures","MCMaster National Collaborating Centre for Methods and Tools : CanadaPublic-health measures"]
["Andile","McMaster Optimal Aging Portal","Public-health measures","McMaster Optimal Aging PortalPublic-health measures"]
["Irvine","McMasterer Plus","Clinical management","McMasterer PlusClinical management"]
["Andile","McMasterer Plus","Public-health measures","McMasterer PlusPublic-health measures"]
["Andile","National COVID-19 Living Evidence Task Force","Clinical management","National COVID-19 Living Evidence Task ForceClinical management"]
["Irvine","National COVID-19 Living Evidence Task Force","Public-health measures","National COVID-19 Living Evidence Task ForcePublic-health measures"]
[null,"National Institute for Health and Care Excellence","Public-health measures","National Institute for Health and Care ExcellencePublic-health measures"]
[null,"National Institute for Health and Care Excellence","Clinical management","National Institute for Health and Care ExcellenceClinical management"]
[null,"National Institutes of Health treatment guidelines","Clinical management","National Institutes of Health treatment guidelinesClinical management"]
["Irvine","NEJM's Coronavirus (Covid-19)","Public-health measures","NEJM's Coronavirus (Covid-19)Public-health measures"]
[null,"New England Journal of Medicine","Clinical management","New England Journal of MedicineClinical management"]
[null,"NICD","Public-health measures","NICDPublic-health measures"]
[null,"NICD","Clinical management","NICDClinical management"]
["Andile","Nigerian government","Public-health measures","Nigerian governmentPublic-health measures"]
[null,"Nigerian government","Clinical management","Nigerian governmentClinical management"]
[null,"NMA","Clinical management","NMAClinical management"]
["Irvine","Norwegian Institute of Public Health","Public-health measures","Norwegian Institute of Public HealthPublic-health measures"]
[null,"Norwegian Institute of Public Health","Clinical management","Norwegian Institute of Public HealthClinical management"]
[null,"OECD Cities responses","Public-health measures","OECD Cities responsesPublic-health measures"]
[null,"OECD Country Policy Tracker","Public-health measures","OECD Country Policy TrackerPublic-health measures"]
[null,"OECD Employment & Social policy responses by country","Public-health measures","OECD Employment & Social policy responses by countryPublic-health measures"]
[null,"OECD Health System Response Tracker","Public-health measures","OECD Health System Response TrackerPublic-health measures"]
["Nkuli","OECD Health System Response Tracker","Clinical management","OECD Health System Response TrackerClinical management"]
[null,"OECD Multilevel Governance","Public-health measures","OECD Multilevel GovernancePublic-health measures"]
["Irvine","OECD SME Policy Responses","Public-health measures","OECD SME Policy ResponsesPublic-health measures"]
["Andile","OECD Tourism Summary","Public-health measures","OECD Tourism SummaryPublic-health measures"]
["Irvine","Ontario Hospital Association","Public-health measures","Ontario Hospital AssociationPublic-health measures"]
[null,"Ontario Ministry of Health","Public-health measures","Ontario Ministry of HealthPublic-health measures"]
["Nkuli","Ontario Ministry of Health ,Ministry of Long-Term Care","Public-health measures","Ontario Ministry of Health ,Ministry of Long-Term CarePublic-health measures"]
[null,"Open COVID-19 policy dataset","Public-health measures","Open COVID-19 policy datasetPublic-health measures"]
[null,"Our World In data Policy Responses to the Coronavirus Pandemic","Public-health measures","Our World In data Policy Responses to the Coronavirus PandemicPublic-health measures"]
[null,"Oxford Government response tracker","Public-health measures","Oxford Government response trackerPublic-health measures"]
[null,"Oxford Government response tracker","Economic and social responses","Oxford Government response trackerEconomic and social responses"]
[null,"Oxford Government response tracker","Clinical management","Oxford Government response trackerClinical management"]
[null,"Pan American Health Organization","Public-health measures","Pan American Health OrganizationPublic-health measures"]
["Andile","Prison Policy Initiative","Public-health measures","Prison Policy InitiativePublic-health measures"]
[null,"PROSPERO","Public-health measures","PROSPEROPublic-health measures"]
[null,"PROSPERO","Clinical management","PROSPEROClinical management"]
["Irvine","Public Health England","Public-health measures","Public Health EnglandPublic-health measures"]
["Nkuli","Public Health Ontario","Public-health measures","Public Health OntarioPublic-health measures"]
[null,"Regional Educational Laboratories (RELs)","Public-health measures","Regional Educational Laboratories (RELs)Public-health measures"]
["Irvine","SAGE","Public-health measures","SAGEPublic-health measures"]
["Andile","Santé Public France","Public-health measures","Santé Public FrancePublic-health measures"]
["Promise","Santé Public France","Clinical management","Santé Public FranceClinical management"]
["Irvine","SocArxi Corona Net","Public-health measures","SocArxi Corona NetPublic-health measures"]
[null,"Social Science in Humanitarian Action","Public-health measures","Social Science in Humanitarian ActionPublic-health measures"]
[null,"Society of Critical Care Medicine","Clinical management","Society of Critical Care MedicineClinical management"]
[null,"Society of Critical Care Medicine","Public-health measures","Society of Critical Care MedicinePublic-health measures"]
["Nkuli","SPOR Evidence Alliance","Clinical management","SPOR Evidence AllianceClinical management"]
[null,"Springer Nature","Public-health measures","Springer NaturePublic-health measures"]
[null,"Springer Nature","Clinical management","Springer NatureClinical management"]
["Andile","The Marshall Project Coronavirus Tracker","Public-health measures","The Marshall Project Coronavirus TrackerPublic-health measures"]
["Irvine","Turning Research Into Practice (TRIP)","Clinical management","Turning Research Into Practice (TRIP)Clinical management"]
[null,"Turning Research Into Practice (TRIP)","Public-health measures","Turning Research Into Practice (TRIP)Public-health measures"]
["Promise","U.S. National Institutes of Health","Public-health measures","U.S. National Institutes of HealthPublic-health measures"]
[null,"U.S. Veterans’ Affairs (VA) Evidence Synthesis Program","Clinical management","U.S. Veterans’ Affairs (VA) Evidence Synthesis ProgramClinical management"]
[null,"U.S. Veterans’ Affairs (VA) Evidence Synthesis Program","Public-health measures",{"$f":"B195&C195","v":"U.S. Veterans’ Affairs (VA) Evidence Synthesis ProgramPublic-health measures"}]
[null,"UCLA Law Covid-19 Behind Bars Data Project","Public-health measures","UCLA Law Covid-19 Behind Bars Data ProjectPublic-health measures"]
[null,"UK government","Public-health measures","UK governmentPublic-health measures"]
["Irvine","UK government","Clinical management","UK governmentClinical management"]
[null,"UK Government (Previously put as DFID)","Public-health measures","UK Government (Previously put as DFID)Public-health measures"]
["Nkuli","UK Government (Previously put as DFID)","Clinical management","UK Government (Previously put as DFID)Clinical management"]
[null,"UN Habitat","Public-health measures","UN HabitatPublic-health measures"]
[null,"UN International Labour Organisation(ILO)","Public-health measures","UN International Labour Organisation(ILO)Public-health measures"]
[null,"United Nations Office for the Coordination of Humanitarian Affairs","Public-health measures","United Nations Office for the Coordination of Humanitarian AffairsPublic-health measures"]
[null,"Vera Institute of Justice","Public-health measures","Vera Institute of JusticePublic-health measures"]
[null,"VHL Regional Portal","Public-health measures","VHL Regional PortalPublic-health measures"]
[null,"VHL Regional Portal","Clinical management","VHL Regional PortalClinical management"]
[null,"WHO Global research on coronavirus disease (COVID-19)","Public-health measures","WHO Global research on coronavirus disease (COVID-19)Public-health measures"]
[null,"WHO Global research on coronavirus disease (COVID-19)","Clinical management","WHO Global research on coronavirus disease (COVID-19)Clinical management"]
["Irvine","WHO R & D","Public-health measures","WHO R & DPublic-health measures"]
["Promise","WHO R & D","Clinical management","WHO R & DClinical management"]
["Promise","WHO Regional Office for Europe (technical guidance)","Public-health measures","WHO Regional Office for Europe (technical guidance)Public-health measures"]
["Promise","WHO Regional Office for Europe (technical guidance)","Clinical management","WHO Regional Office for Europe (technical guidance)Clinical management"]
[null,"Wiley Covid-19: Novel Coronavirus Outbreak","Clinical management","Wiley Covid-19: Novel Coronavirus OutbreakClinical management"]
["Promise","Wiley Covid-19: Novel Coronavirus Outbreak","Public-health measures","Wiley Covid-19: Novel Coronavirus OutbreakPublic-health measures"]
[null,"Wits Hub","Public-health measures","Wits HubPublic-health measures"]
[null,"Wolters Kluwer Global Infectious Diseases and Epidemiology Online Network (GIDEON)","Clinical management","Wolters Kluwer Global Infectious Diseases and Epidemiology Online Network (GIDEON)Clinical management"]
["Andile","Wolters Kluwer Global Infectious Diseases and Epidemiology Online Network (GIDEON)","Public-health measures","Wolters Kluwer Global Infectious Diseases and Epidemiology Online Network (GIDEON)Public-health measures"]
[null,"World Bank Education","Public-health measures","World Bank EducationPublic-health measures"]
[null,"World Health Organization (WHO) technical guidelines","Public-health measures","World Health Organization (WHO) technical guidelinesPublic-health measures"]
["Andile","World Pandemic Research Network (WPRN) ","Public-health measures","World Pandemic Research Network (WPRN) Public-health measures"]
[null,"World Pandemic Research Network (WPRN) ","Clinical management","World Pandemic Research Network (WPRN) Clinical management"]
[null,"Zimbabwe COVID-19 Support Hub","Public-health measures","Zimbabwe COVID-19 Support HubPublic-health measures"]
[]
["Promise"]
[]
[]
[]
[]
["Andile"]
[]
[]
["Promise"]
["Andile"]
["Promise"]
[]
[]
[]
["Promise"]
[]
[]
[]
[]
["Andile"]
[]
[]
[]
["Irvine"]
[]
[]
[]
[]
[]
["Irvine"]
["Promise"]
[]
[]
[]
["Irvine"]
[]
[]
[]
[]
["Andile"]
[]
[]
[]
["Irvine"]
[]
[]
[]
[]
["Promise"]
[]
[]
["Irvine"]
[]
[]
[]
["Andile"]
[]
[]
[]
["Promise"]
[]
[]
[]
["Promise"]
[]
[]
[]
[]
["Andile"]
[]
["Andile"]
[]
[]
["Andile"]
[]
[]
["Irvine"]
[]
[]
["Irvine"]
[]
[]
["Andile"]
["Irvine"]
[]
[]
[]
[]
["Andile"]
[]
["Andile"]
[]
[]
[]
[]
[]
[]
["Promise"]
[]
["Nkuli"]
[]
[]
[]
["Irvine"]
[]
[]
[]
[]
["Andile"]
[]
[]
["Promise"]
[]
[]
[]
["Andile"]
[]
[]
[]
["Promise"]
[]
[]
[]
[]
["Irvine"]
["Irvine"]
[]
["Nkuli"]
[]
[]
["Andile"]
[]
[]
[]
["Nkuli"]
["Nkuli"]
[]
[]
[]
[]
["Andile"]
[]
["Promise"]
[]
["Nkuli"]
[]
[]
[]
[]
[]
["Nkuli"]
[]
["Andile"]
["Irvine"]
[]
[]
["Andile"]
["Promise"]
[]
["Irvine"]
[]
[]
[]
["Promise"]
[]
[]
[]
[]
["Irvine"]
[]
[]
[]
[]
[]
[]
["Promise"]
["Nkuli"]
["Andile"]
["Nkuli"]
["Nkuli"]
[]
[]
[]
[]
[]
[]
["Andile"]
[]
[]
["Nkuli"]
[]
[]
[]
[]
[]
[]
[]
["Irvine"]
[]
[]
[]
[]
["Andile"]
["Nkuli"]
[]
[]
[]
["Nkuli"]
["Promise"]
[]
[]
[]
[]
["Nkuli"]
[]
[]
[]
[]
["Andile"]
["Irvine"]
[]
[]
[]
["Promise"]
[]
[]
["Nkuli"]
[]
[]
[]
["Irvine"]
[]
[]
["Nkuli"]
[]
["Andile"]
[]
["Andile"]
["Nkuli"]
[]
["Irvine"]
[]
["Nkuli"]
[]
[]
["Andile"]
[]
["Nkuli"]
[]
[]
[]
[]
[]
["Nkuli"]
["Promise"]
["Andile"]
[]
[]
["Irvine"]
["Nkuli"]
[]
[]
[]
[]
[]
[]
[]
[]
[]
[]
["Nkuli"]

{"sheet":"6. Sector","index":6,"n_rows":365,"n_cols":7,"rows_kept":365,"cut":false,"hidden":true,"merged":[]}
["Person extracting","Name of Hub","Sectors",null,"Key"]
["Andile","World Bank","Economic development and growth",{"$f":"COUNTIF($C$1:C2,C2)","v":1},{"$f":"C2&D2","v":"Economic development and growth1"},{"$f":"B2","v":"World Bank"},{"$f":"B2&C2","v":"World BankEconomic development and growth"}]
[null,"World Bank","Education",{"$f":"COUNTIF($C$1:C3,C3)","v":1},{"$f":"C3&D3","v":"Education1"},{"$f":"B3","v":"World Bank"},{"$f":"B3&C3","v":"World BankEducation"}]
[null,"World Bank","Food safety and security",{"$f":"COUNTIF($C$1:C4,C4)","v":1},"Food safety and security1","World Bank","World BankFood safety and security"]
[null,"World Bank","Financial protection",{"$f":"COUNTIF($C$1:C5,C5)","v":1},"Financial protection1","World Bank","World BankFinancial protection"]
["Nkuli","AEN Hub","Economic development and growth",{"$f":"COUNTIF($C$1:C6,C6)","v":2},"Economic development and growth2","AEN Hub","AEN HubEconomic development and growth"]
[null,"AEN Hub","Health",{"$f":"COUNTIF($C$1:C7,C7)","v":1},"Health1","AEN Hub","AEN HubHealth"]
[null,"AEN Hub","Community and social services",{"$f":"COUNTIF($C$1:C8,C8)","v":1},"Community and social services1","AEN Hub","AEN HubCommunity and social services"]
[null,"AEN Hub","Government services",{"$f":"COUNTIF($C$1:C9,C9)","v":1},"Government services1","AEN Hub","AEN HubGovernment services"]
["Irvine","Covidbase","Economic development and growth",{"$f":"COUNTIF($C$1:C10,C10)","v":3},"Economic development and growth3","Covidbase","CovidbaseEconomic development and growth"]
[null,"Covidbase","Health",{"$f":"COUNTIF($C$1:C11,C11)","v":2},"Health2","Covidbase","CovidbaseHealth"]
[null,"Covidbase","Community and social services",{"$f":"COUNTIF($C$1:C12,C12)","v":2},"Community and social services2","Covidbase","CovidbaseCommunity and social services"]
["Nkuli","USAID","Economic development and growth",{"$f":"COUNTIF($C$1:C13,C13)","v":4},"Economic development and growth4","USAID","USAIDEconomic development and growth"]
["Promise","Johns Hopkins University and Medicine Coronavirus Resource Center","Health",{"$f":"COUNTIF($C$1:C14,C14)","v":3},"Health3","Johns Hopkins University and Medicine Coronavirus Resource Center","Johns Hopkins University and Medicine Coronavirus Resource CenterHealth"]
["Nkuli","UNDP COVID 19 Dashboard","Economic development and growth",{"$f":"COUNTIF($C$1:C15,C15)","v":5},"Economic development and growth5","UNDP COVID 19 Dashboard","UNDP COVID 19 DashboardEconomic development and growth"]
[null,"UNDP COVID 19 Dashboard","Government services",{"$f":"COUNTIF($C$1:C16,C16)","v":2},"Government services2","UNDP COVID 19 Dashboard","UNDP COVID 19 DashboardGovernment services"]
[null,"UNDP COVID 19 Dashboard","Culture and gender",{"$f":"COUNTIF($C$1:C17,C17)","v":1},"Culture and gender1","UNDP COVID 19 Dashboard","UNDP COVID 19 DashboardCulture and gender"]
["Andile","International Monetory Fund","Economic development and growth",{"$f":"COUNTIF($C$1:C18,C18)","v":6},"Economic development and growth6","International Monetory Fund","International Monetory FundEconomic development and growth"]
[null,"International Monetory Fund","Education",{"$f":"COUNTIF($C$1:C19,C19)","v":2},"Education2","International Monetory Fund","International Monetory FundEducation"]
[null,"International Monetory Fund","Financial protection",{"$f":"COUNTIF($C$1:C20,C20)","v":2},"Financial protection2","International Monetory Fund","International Monetory FundFinancial protection"]
[null,"International Monetory Fund","Health",{"$f":"COUNTIF($C$1:C21,C21)","v":4},"Health4","International Monetory Fund","International Monetory FundHealth"]
["Nkuli","UN Habitat","Culture and gender",{"$f":"COUNTIF($C$1:C22,C22)","v":2},"Culture and gender2","UN Habitat","UN HabitatCulture and gender"]
[null,"UN Habitat","Community and social services",{"$f":"COUNTIF($C$1:C23,C23)","v":3},"Community and social services3","UN Habitat","UN HabitatCommunity and social services"]
[null,"UN Habitat","Housing",{"$f":"COUNTIF($C$1:C24,C24)","v":1},"Housing1","UN Habitat","UN HabitatHousing"]
[null,"UN Habitat","Government services",{"$f":"COUNTIF($C$1:C25,C25)","v":3},"Government services3","UN Habitat","UN HabitatGovernment services"]
["Nkuli","Inter-American Development Bank","Health",{"$f":"COUNTIF($C$1:C26,C26)","v":5},"Health5","Inter-American Development Bank","Inter-American Development BankHealth"]
[null,"Inter-American Development Bank","Culture and gender",{"$f":"COUNTIF($C$1:C27,C27)","v":3},"Culture and gender3","Inter-American Development Bank","Inter-American Development BankCulture and gender"]
[null,"Inter-American Development Bank","Community and social services",{"$f":"COUNTIF($C$1:C28,C28)","v":4},"Community and social services4","Inter-American Development Bank","Inter-American Development BankCommunity and social services"]
[null,"Inter-American Development Bank","Government services",{"$f":"COUNTIF($C$1:C29,C29)","v":4},"Government services4","Inter-American Development Bank","Inter-American Development BankGovernment services"]
["Promise","Cochrane library","Health",{"$f":"COUNTIF($C$1:C30,C30)","v":6},"Health6","Cochrane library","Cochrane libraryHealth"]
["Andile","Oxford Government response tracker","Transportation",{"$f":"COUNTIF($C$1:C31,C31)","v":1},"Transportation1","Oxford Government response tracker","Oxford Government response trackerTransportation"]
[null,"Oxford Government response tracker","Health",{"$f":"COUNTIF($C$1:C32,C32)","v":7},"Health7","Oxford Government response tracker","Oxford Government response trackerHealth"]
[null,"Oxford Government response tracker","Education",{"$f":"COUNTIF($C$1:C33,C33)","v":3},"Education3","Oxford Government response tracker","Oxford Government response trackerEducation"]
["Andile","UNICEF","Financial protection",{"$f":"COUNTIF($C$1:C34,C34)","v":3},"Financial protection3","UNICEF","UNICEFFinancial protection"]
[null,"UNICEF","Public safety and justice",{"$f":"COUNTIF($C$1:C35,C35)","v":1},"Public safety and justice1","UNICEF","UNICEFPublic safety and justice"]
[null,"UNICEF","Education",{"$f":"COUNTIF($C$1:C36,C36)","v":4},"Education4","UNICEF","UNICEFEducation"]
[null,"UNICEF","Children and youth services",{"$f":"COUNTIF($C$1:C37,C37)","v":1},"Children and youth services1","UNICEF","UNICEFChildren and youth services"]
["Nkuli","National Institute for Health and Care Excellence","Health",{"$f":"COUNTIF($C$1:C38,C38)","v":8},"Health8","National Institute for Health and Care Excellence","National Institute for Health and Care ExcellenceHealth"]
["Andile","UNEP","Climate action",{"$f":"COUNTIF($C$1:C39,C39)","v":1},"Climate action1","UNEP","UNEPClimate action"]
[null,"UNEP","Environmental conservation",{"$f":"COUNTIF($C$1:C40,C40)","v":1},"Environmental conservation1","UNEP","UNEPEnvironmental conservation"]
[null,"UNEP","Natural resources",{"$f":"COUNTIF($C$1:C41,C41)","v":1},"Natural resources1","UNEP","UNEPNatural resources"]
["Andile","Norwegian Institute of Public Health","Health",{"$f":"COUNTIF($C$1:C42,C42)","v":9},"Health9","Norwegian Institute of Public Health","Norwegian Institute of Public HealthHealth"]
["Promise","OECD Country Policy Tracker","Economic development and growth",{"$f":"COUNTIF($C$1:C43,C43)","v":7},"Economic development and growth7","OECD Country Policy Tracker","OECD Country Policy TrackerEconomic development and growth"]
[null,"OECD Country Policy Tracker","Education",{"$f":"COUNTIF($C$1:C44,C44)","v":5},"Education5","OECD Country Policy Tracker","OECD Country Policy TrackerEducation"]
[null,"OECD Country Policy Tracker","Financial protection",{"$f":"COUNTIF($C$1:C45,C45)","v":4},"Financial protection4","OECD Country Policy Tracker","OECD Country Policy TrackerFinancial protection"]
[null,"OECD Country Policy Tracker","Health",{"$f":"COUNTIF($C$1:C46,C46)","v":10},"Health10","OECD Country Policy Tracker","OECD Country Policy TrackerHealth"]
["Nkuli","OECD Health System Response Tracker","Health",{"$f":"COUNTIF($C$1:C47,C47)","v":11},"Health11","OECD Health System Response Tracker","OECD Health System Response TrackerHealth"]
[null,"OECD Health System Response Tracker","Government services",{"$f":"COUNTIF($C$1:C48,C48)","v":5},"Government services5","OECD Health System Response Tracker","OECD Health System Response TrackerGovernment services"]
["Andile","OECD Tax policy responses by country","Economic development and growth",{"$f":"COUNTIF($C$1:C49,C49)","v":8},"Economic development and growth8","OECD Tax policy responses by country","OECD Tax policy responses by countryEconomic development and growth"]
[null,"OECD Tax policy responses by country","Financial protection",{"$f":"COUNTIF($C$1:C50,C50)","v":5},"Financial protection5","OECD Tax policy responses by country","OECD Tax policy responses by countryFinancial protection"]
["Pomise","OECD Employment & Social policy responses by country","Economic development and growth",{"$f":"COUNTIF($C$1:C51,C51)","v":9},"Economic development and growth9","OECD Employment & Social policy responses by country","OECD Employment & Social policy responses by countryEconomic development and growth"]
[null,"OECD Employment & Social policy responses by country","Financial protection",{"$f":"COUNTIF($C$1:C52,C52)","v":6},"Financial protection6","OECD Employment & Social policy responses by country","OECD Employment & Social policy responses by countryFinancial protection"]
[null,"OECD Employment & Social policy responses by country","Community and social services",{"$f":"COUNTIF($C$1:C53,C53)","v":5},"Community and social services5","OECD Employment & Social policy responses by country","OECD Employment & Social policy responses by countryCommunity and social services"]
[null,"OECD Employment & Social policy responses by country","Employment",{"$f":"COUNTIF($C$1:C54,C54)","v":1},"Employment1","OECD Employment & Social policy responses by country","OECD Employment & Social policy responses by countryEmployment"]
["Irvine","Yale School of Management's Program COVID-19 Financial Response Tracker (CFRT)","Financial protection",{"$f":"COUNTIF($C$1:C55,C55)","v":7},"Financial protection7","Yale School of Management's Program COVID-19 Financial Response Tracker (CFRT)","Yale School of Management's Program COVID-19 Financial Response Tracker (CFRT)Financial protection"]
["Irvine","Yale School of Management's Program COVID-19 Financial Response Tracker (CFRT)","Economic development and growth",{"$f":"COUNTIF($C$1:C56,C56)","v":10},"Economic development and growth10","Yale School of Management's Program COVID-19 Financial Response Tracker (CFRT)","Yale School of Management's Program COVID-19 Financial Response Tracker (CFRT)Economic development and growth"]
["Nkuli","Cochrane Clinical Answers","Health",{"$f":"COUNTIF($C$1:C57,C57)","v":12},"Health12","Cochrane Clinical Answers","Cochrane Clinical AnswersHealth"]
["Irvine","Centers for Disease Control and Prevention","Health",{"$f":"COUNTIF($C$1:C58,C58)","v":13},"Health13","Centers for Disease Control and Prevention","Centers for Disease Control and PreventionHealth"]
["Irvine","UNICEF","Children and youth services",{"$f":"COUNTIF($C$1:C59,C59)","v":2},"Children and youth services2","UNICEF","UNICEFChildren and youth services"]
["Irvine","UN Food and Agriculture Organisation(FAO)","Food safety and security",{"$f":"COUNTIF($C$1:C60,C60)","v":2},"Food safety and security2","UN Food and Agriculture Organisation(FAO)","UN Food and Agriculture Organisation(FAO)Food safety and security"]
["Andile","Evidence aid","Health",{"$f":"COUNTIF($C$1:C61,C61)","v":14},"Health14","Evidence aid","Evidence aidHealth"]
["Nkuli","Cochrane Effective Practise and Organisation of Care: Task Shifting","Health",{"$f":"COUNTIF($C$1:C62,C62)","v":15},"Health15","Cochrane Effective Practise and Organisation of Care: Task Shifting","Cochrane Effective Practise and Organisation of Care: Task ShiftingHealth"]
["Promise","UN International Labour Organisation(ILO)","Economic development and growth",{"$f":"COUNTIF($C$1:C63,C63)","v":11},"Economic development and growth11","UN International Labour Organisation(ILO)","UN International Labour Organisation(ILO)Economic development and growth"]
[null,"UN International Labour Organisation(ILO)","Financial protection",{"$f":"COUNTIF($C$1:C64,C64)","v":8},"Financial protection8","UN International Labour Organisation(ILO)","UN International Labour Organisation(ILO)Financial protection"]
["Nkuli","McMaster Daily News","Education",{"$f":"COUNTIF($C$1:C65,C65)","v":6},"Education6","McMaster Daily News","McMaster Daily NewsEducation"]
["Andile","COVID-19 Research Project Tracker by UKCDR & GloPID-R","Health",{"$f":"COUNTIF($C$1:C66,C66)","v":16},"Health16","COVID-19 Research Project Tracker by UKCDR & GloPID-R","COVID-19 Research Project Tracker by UKCDR & GloPID-RHealth"]
["Andile","UNESCO COVID-19","Education",{"$f":"COUNTIF($C$1:C67,C67)","v":7},{"$f":"C67&D67","v":"Education7"},{"$f":"B67","v":"UNESCO COVID-19"},{"$f":"B67&C67","v":"UNESCO COVID-19Education"}]
["Andile","Cochrane COVID Rapid Reviews","Health",{"$f":"COUNTIF($C$1:C68,C68)","v":17},"Health17","Cochrane COVID Rapid Reviews","Cochrane COVID Rapid ReviewsHealth"]
["Irvine","UK Government (Previously put as DFID)","Health",{"$f":"COUNTIF($C$1:C69,C69)","v":18},"Health18","UK Government (Previously put as DFID)","UK Government (Previously put as DFID)Health"]
["Irvine","Kentucky’s response to COVID-23","Health",{"$f":"COUNTIF($C$1:C70,C70)","v":19},"Health19","Kentucky’s response to COVID-23","Kentucky’s response to COVID-23Health"]
["Andile","Johns Hopkins University and Medicine Coronavirus Resource Center","Health",{"$f":"COUNTIF($C$1:C71,C71)","v":20},"Health20","Johns Hopkins University and Medicine Coronavirus Resource Center","Johns Hopkins University and Medicine Coronavirus Resource CenterHealth"]
["Andile","Johns Hopkins Medicine POC-IT Guide","Health",{"$f":"COUNTIF($C$1:C72,C72)","v":21},"Health21","Johns Hopkins Medicine POC-IT Guide","Johns Hopkins Medicine POC-IT GuideHealth"]
["Andile","VHL Regional Portal","Health",{"$f":"COUNTIF($C$1:C73,C73)","v":22},"Health22","VHL Regional Portal","VHL Regional PortalHealth"]
["Andile","Pan American Health Organization","Health",{"$f":"COUNTIF($C$1:C74,C74)","v":23},"Health23","Pan American Health Organization","Pan American Health OrganizationHealth"]
["Promise","AU","Health",{"$f":"COUNTIF($C$1:C75,C75)","v":24},"Health24","AU","AUHealth"]
["Promise","NMA","Health",{"$f":"COUNTIF($C$1:C76,C76)","v":25},"Health25","NMA","NMAHealth"]
["Andile","McMaster COVID-19 evidence","Health",{"$f":"COUNTIF($C$1:C77,C77)","v":26},"Health26","McMaster COVID-19 evidence","McMaster COVID-19 evidenceHealth"]
["Irvine","Social Science in Humanitarian Action","Community and social services",{"$f":"COUNTIF($C$1:C78,C78)","v":6},"Community and social services6","Social Science in Humanitarian Action","Social Science in Humanitarian ActionCommunity and social services"]
["Promise","EPI-WIN (WHO Information for Network for Epidemics)","Health",{"$f":"COUNTIF($C$1:C79,C79)","v":27},"Health27","EPI-WIN (WHO Information for Network for Epidemics)","EPI-WIN (WHO Information for Network for Epidemics)Health"]
["Andile","Ontario Ministry of Health","Health",{"$f":"COUNTIF($C$1:C80,C80)","v":28},"Health28","Ontario Ministry of Health","Ontario Ministry of HealthHealth"]
["Irvine","Hewlett Foundation","Financial protection",{"$f":"COUNTIF($C$1:C81,C81)","v":9},"Financial protection9","Hewlett Foundation","Hewlett FoundationFinancial protection"]
["Andile","EPPI Mega evidence map","Health",{"$f":"COUNTIF($C$1:C82,C82)","v":29},"Health29","EPPI Mega evidence map","EPPI Mega evidence mapHealth"]
["Andile","Economics for Inclusive Prosperity (Econflip)","Financial protection",{"$f":"COUNTIF($C$1:C83,C83)","v":10},"Financial protection10","Economics for Inclusive Prosperity (Econflip)","Economics for Inclusive Prosperity (Econflip)Financial protection"]
[null,"Economics for Inclusive Prosperity (Econflip)","Employment",{"$f":"COUNTIF($C$1:C84,C84)","v":2},"Employment2","Economics for Inclusive Prosperity (Econflip)","Economics for Inclusive Prosperity (Econflip)Employment"]
[null,"Economics for Inclusive Prosperity (Econflip)","Economic development and growth",{"$f":"COUNTIF($C$1:C85,C85)","v":12},"Economic development and growth12","Economics for Inclusive Prosperity (Econflip)","Economics for Inclusive Prosperity (Econflip)Economic development and growth"]
[null,"Economics for Inclusive Prosperity (Econflip)","Health",{"$f":"COUNTIF($C$1:C86,C86)","v":30},"Health30","Economics for Inclusive Prosperity (Econflip)","Economics for Inclusive Prosperity (Econflip)Health"]
["Andile","Our World in Data Coronavirus Disease (COVID-19)","Health",{"$f":"COUNTIF($C$1:C87,C87)","v":31},"Health31","Our World in Data Coronavirus Disease (COVID-19)","Our World in Data Coronavirus Disease (COVID-19)Health"]
["Andile","COVID-19 CoronaVirus South African Resource Portal","Health",{"$f":"COUNTIF($C$1:C88,C88)","v":32},"Health32","COVID-19 CoronaVirus South African Resource Portal","COVID-19 CoronaVirus South African Resource PortalHealth"]
[null,"COVID-19 CoronaVirus South African Resource Portal","Financial protection",{"$f":"COUNTIF($C$1:C89,C89)","v":11},"Financial protection11","COVID-19 CoronaVirus South African Resource Portal","COVID-19 CoronaVirus South African Resource PortalFinancial protection"]
[null,"COVID-19 CoronaVirus South African Resource Portal","Education",{"$f":"COUNTIF($C$1:C90,C90)","v":8},"Education8","COVID-19 CoronaVirus South African Resource Portal","COVID-19 CoronaVirus South African Resource PortalEducation"]
[null,"COVID-19 CoronaVirus South African Resource Portal","Transportation",{"$f":"COUNTIF($C$1:C91,C91)","v":2},"Transportation2","COVID-19 CoronaVirus South African Resource Portal","COVID-19 CoronaVirus South African Resource PortalTransportation"]
["Andile","China National Knowledge Infrastructure (CNKI)","Health",{"$f":"COUNTIF($C$1:C92,C92)","v":33},"Health33","China National Knowledge Infrastructure (CNKI)","China National Knowledge Infrastructure (CNKI)Health"]
["Irvine","Kenyan government","Government services",{"$f":"COUNTIF($C$1:C93,C93)","v":6},"Government services6","Kenyan government","Kenyan governmentGovernment services"]
["Andile","Elrha","Health",{"$f":"COUNTIF($C$1:C94,C94)","v":34},"Health34","Elrha","ElrhaHealth"]
["Irvine","Public Health Ontario","Health",{"$f":"COUNTIF($C$1:C95,C95)","v":35},"Health35","Public Health Ontario","Public Health OntarioHealth"]
[null,"Public Health Ontario","Community and social services",{"$f":"COUNTIF($C$1:C96,C96)","v":7},"Community and social services7","Public Health Ontario","Public Health OntarioCommunity and social services"]
[null,"Public Health Ontario","Government services",{"$f":"COUNTIF($C$1:C97,C97)","v":7},"Government services7","Public Health Ontario","Public Health OntarioGovernment services"]
["Andile","(USA) White House Call to Action to the Tech Community on New Machine Readable COVID-19 Dataset","Health",{"$f":"COUNTIF($C$1:C98,C98)","v":36},"Health36","(USA) White House Call to Action to the Tech Community on New Machine Readable COVID-19 Dataset","(USA) White House Call to Action to the Tech Community on New Machine Readable COVID-19 DatasetHealth"]
[null,"(USA) White House Call to Action to the Tech Community on New Machine Readable COVID-19 Dataset","Financial protection",{"$f":"COUNTIF($C$1:C99,C99)","v":12},"Financial protection12","(USA) White House Call to Action to the Tech Community on New Machine Readable COVID-19 Dataset","(USA) White House Call to Action to the Tech Community on New Machine Readable COVID-19 DatasetFinancial protection"]
[null,"(USA) White House Call to Action to the Tech Community on New Machine Readable COVID-19 Dataset","Education",{"$f":"COUNTIF($C$1:C100,C100)","v":9},"Education9","(USA) White House Call to Action to the Tech Community on New Machine Readable COVID-19 Dataset","(USA) White House Call to Action to the Tech Community on New Machine Readable COVID-19 DatasetEducation"]
["Andile","European Research Area (ERA) Corona Platform","Health",{"$f":"COUNTIF($C$1:C101,C101)","v":37},"Health37","European Research Area (ERA) Corona Platform","European Research Area (ERA) Corona PlatformHealth"]
["Promise","Ghana government","Health",{"$f":"COUNTIF($C$1:C102,C102)","v":38},"Health38","Ghana government","Ghana governmentHealth"]
[null,"Ghana government","Economic development and growth",{"$f":"COUNTIF($C$1:C103,C103)","v":13},"Economic development and growth13","Ghana government","Ghana governmentEconomic development and growth"]
["Andile","COVID-19 Open Research Dataset","Health",{"$f":"COUNTIF($C$1:C104,C104)","v":39},"Health39","COVID-19 Open Research Dataset","COVID-19 Open Research DatasetHealth"]
["Promise","Coronavirus Tech Handbook","Education",{"$f":"COUNTIF($C$1:C105,C105)","v":10},"Education10","Coronavirus Tech Handbook","Coronavirus Tech HandbookEducation"]
[null,"Coronavirus Tech Handbook","Economic development and growth",{"$f":"COUNTIF($C$1:C106,C106)","v":14},"Economic development and growth14","Coronavirus Tech Handbook","Coronavirus Tech HandbookEconomic development and growth"]
[null,"Coronavirus Tech Handbook","Public safety and justice",{"$f":"COUNTIF($C$1:C107,C107)","v":2},"Public safety and justice2","Coronavirus Tech Handbook","Coronavirus Tech HandbookPublic safety and justice"]
["Andile","iHealthFacts","Health",{"$f":"COUNTIF($C$1:C108,C108)","v":40},"Health40","iHealthFacts","iHealthFactsHealth"]
["Andile","Mental Health Commission of Canada","Health",{"$f":"COUNTIF($C$1:C109,C109)","v":41},"Health41","Mental Health Commission of Canada","Mental Health Commission of CanadaHealth"]
[null,"Mental Health Commission of Canada","Government services",{"$f":"COUNTIF($C$1:C110,C110)","v":8},"Government services8","Mental Health Commission of Canada","Mental Health Commission of CanadaGovernment services"]
["Promise","Homelesseness impact","Housing",{"$f":"COUNTIF($C$1:C111,C111)","v":2},"Housing2","Homelesseness impact","Homelesseness impactHousing"]
["Irvine","Canadian Centre on Substance Use and Addiction","Health",{"$f":"COUNTIF($C$1:C112,C112)","v":42},"Health42","Canadian Centre on Substance Use and Addiction","Canadian Centre on Substance Use and AddictionHealth"]
["Andile","COVID 19 ZA Dashboard","Health",{"$f":"COUNTIF($C$1:C113,C113)","v":43},"Health43","COVID 19 ZA Dashboard","COVID 19 ZA DashboardHealth"]
["Promise","Covid-19 Innovations","Economic development and growth",{"$f":"COUNTIF($C$1:C114,C114)","v":15},"Economic development and growth15","Covid-19 Innovations","Covid-19 InnovationsEconomic development and growth"]
[null,"Covid-19 Innovations","Education",{"$f":"COUNTIF($C$1:C115,C115)","v":11},"Education11","Covid-19 Innovations","Covid-19 InnovationsEducation"]
[null,"Covid-19 Innovations","Culture and gender",{"$f":"COUNTIF($C$1:C116,C116)","v":4},"Culture and gender4","Covid-19 Innovations","Covid-19 InnovationsCulture and gender"]
[null,"Covid-19 Innovations","Health",{"$f":"COUNTIF($C$1:C117,C117)","v":44},"Health44","Covid-19 Innovations","Covid-19 InnovationsHealth"]
[null,"Covid-19 Innovations","Housing",{"$f":"COUNTIF($C$1:C118,C118)","v":3},"Housing3","Covid-19 Innovations","Covid-19 InnovationsHousing"]
[null,"Covid-19 Innovations","Transportation",{"$f":"COUNTIF($C$1:C119,C119)","v":3},"Transportation3","Covid-19 Innovations","Covid-19 InnovationsTransportation"]
[null,"Covid-19 Innovations","Children and youth services",{"$f":"COUNTIF($C$1:C120,C120)","v":3},"Children and youth services3","Covid-19 Innovations","Covid-19 InnovationsChildren and youth services"]
[null,"Covid-19 Innovations","Energy supply",{"$f":"COUNTIF($C$1:C121,C121)","v":1},"Energy supply1","Covid-19 Innovations","Covid-19 InnovationsEnergy supply"]
[null,"Covid-19 Innovations","Environmental conservation",{"$f":"COUNTIF($C$1:C122,C122)","v":2},"Environmental conservation2","Covid-19 Innovations","Covid-19 InnovationsEnvironmental conservation"]
["Andile","LitCovid","Health",{"$f":"COUNTIF($C$1:C123,C123)","v":45},"Health45","LitCovid","LitCovidHealth"]
["Promise","Health Economics, Policy and Law blog series on country responses","Health",{"$f":"COUNTIF($C$1:C124,C124)","v":46},"Health46","Health Economics, Policy and Law blog series on country responses","Health Economics, Policy and Law blog series on country responsesHealth"]
[null,"Health Economics, Policy and Law blog series on country responses","Economic development and growth",{"$f":"COUNTIF($C$1:C125,C125)","v":16},"Economic development and growth16","Health Economics, Policy and Law blog series on country responses","Health Economics, Policy and Law blog series on country responsesEconomic development and growth"]
[null,"Health Economics, Policy and Law blog series on country responses","Financial protection",{"$f":"COUNTIF($C$1:C126,C126)","v":13},"Financial protection13","Health Economics, Policy and Law blog series on country responses","Health Economics, Policy and Law blog series on country responsesFinancial protection"]
["Andile","SPOR Evidence Alliance","Health",{"$f":"COUNTIF($C$1:C127,C127)","v":47},"Health47","SPOR Evidence Alliance","SPOR Evidence AllianceHealth"]
["Andile","U.S. National Institutes of Health","Health",{"$f":"COUNTIF($C$1:C128,C128)","v":48},"Health48","U.S. National Institutes of Health","U.S. National Institutes of HealthHealth"]
["Andile","Ontario Ministry of Health ,Ministry of Long-Term Care","Health",{"$f":"COUNTIF($C$1:C129,C129)","v":49},"Health49","Ontario Ministry of Health ,Ministry of Long-Term Care","Ontario Ministry of Health ,Ministry of Long-Term CareHealth"]
[null,"Ontario Ministry of Health ,Ministry of Long-Term Care","Children and youth services",{"$f":"COUNTIF($C$1:C130,C130)","v":4},"Children and youth services4","Ontario Ministry of Health ,Ministry of Long-Term Care","Ontario Ministry of Health ,Ministry of Long-Term CareChildren and youth services"]
["Irvine","CHAIN","Health",{"$f":"COUNTIF($C$1:C131,C131)","v":50},{"$f":"C131&D131","v":"Health50"},{"$f":"B131","v":"CHAIN"},{"$f":"B131&C131","v":"CHAINHealth"}]
["Irvine","eCancer","Health",{"$f":"COUNTIF($C$1:C132,C132)","v":51},"Health51","eCancer","eCancerHealth"]
["Promise","COVID-19 Economic Stimulus Index","Economic development and growth",{"$f":"COUNTIF($C$1:C133,C133)","v":17},"Economic development and growth17","COVID-19 Economic Stimulus Index","COVID-19 Economic Stimulus IndexEconomic development and growth"]
["Andile","Government of Canada","Financial protection",{"$f":"COUNTIF($C$1:C134,C134)","v":14},"Financial protection14","Government of Canada","Government of CanadaFinancial protection"]
[null,"Government of Canada","Health",{"$f":"COUNTIF($C$1:C135,C135)","v":52},"Health52","Government of Canada","Government of CanadaHealth"]
["Promise","Nigerian government","Health",{"$f":"COUNTIF($C$1:C136,C136)","v":53},"Health53","Nigerian government","Nigerian governmentHealth"]
["Andile","Cochrane Oral Health","Health",{"$f":"COUNTIF($C$1:C137,C137)","v":54},"Health54","Cochrane Oral Health","Cochrane Oral HealthHealth"]
["Promise","Cell Press Coronavirus Resource Hub","Health",{"$f":"COUNTIF($C$1:C138,C138)","v":55},"Health55","Cell Press Coronavirus Resource Hub","Cell Press Coronavirus Resource HubHealth"]
["Andile","Public Health England","Health",{"$f":"COUNTIF($C$1:C139,C139)","v":56},"Health56","Public Health England","Public Health EnglandHealth"]
["Andile","Ontario Hospital Association","Health",{"$f":"COUNTIF($C$1:C140,C140)","v":57},"Health57","Ontario Hospital Association","Ontario Hospital AssociationHealth"]
[null,"Ontario Hospital Association","Children and youth services",{"$f":"COUNTIF($C$1:C141,C141)","v":5},"Children and youth services5","Ontario Hospital Association","Ontario Hospital AssociationChildren and youth services"]
[null,"Ontario Hospital Association","Public safety and justice",{"$f":"COUNTIF($C$1:C142,C142)","v":3},"Public safety and justice3","Ontario Hospital Association","Ontario Hospital AssociationPublic safety and justice"]
["Promise","SYREAF","Health",{"$f":"COUNTIF($C$1:C143,C143)","v":58},"Health58","SYREAF","SYREAFHealth"]
["Andile","SAGE","Health",{"$f":"COUNTIF($C$1:C144,C144)","v":59},"Health59","SAGE","SAGEHealth"]
[null,"SAGE","Education",{"$f":"COUNTIF($C$1:C145,C145)","v":12},"Education12","SAGE","SAGEEducation"]
["Andile","NEJM's Coronavirus (Covid-19)","Health",{"$f":"COUNTIF($C$1:C146,C146)","v":60},"Health60","NEJM's Coronavirus (Covid-19)","NEJM's Coronavirus (Covid-19)Health"]
["Irvine","EUI Covid Knowledge Hub","Health",{"$f":"COUNTIF($C$1:C147,C147)","v":61},"Health61","EUI Covid Knowledge Hub","EUI Covid Knowledge HubHealth"]
[null,"EUI Covid Knowledge Hub","Public safety and justice",{"$f":"COUNTIF($C$1:C148,C148)","v":4},"Public safety and justice4","EUI Covid Knowledge Hub","EUI Covid Knowledge HubPublic safety and justice"]
["Promise","Journal of the American College of Cardiology","Health",{"$f":"COUNTIF($C$1:C149,C149)","v":62},"Health62","Journal of the American College of Cardiology","Journal of the American College of CardiologyHealth"]
["Andile","RCVS Knowledge","Health",{"$f":"COUNTIF($C$1:C150,C150)","v":63},"Health63","RCVS Knowledge","RCVS KnowledgeHealth"]
["Promise","New England Journal of Medicine","Health",{"$f":"COUNTIF($C$1:C151,C151)","v":64},"Health64","New England Journal of Medicine","New England Journal of MedicineHealth"]
["Andile","Health Information and Quality Authority","Health",{"$f":"COUNTIF($C$1:C152,C152)","v":65},"Health65","Health Information and Quality Authority","Health Information and Quality AuthorityHealth"]
["Irvin","American Chemistry Society","Health",{"$f":"COUNTIF($C$1:C153,C153)","v":66},"Health66","American Chemistry Society","American Chemistry SocietyHealth"]
["Promise","LANCET COVID-19 Resource Centre","Health",{"$f":"COUNTIF($C$1:C154,C154)","v":67},"Health67","LANCET COVID-19 Resource Centre","LANCET COVID-19 Resource CentreHealth"]
["Andile","TEPHINET Coronavirus Knowledge Hub","Health",{"$f":"COUNTIF($C$1:C155,C155)","v":68},"Health68","TEPHINET Coronavirus Knowledge Hub","TEPHINET Coronavirus Knowledge HubHealth"]
[null,"TEPHINET Coronavirus Knowledge Hub","Government services",{"$f":"COUNTIF($C$1:C156,C156)","v":9},"Government services9","TEPHINET Coronavirus Knowledge Hub","TEPHINET Coronavirus Knowledge HubGovernment services"]
["Irvin","Makerere University","Health",{"$f":"COUNTIF($C$1:C157,C157)","v":69},"Health69","Makerere University","Makerere UniversityHealth"]
["Promise","World Bank Education","Education",{"$f":"COUNTIF($C$1:C158,C158)","v":13},"Education13","World Bank Education","World Bank EducationEducation"]
[null,"McMasterer Plus","Health",{"$f":"COUNTIF($C$1:C159,C159)","v":70},"Health70","McMasterer Plus","McMasterer PlusHealth"]
["Promise","Canadian Agency for Drugs and Technologies in Health","Health",{"$f":"COUNTIF($C$1:C160,C160)","v":71},"Health71","Canadian Agency for Drugs and Technologies in Health","Canadian Agency for Drugs and Technologies in HealthHealth"]
["Irvine","Covid 19 Africa Watch","Financial protection",{"$f":"COUNTIF($C$1:C161,C161)","v":15},"Financial protection15","Covid 19 Africa Watch","Covid 19 Africa WatchFinancial protection"]
["Andile","Wits Hub","Health",{"$f":"COUNTIF($C$1:C162,C162)","v":72},"Health72","Wits Hub","Wits HubHealth"]
["Promise","Cochrane ENT, Hearing & Balance","Health",{"$f":"COUNTIF($C$1:C163,C163)","v":73},"Health73","Cochrane ENT, Hearing & Balance","Cochrane ENT, Hearing & BalanceHealth"]
["Andile","Irish Longitudinal Study on Ageing","Health",{"$f":"COUNTIF($C$1:C164,C164)","v":74},"Health74","Irish Longitudinal Study on Ageing","Irish Longitudinal Study on AgeingHealth"]
["Promise","International Long Term Care Policy Network","Health",{"$f":"COUNTIF($C$1:C165,C165)","v":75},"Health75","International Long Term Care Policy Network","International Long Term Care Policy NetworkHealth"]
["Irvine","American College of Cardiology","Financial protection",{"$f":"COUNTIF($C$1:C166,C166)","v":16},"Financial protection16","American College of Cardiology","American College of CardiologyFinancial protection"]
["Promise","Frontiers Coronavirus Knowledge Hub","Health",{"$f":"COUNTIF($C$1:C167,C167)","v":76},"Health76","Frontiers Coronavirus Knowledge Hub","Frontiers Coronavirus Knowledge HubHealth"]
[null,"Frontiers Coronavirus Knowledge Hub","Economic development and growth",{"$f":"COUNTIF($C$1:C168,C168)","v":18},"Economic development and growth18","Frontiers Coronavirus Knowledge Hub","Frontiers Coronavirus Knowledge HubEconomic development and growth"]
[null,"Frontiers Coronavirus Knowledge Hub","Infrastructure",{"$f":"COUNTIF($C$1:C169,C169)","v":1},"Infrastructure1","Frontiers Coronavirus Knowledge Hub","Frontiers Coronavirus Knowledge HubInfrastructure"]
["Irvine","American Society of Microbiology","Health",{"$f":"COUNTIF($C$1:C170,C170)","v":77},"Health77","American Society of Microbiology","American Society of MicrobiologyHealth"]
["Andile","DynaMed","Health",{"$f":"COUNTIF($C$1:C171,C171)","v":78},"Health78","DynaMed","DynaMedHealth"]
["Irvine","Elsevier Novel Coronavirus Information Center","Health",{"$f":"COUNTIF($C$1:C172,C172)","v":79},"Health79","Elsevier Novel Coronavirus Information Center","Elsevier Novel Coronavirus Information CenterHealth"]
["Promise","International trade centre","Economic development and growth",{"$f":"COUNTIF($C$1:C173,C173)","v":19},"Economic development and growth19","International trade centre","International trade centreEconomic development and growth"]
[null,"International trade centre","Food safety and security",{"$f":"COUNTIF($C$1:C174,C174)","v":3},"Food safety and security3","International trade centre","International trade centreFood safety and security"]
["Andile","Open government partnership","Public safety and justice",{"$f":"COUNTIF($C$1:C175,C175)","v":5},"Public safety and justice5","Open government partnership","Open government partnershipPublic safety and justice"]
["Promise","UK government","Health",{"$f":"COUNTIF($C$1:C176,C176)","v":80},"Health80","UK government","UK governmentHealth"]
["Irvine","Elsevier Novel Coronavirus Information Center","Health",{"$f":"COUNTIF($C$1:C177,C177)","v":81},"Health81","Elsevier Novel Coronavirus Information Center","Elsevier Novel Coronavirus Information CenterHealth"]
["Andile","SocArxi Corona Net","Health",{"$f":"COUNTIF($C$1:C178,C178)","v":82},"Health82","SocArxi Corona Net","SocArxi Corona NetHealth"]
["Irvine","WHO R & D","Health",{"$f":"COUNTIF($C$1:C179,C179)","v":83},"Health83","WHO R & D","WHO R & DHealth"]
["Promise","United Nations Office for the Coordination of Humanitarian Affairs","Economic development and growth",{"$f":"COUNTIF($C$1:C180,C180)","v":20},"Economic development and growth20","United Nations Office for the Coordination of Humanitarian Affairs","United Nations Office for the Coordination of Humanitarian AffairsEconomic development and growth"]
[null,"United Nations Office for the Coordination of Humanitarian Affairs","Education",{"$f":"COUNTIF($C$1:C181,C181)","v":14},"Education14","United Nations Office for the Coordination of Humanitarian Affairs","United Nations Office for the Coordination of Humanitarian AffairsEducation"]
[null,"United Nations Office for the Coordination of Humanitarian Affairs","Health",{"$f":"COUNTIF($C$1:C182,C182)","v":84},"Health84","United Nations Office for the Coordination of Humanitarian Affairs","United Nations Office for the Coordination of Humanitarian AffairsHealth"]
[null,"United Nations Office for the Coordination of Humanitarian Affairs","Transportation",{"$f":"COUNTIF($C$1:C183,C183)","v":4},"Transportation4","United Nations Office for the Coordination of Humanitarian Affairs","United Nations Office for the Coordination of Humanitarian AffairsTransportation"]
[null,"United Nations Office for the Coordination of Humanitarian Affairs","Public safety and justice",{"$f":"COUNTIF($C$1:C184,C184)","v":6},"Public safety and justice6","United Nations Office for the Coordination of Humanitarian Affairs","United Nations Office for the Coordination of Humanitarian AffairsPublic safety and justice"]
["Irvine","UNIDO","Economic development and growth",{"$f":"COUNTIF($C$1:C185,C185)","v":21},"Economic development and growth21","UNIDO","UNIDOEconomic development and growth"]
[null,"UNIDO","Government services",{"$f":"COUNTIF($C$1:C186,C186)","v":10},"Government services10","UNIDO","UNIDOGovernment services"]
["Irvine","International Centre for not-for-profit law","Public safety and justice",{"$f":"COUNTIF($C$1:C187,C187)","v":7},"Public safety and justice7","International Centre for not-for-profit law","International Centre for not-for-profit lawPublic safety and justice"]
[null,"International Centre for not-for-profit law","Government services",{"$f":"COUNTIF($C$1:C188,C188)","v":11},"Government services11","International Centre for not-for-profit law","International Centre for not-for-profit lawGovernment services"]
["Andile","Communication Initiative","Health",{"$f":"COUNTIF($C$1:C189,C189)","v":85},"Health85","Communication Initiative","Communication InitiativeHealth"]
[null,"Communication Initiative","Culture and gender",{"$f":"COUNTIF($C$1:C190,C190)","v":5},"Culture and gender5","Communication Initiative","Communication InitiativeCulture and gender"]
[null,"Communication Initiative","Public safety and justice",{"$f":"COUNTIF($C$1:C191,C191)","v":8},"Public safety and justice8","Communication Initiative","Communication InitiativePublic safety and justice"]
["Promise","Asian Development Bank","Economic development and growth",{"$f":"COUNTIF($C$1:C192,C192)","v":22},"Economic development and growth22","Asian Development Bank","Asian Development BankEconomic development and growth"]
[null,"Asian Development Bank","Education",{"$f":"COUNTIF($C$1:C193,C193)","v":15},"Education15","Asian Development Bank","Asian Development BankEducation"]
[null,"Asian Development Bank","Financial protection",{"$f":"COUNTIF($C$1:C194,C194)","v":17},"Financial protection17","Asian Development Bank","Asian Development BankFinancial protection"]
[null,"Asian Development Bank","Government services",{"$f":"COUNTIF($C$1:C195,C195)","v":12},{"$f":"C195&D195","v":"Government services12"},{"$f":"B195","v":"Asian Development Bank"},{"$f":"B195&C195","v":"Asian Development BankGovernment services"}]
["Promise","Knowledge to Policy Center, American University of Beirut","Health",{"$f":"COUNTIF($C$1:C196,C196)","v":86},"Health86","Knowledge to Policy Center, American University of Beirut","Knowledge to Policy Center, American University of BeirutHealth"]
["Irvine","Zimbabwe COVID-19 Support Hub","Government services",{"$f":"COUNTIF($C$1:C197,C197)","v":13},"Government services13","Zimbabwe COVID-19 Support Hub","Zimbabwe COVID-19 Support HubGovernment services"]
["Andile","American Psychological Association: Education","Health",{"$f":"COUNTIF($C$1:C198,C198)","v":87},"Health87","American Psychological Association: Education","American Psychological Association: EducationHealth"]
["Andile","Guidelines Network International","Health",{"$f":"COUNTIF($C$1:C199,C199)","v":88},"Health88","Guidelines Network International","Guidelines Network InternationalHealth"]
["Andile","ECRI Guidelines Trust COVID-19 Resource Center","Health",{"$f":"COUNTIF($C$1:C200,C200)","v":89},"Health89","ECRI Guidelines Trust COVID-19 Resource Center","ECRI Guidelines Trust COVID-19 Resource CenterHealth"]
["Promise","Tableau Public","Economic development and growth",{"$f":"COUNTIF($C$1:C201,C201)","v":23},"Economic development and growth23","Tableau Public","Tableau PublicEconomic development and growth"]
[null,"Tableau Public","Food safety and security",{"$f":"COUNTIF($C$1:C202,C202)","v":4},"Food safety and security4","Tableau Public","Tableau PublicFood safety and security"]
["Andile","MAGICapp","Health",{"$f":"COUNTIF($C$1:C203,C203)","v":90},"Health90","MAGICapp","MAGICappHealth"]
["Andile","McMaster Optimal Aging Portal","Health",{"$f":"COUNTIF($C$1:C204,C204)","v":91},"Health91","McMaster Optimal Aging Portal","McMaster Optimal Aging PortalHealth"]
[null,"McMaster Optimal Aging Portal","Housing",{"$f":"COUNTIF($C$1:C205,C205)","v":4},"Housing4","McMaster Optimal Aging Portal","McMaster Optimal Aging PortalHousing"]
["Irvine","Havard Dataverse","Health",{"$f":"COUNTIF($C$1:C206,C206)","v":92},"Health92","Havard Dataverse","Havard DataverseHealth"]
[null,"PROSPERO","Health",{"$f":"COUNTIF($C$1:C207,C207)","v":93},"Health93","PROSPERO","PROSPEROHealth"]
["Promise","Turning Research Into Practice (TRIP)","Health",{"$f":"COUNTIF($C$1:C208,C208)","v":94},"Health94","Turning Research Into Practice (TRIP)","Turning Research Into Practice (TRIP)Health"]
["Andile","George Institute","Health",{"$f":"COUNTIF($C$1:C209,C209)","v":95},"Health95","George Institute","George InstituteHealth"]
[null,"George Institute","Culture and gender",{"$f":"COUNTIF($C$1:C210,C210)","v":6},"Culture and gender6","George Institute","George InstituteCulture and gender"]
["Irvine","World Health Organization (WHO) technical guidelines","Health",{"$f":"COUNTIF($C$1:C211,C211)","v":96},"Health96","World Health Organization (WHO) technical guidelines","World Health Organization (WHO) technical guidelinesHealth"]
["Nkuli","WHO Global research on coronavirus disease (COVID-19)","Health",{"$f":"COUNTIF($C$1:C212,C212)","v":97},"Health97","WHO Global research on coronavirus disease (COVID-19)","WHO Global research on coronavirus disease (COVID-19)Health"]
[null,"WHO Global research on coronavirus disease (COVID-19)","Consumer protection",{"$f":"COUNTIF($C$1:C213,C213)","v":1},"Consumer protection1","WHO Global research on coronavirus disease (COVID-19)","WHO Global research on coronavirus disease (COVID-19)Consumer protection"]
[null,"WHO Global research on coronavirus disease (COVID-19)","Education",{"$f":"COUNTIF($C$1:C214,C214)","v":16},"Education16","WHO Global research on coronavirus disease (COVID-19)","WHO Global research on coronavirus disease (COVID-19)Education"]
[null,"WHO Global research on coronavirus disease (COVID-19)","Employment",{"$f":"COUNTIF($C$1:C215,C215)","v":3},"Employment3","WHO Global research on coronavirus disease (COVID-19)","WHO Global research on coronavirus disease (COVID-19)Employment"]
["Promise","Love Platform","Health",{"$f":"COUNTIF($C$1:C216,C216)","v":98},"Health98","Love Platform","Love PlatformHealth"]
["Andile","European Respiratory Society","Health",{"$f":"COUNTIF($C$1:C217,C217)","v":99},"Health99","European Respiratory Society","European Respiratory SocietyHealth"]
["Nkuli","UNESCO Planipolis","Education",{"$f":"COUNTIF($C$1:C218,C218)","v":17},"Education17","UNESCO Planipolis","UNESCO PlanipolisEducation"]
["Andile","Chinese Center for Disease Control and Prevention","Health",{"$f":"COUNTIF($C$1:C219,C219)","v":100},"Health100","Chinese Center for Disease Control and Prevention","Chinese Center for Disease Control and PreventionHealth"]
["Irvine","Antimicrobial Stewardship","Health",{"$f":"COUNTIF($C$1:C220,C220)","v":101},"Health101","Antimicrobial Stewardship","Antimicrobial StewardshipHealth"]
["Irvine","U.S. Veterans’ Affairs (VA) Evidence Synthesis Program","Health",{"$f":"COUNTIF($C$1:C221,C221)","v":102},"Health102","U.S. Veterans’ Affairs (VA) Evidence Synthesis Program","U.S. Veterans’ Affairs (VA) Evidence Synthesis ProgramHealth"]
["Andile","Weekly Social Protection Links","Financial protection",{"$f":"COUNTIF($C$1:C222,C222)","v":18},"Financial protection18","Weekly Social Protection Links","Weekly Social Protection LinksFinancial protection"]
[null,"Weekly Social Protection Links","Food safety and security",{"$f":"COUNTIF($C$1:C223,C223)","v":5},"Food safety and security5","Weekly Social Protection Links","Weekly Social Protection LinksFood safety and security"]
["Nkuli","WHO Regional Office for Europe (technical guidance)","Health",{"$f":"COUNTIF($C$1:C224,C224)","v":103},"Health103","WHO Regional Office for Europe (technical guidance)","WHO Regional Office for Europe (technical guidance)Health"]
["Andile","International Network for Government Science Advice (INGSA)","Health",{"$f":"COUNTIF($C$1:C225,C225)","v":104},"Health104","International Network for Government Science Advice (INGSA)","International Network for Government Science Advice (INGSA)Health"]
[null,"International Network for Government Science Advice (INGSA)","Economic development and growth",{"$f":"COUNTIF($C$1:C226,C226)","v":24},"Economic development and growth24","International Network for Government Science Advice (INGSA)","International Network for Government Science Advice (INGSA)Economic development and growth"]
[null,"International Network for Government Science Advice (INGSA)","Financial protection",{"$f":"COUNTIF($C$1:C227,C227)","v":19},"Financial protection19","International Network for Government Science Advice (INGSA)","International Network for Government Science Advice (INGSA)Financial protection"]
[null,"International Network for Government Science Advice (INGSA)","Employment",{"$f":"COUNTIF($C$1:C228,C228)","v":4},"Employment4","International Network for Government Science Advice (INGSA)","International Network for Government Science Advice (INGSA)Employment"]
["Nkuli","Health Technology Assessment International","Health",{"$f":"COUNTIF($C$1:C229,C229)","v":105},"Health105","Health Technology Assessment International","Health Technology Assessment InternationalHealth"]
["Nkuli","Call for Action: COVID-19 Data Collaboratives","Health",{"$f":"COUNTIF($C$1:C230,C230)","v":106},"Health106","Call for Action: COVID-19 Data Collaboratives","Call for Action: COVID-19 Data CollaborativesHealth"]
["Promise","Annals of Internal Medicine","Health",{"$f":"COUNTIF($C$1:C231,C231)","v":107},"Health107","Annals of Internal Medicine","Annals of Internal MedicineHealth"]
["Nkuli","Santé Public France","Health",{"$f":"COUNTIF($C$1:C232,C232)","v":108},"Health108","Santé Public France","Santé Public FranceHealth"]
[null,"Santé Public France","Community and social services",{"$f":"COUNTIF($C$1:C233,C233)","v":8},"Community and social services8","Santé Public France","Santé Public FranceCommunity and social services"]
[null,"Santé Public France","Public safety and justice",{"$f":"COUNTIF($C$1:C234,C234)","v":9},"Public safety and justice9","Santé Public France","Santé Public FrancePublic safety and justice"]
["Andile","Institut national d’excellence en santé et en services sociaux","Health",{"$f":"COUNTIF($C$1:C235,C235)","v":109},"Health109","Institut national d’excellence en santé et en services sociaux","Institut national d’excellence en santé et en services sociauxHealth"]
["Nkuli","Campbell UK and Ireland","Health",{"$f":"COUNTIF($C$1:C236,C236)","v":110},"Health110","Campbell UK and Ireland","Campbell UK and IrelandHealth"]
[null,"Campbell UK and Ireland","Public safety and justice",{"$f":"COUNTIF($C$1:C237,C237)","v":10},"Public safety and justice10","Campbell UK and Ireland","Campbell UK and IrelandPublic safety and justice"]
[null,"Campbell UK and Ireland","Economic development and growth",{"$f":"COUNTIF($C$1:C238,C238)","v":25},"Economic development and growth25","Campbell UK and Ireland","Campbell UK and IrelandEconomic development and growth"]
[null,"Campbell UK and Ireland","Community and social services",{"$f":"COUNTIF($C$1:C239,C239)","v":9},"Community and social services9","Campbell UK and Ireland","Campbell UK and IrelandCommunity and social services"]
["Andile","GULAGECHOES","Public safety and justice",{"$f":"COUNTIF($C$1:C240,C240)","v":11},"Public safety and justice11","GULAGECHOES","GULAGECHOESPublic safety and justice"]
["Promise","CareSearch: Palliative Care Knowledge Network","Health",{"$f":"COUNTIF($C$1:C241,C241)","v":111},"Health111","CareSearch: Palliative Care Knowledge Network","CareSearch: Palliative Care Knowledge NetworkHealth"]
["Nkuli","Prison Policy Initiative","Public safety and justice",{"$f":"COUNTIF($C$1:C242,C242)","v":12},"Public safety and justice12","Prison Policy Initiative","Prison Policy InitiativePublic safety and justice"]
[null,"Prison Policy Initiative","Community and social services",{"$f":"COUNTIF($C$1:C243,C243)","v":10},"Community and social services10","Prison Policy Initiative","Prison Policy InitiativeCommunity and social services"]
["Andile","The Marshall Project Coronavirus Tracker","Public safety and justice",{"$f":"COUNTIF($C$1:C244,C244)","v":13},"Public safety and justice13","The Marshall Project Coronavirus Tracker","The Marshall Project Coronavirus TrackerPublic safety and justice"]
["Irvine","Distiller SR : Evidence Summary ","Health",{"$f":"COUNTIF($C$1:C245,C245)","v":112},"Health112","Distiller SR : Evidence Summary ","Distiller SR : Evidence Summary Health"]
["Andile","Vera Institute of Justice","Public safety and justice",{"$f":"COUNTIF($C$1:C246,C246)","v":14},"Public safety and justice14","Vera Institute of Justice","Vera Institute of JusticePublic safety and justice"]
["Nkuli","Brennan Center for Justice","Public safety and justice",{"$f":"COUNTIF($C$1:C247,C247)","v":15},"Public safety and justice15","Brennan Center for Justice","Brennan Center for JusticePublic safety and justice"]
["Irvine","Africaxiv","Health",{"$f":"COUNTIF($C$1:C248,C248)","v":113},"Health113","Africaxiv","AfricaxivHealth"]
[null,"Africaxiv","Government services",{"$f":"COUNTIF($C$1:C249,C249)","v":14},"Government services14","Africaxiv","AfricaxivGovernment services"]
["Promise","Wolters Kluwer Global Infectious Diseases and Epidemiology Online Network (GIDEON)","Health",{"$f":"COUNTIF($C$1:C250,C250)","v":114},"Health114","Wolters Kluwer Global Infectious Diseases and Epidemiology Online Network (GIDEON)","Wolters Kluwer Global Infectious Diseases and Epidemiology Online Network (GIDEON)Health"]
["Andile","ILO Social Protection Monitor","Financial protection",{"$f":"COUNTIF($C$1:C251,C251)","v":20},"Financial protection20","ILO Social Protection Monitor","ILO Social Protection MonitorFinancial protection"]
[null,"ILO Social Protection Monitor","Food safety and security",{"$f":"COUNTIF($C$1:C252,C252)","v":6},"Food safety and security6","ILO Social Protection Monitor","ILO Social Protection MonitorFood safety and security"]
[null,"ILO Social Protection Monitor","Health",{"$f":"COUNTIF($C$1:C253,C253)","v":115},"Health115","ILO Social Protection Monitor","ILO Social Protection MonitorHealth"]
[null,"ILO Social Protection Monitor","Employment",{"$f":"COUNTIF($C$1:C254,C254)","v":5},"Employment5","ILO Social Protection Monitor","ILO Social Protection MonitorEmployment"]
[null,"ILO Social Protection Monitor","Housing",{"$f":"COUNTIF($C$1:C255,C255)","v":5},"Housing5","ILO Social Protection Monitor","ILO Social Protection MonitorHousing"]
["Nkuli","COVID 19 Inequality Project","Economic development and growth",{"$f":"COUNTIF($C$1:C256,C256)","v":26},"Economic development and growth26","COVID 19 Inequality Project","COVID 19 Inequality ProjectEconomic development and growth"]
[null,"COVID 19 Inequality Project","Employment",{"$f":"COUNTIF($C$1:C257,C257)","v":6},"Employment6","COVID 19 Inequality Project","COVID 19 Inequality ProjectEmployment"]
["Irvine","Our World In data Policy Responses to the Coronavirus Pandemic","Health",{"$f":"COUNTIF($C$1:C258,C258)","v":116},"Health116","Our World In data Policy Responses to the Coronavirus Pandemic","Our World In data Policy Responses to the Coronavirus PandemicHealth"]
[null,"Our World In data Policy Responses to the Coronavirus Pandemic","Government services",{"$f":"COUNTIF($C$1:C259,C259)","v":15},{"$f":"C259&D259","v":"Government services15"},{"$f":"B259","v":"Our World In data Policy Responses to the Coronavirus Pandemic"},{"$f":"B259&C259","v":"Our World In data Policy Responses to the Coronavirus PandemicGovernment services"}]
["Andile","Malcolm Wiener Centre for Social Policy Monitoring the Covid-19 Employment Response: Policy Approaches Across Countries","Employment",{"$f":"COUNTIF($C$1:C260,C260)","v":7},"Employment7","Malcolm Wiener Centre for Social Policy Monitoring the Covid-19 Employment Response: Policy Approaches Across Countries","Malcolm Wiener Centre for Social Policy Monitoring the Covid-19 Employment Response: Policy Approaches Across CountriesEmployment"]
["Irvine","European Society of Intensive Care Medicine","Health",{"$f":"COUNTIF($C$1:C261,C261)","v":117},"Health117","European Society of Intensive Care Medicine","European Society of Intensive Care MedicineHealth"]
["Nkuli","IIASA COVID-19 : Visualizing regional socioeconomic indicators for Europe","Economic development and growth",{"$f":"COUNTIF($C$1:C262,C262)","v":27},"Economic development and growth27","IIASA COVID-19 : Visualizing regional socioeconomic indicators for Europe","IIASA COVID-19 : Visualizing regional socioeconomic indicators for EuropeEconomic development and growth"]
[null,"IIASA COVID-19 : Visualizing regional socioeconomic indicators for Europe","Health",{"$f":"COUNTIF($C$1:C263,C263)","v":118},"Health118","IIASA COVID-19 : Visualizing regional socioeconomic indicators for Europe","IIASA COVID-19 : Visualizing regional socioeconomic indicators for EuropeHealth"]
["Promise","National Institutes of Health treatment guidelines","Health",{"$f":"COUNTIF($C$1:C264,C264)","v":119},"Health119","National Institutes of Health treatment guidelines","National Institutes of Health treatment guidelinesHealth"]
["Nkuli","COVID Racial Data Tracker","Health",{"$f":"COUNTIF($C$1:C265,C265)","v":120},"Health120","COVID Racial Data Tracker","COVID Racial Data TrackerHealth"]
[null,"COVID Racial Data Tracker","Culture and gender",{"$f":"COUNTIF($C$1:C266,C266)","v":7},"Culture and gender7","COVID Racial Data Tracker","COVID Racial Data TrackerCulture and gender"]
["Nkuli","CGD - COVID education policy tracking","Education",{"$f":"COUNTIF($C$1:C267,C267)","v":18},"Education18","CGD - COVID education policy tracking","CGD - COVID education policy trackingEducation"]
["Andile","Global Health 5050 COVID-19 sex-disaggregated data tracker","Culture and gender",{"$f":"COUNTIF($C$1:C268,C268)","v":8},"Culture and gender8","Global Health 5050 COVID-19 sex-disaggregated data tracker","Global Health 5050 COVID-19 sex-disaggregated data trackerCulture and gender"]
[null,"Global Health 5050 COVID-19 sex-disaggregated data tracker","Health",{"$f":"COUNTIF($C$1:C269,C269)","v":121},"Health121","Global Health 5050 COVID-19 sex-disaggregated data tracker","Global Health 5050 COVID-19 sex-disaggregated data trackerHealth"]
["Nkuli","World Pandemic Research Network (WPRN) ","Health",{"$f":"COUNTIF($C$1:C270,C270)","v":122},"Health122","World Pandemic Research Network (WPRN) ","World Pandemic Research Network (WPRN) Health"]
[null,"World Pandemic Research Network (WPRN) ","Community and social services",{"$f":"COUNTIF($C$1:C271,C271)","v":11},"Community and social services11","World Pandemic Research Network (WPRN) ","World Pandemic Research Network (WPRN) Community and social services"]
[null,"World Pandemic Research Network (WPRN) ","Consumer protection",{"$f":"COUNTIF($C$1:C272,C272)","v":2},"Consumer protection2","World Pandemic Research Network (WPRN) ","World Pandemic Research Network (WPRN) Consumer protection"]
[null,"World Pandemic Research Network (WPRN) ","Economic development and growth",{"$f":"COUNTIF($C$1:C273,C273)","v":28},"Economic development and growth28","World Pandemic Research Network (WPRN) ","World Pandemic Research Network (WPRN) Economic development and growth"]
[null,"World Pandemic Research Network (WPRN) ","Education",{"$f":"COUNTIF($C$1:C274,C274)","v":19},"Education19","World Pandemic Research Network (WPRN) ","World Pandemic Research Network (WPRN) Education"]
[null,"World Pandemic Research Network (WPRN) ","Climate action",{"$f":"COUNTIF($C$1:C275,C275)","v":2},"Climate action2","World Pandemic Research Network (WPRN) ","World Pandemic Research Network (WPRN) Climate action"]
[null,"World Pandemic Research Network (WPRN) ","Employment",{"$f":"COUNTIF($C$1:C276,C276)","v":8},"Employment8","World Pandemic Research Network (WPRN) ","World Pandemic Research Network (WPRN) Employment"]
[null,"World Pandemic Research Network (WPRN) ","Food safety and security",{"$f":"COUNTIF($C$1:C277,C277)","v":7},"Food safety and security7","World Pandemic Research Network (WPRN) ","World Pandemic Research Network (WPRN) Food safety and security"]
[null,"World Pandemic Research Network (WPRN) ","Transportation",{"$f":"COUNTIF($C$1:C278,C278)","v":5},"Transportation5","World Pandemic Research Network (WPRN) ","World Pandemic Research Network (WPRN) Transportation"]
["Andile","Dimensions COVID-19","Health",{"$f":"COUNTIF($C$1:C279,C279)","v":123},"Health123","Dimensions COVID-19","Dimensions COVID-19Health"]
["Nkuli","COVID Scholar","Health",{"$f":"COUNTIF($C$1:C280,C280)","v":124},"Health124","COVID Scholar","COVID ScholarHealth"]
[null,"COVID Scholar","Climate action",{"$f":"COUNTIF($C$1:C281,C281)","v":3},"Climate action3","COVID Scholar","COVID ScholarClimate action"]
[null,"COVID Scholar","Consumer protection",{"$f":"COUNTIF($C$1:C282,C282)","v":3},"Consumer protection3","COVID Scholar","COVID ScholarConsumer protection"]
[null,"COVID Scholar","Culture and gender",{"$f":"COUNTIF($C$1:C283,C283)","v":9},"Culture and gender9","COVID Scholar","COVID ScholarCulture and gender"]
[null,"COVID Scholar","Economic development and growth",{"$f":"COUNTIF($C$1:C284,C284)","v":29},"Economic development and growth29","COVID Scholar","COVID ScholarEconomic development and growth"]
[null,"COVID Scholar","Education",{"$f":"COUNTIF($C$1:C285,C285)","v":20},"Education20","COVID Scholar","COVID ScholarEducation"]
[null,"COVID Scholar","Energy supply",{"$f":"COUNTIF($C$1:C286,C286)","v":2},"Energy supply2","COVID Scholar","COVID ScholarEnergy supply"]
[null,"COVID Scholar","Environmental conservation",{"$f":"COUNTIF($C$1:C287,C287)","v":3},"Environmental conservation3","COVID Scholar","COVID ScholarEnvironmental conservation"]
[null,"COVID Scholar","Financial protection",{"$f":"COUNTIF($C$1:C288,C288)","v":21},"Financial protection21","COVID Scholar","COVID ScholarFinancial protection"]
[null,"COVID Scholar","Food safety and security",{"$f":"COUNTIF($C$1:C289,C289)","v":8},"Food safety and security8","COVID Scholar","COVID ScholarFood safety and security"]
[null,"COVID Scholar","Government services",{"$f":"COUNTIF($C$1:C290,C290)","v":16},"Government services16","COVID Scholar","COVID ScholarGovernment services"]
[null,"COVID Scholar","Housing",{"$f":"COUNTIF($C$1:C291,C291)","v":6},"Housing6","COVID Scholar","COVID ScholarHousing"]
[null,"COVID Scholar","Infrastructure",{"$f":"COUNTIF($C$1:C292,C292)","v":2},"Infrastructure2","COVID Scholar","COVID ScholarInfrastructure"]
[null,"COVID Scholar","Natural resources",{"$f":"COUNTIF($C$1:C293,C293)","v":2},"Natural resources2","COVID Scholar","COVID ScholarNatural resources"]
[null,"COVID Scholar","Public safety and justice",{"$f":"COUNTIF($C$1:C294,C294)","v":16},"Public safety and justice16","COVID Scholar","COVID ScholarPublic safety and justice"]
[null,"COVID Scholar","Recreation",{"$f":"COUNTIF($C$1:C295,C295)","v":1},"Recreation1","COVID Scholar","COVID ScholarRecreation"]
[null,"COVID Scholar","Transportation",{"$f":"COUNTIF($C$1:C296,C296)","v":6},"Transportation6","COVID Scholar","COVID ScholarTransportation"]
["Irvine","Health Data Research UK","Health",{"$f":"COUNTIF($C$1:C297,C297)","v":125},"Health125","Health Data Research UK","Health Data Research UKHealth"]
["Promise","EY COVID-19 Global Trade Considerations tracker ","Economic development and growth",{"$f":"COUNTIF($C$1:C298,C298)","v":30},"Economic development and growth30","EY COVID-19 Global Trade Considerations tracker ","EY COVID-19 Global Trade Considerations tracker Economic development and growth"]
["Irvine","International Growth Centre(ICG)","Financial protection",{"$f":"COUNTIF($C$1:C299,C299)","v":22},"Financial protection22","International Growth Centre(ICG)","International Growth Centre(ICG)Financial protection"]
["Nkuli","GovPredict Federal, State, and Local Responses to the Coronavirus\nFocus","Government services",{"$f":"COUNTIF($C$1:C300,C300)","v":17},"Government services17","GovPredict Federal, State, and Local Responses to the Coronavirus\nFocus","GovPredict Federal, State, and Local Responses to the Coronavirus\nFocusGovernment services"]
[null,"GovPredict Federal, State, and Local Responses to the Coronavirus\nFocus","Health",{"$f":"COUNTIF($C$1:C301,C301)","v":126},"Health126","GovPredict Federal, State, and Local Responses to the Coronavirus\nFocus","GovPredict Federal, State, and Local Responses to the Coronavirus\nFocusHealth"]
["Andile","OECD Multilevel Governance","Economic development and growth",{"$f":"COUNTIF($C$1:C302,C302)","v":31},"Economic development and growth31","OECD Multilevel Governance","OECD Multilevel GovernanceEconomic development and growth"]
[null,"OECD Multilevel Governance","Government services",{"$f":"COUNTIF($C$1:C303,C303)","v":18},"Government services18","OECD Multilevel Governance","OECD Multilevel GovernanceGovernment services"]
[null,"OECD Multilevel Governance","Health",{"$f":"COUNTIF($C$1:C304,C304)","v":127},"Health127","OECD Multilevel Governance","OECD Multilevel GovernanceHealth"]
["Nkuli","OECD Cities responses","Transportation",{"$f":"COUNTIF($C$1:C305,C305)","v":7},"Transportation7","OECD Cities responses","OECD Cities responsesTransportation"]
[null,"OECD Cities responses","Public safety and justice",{"$f":"COUNTIF($C$1:C306,C306)","v":17},"Public safety and justice17","OECD Cities responses","OECD Cities responsesPublic safety and justice"]
[null,"OECD Cities responses","Housing",{"$f":"COUNTIF($C$1:C307,C307)","v":7},"Housing7","OECD Cities responses","OECD Cities responsesHousing"]
[null,"OECD Cities responses","Government services",{"$f":"COUNTIF($C$1:C308,C308)","v":19},"Government services19","OECD Cities responses","OECD Cities responsesGovernment services"]
[null,"OECD Cities responses","Education",{"$f":"COUNTIF($C$1:C309,C309)","v":21},"Education21","OECD Cities responses","OECD Cities responsesEducation"]
[null,"OECD Cities responses","Economic development and growth",{"$f":"COUNTIF($C$1:C310,C310)","v":32},"Economic development and growth32","OECD Cities responses","OECD Cities responsesEconomic development and growth"]
[null,"OECD Cities responses","Consumer protection",{"$f":"COUNTIF($C$1:C311,C311)","v":4},"Consumer protection4","OECD Cities responses","OECD Cities responsesConsumer protection"]
[null,"OECD Cities responses","Food safety and security",{"$f":"COUNTIF($C$1:C312,C312)","v":9},"Food safety and security9","OECD Cities responses","OECD Cities responsesFood safety and security"]
[null,"OECD Cities responses","Employment",{"$f":"COUNTIF($C$1:C313,C313)","v":9},"Employment9","OECD Cities responses","OECD Cities responsesEmployment"]
[null,"OECD Cities responses","Recreation",{"$f":"COUNTIF($C$1:C314,C314)","v":2},"Recreation2","OECD Cities responses","OECD Cities responsesRecreation"]
[null,"OECD Cities responses","Transportation",{"$f":"COUNTIF($C$1:C315,C315)","v":8},"Transportation8","OECD Cities responses","OECD Cities responsesTransportation"]
[null,"OECD Cities responses","Climate action",{"$f":"COUNTIF($C$1:C316,C316)","v":4},"Climate action4","OECD Cities responses","OECD Cities responsesClimate action"]
[null,"OECD Cities responses","Community and social services",{"$f":"COUNTIF($C$1:C317,C317)","v":12},"Community and social services12","OECD Cities responses","OECD Cities responsesCommunity and social services"]
[null,"OECD Cities responses","Culture and gender",{"$f":"COUNTIF($C$1:C318,C318)","v":10},"Culture and gender10","OECD Cities responses","OECD Cities responsesCulture and gender"]
["Promise","CIAT/IOTA/OECD Tax Response","Economic development and growth",{"$f":"COUNTIF($C$1:C319,C319)","v":33},"Economic development and growth33","CIAT/IOTA/OECD Tax Response","CIAT/IOTA/OECD Tax ResponseEconomic development and growth"]
["Promise","IFPRI Covid 19 Food Trade Policy Tracker","Economic development and growth",{"$f":"COUNTIF($C$1:C320,C320)","v":34},"Economic development and growth34","IFPRI Covid 19 Food Trade Policy Tracker","IFPRI Covid 19 Food Trade Policy TrackerEconomic development and growth"]
[null,"IFPRI Covid 19 Food Trade Policy Tracker","Food safety and security",{"$f":"COUNTIF($C$1:C321,C321)","v":10},"Food safety and security10","IFPRI Covid 19 Food Trade Policy Tracker","IFPRI Covid 19 Food Trade Policy TrackerFood safety and security"]
["Promise","Global Health Network Covid-19 Research Implementation Hub","Health",{"$f":"COUNTIF($C$1:C322,C322)","v":128},"Health128","Global Health Network Covid-19 Research Implementation Hub","Global Health Network Covid-19 Research Implementation HubHealth"]
["Andile","OECD SME Policy Responses","Economic development and growth",{"$f":"COUNTIF($C$1:C323,C323)","v":35},{"$f":"C323&D323","v":"Economic development and growth35"},{"$f":"B323","v":"OECD SME Policy Responses"},{"$f":"B323&C323","v":"OECD SME Policy ResponsesEconomic development and growth"}]
["Nkuli","OECD Tourism Summary","Transportation",{"$f":"COUNTIF($C$1:C324,C324)","v":9},"Transportation9","OECD Tourism Summary","OECD Tourism SummaryTransportation"]
[null,"OECD Tourism Summary","Economic development and growth",{"$f":"COUNTIF($C$1:C325,C325)","v":36},"Economic development and growth36","OECD Tourism Summary","OECD Tourism SummaryEconomic development and growth"]
["Andile","Global overview of COVID-19: Impact on elections","Public safety and justice",{"$f":"COUNTIF($C$1:C326,C326)","v":18},"Public safety and justice18","Global overview of COVID-19: Impact on elections","Global overview of COVID-19: Impact on electionsPublic safety and justice"]
["Irvine","OECD SME Policy Responses","Health",{"$f":"COUNTIF($C$1:C327,C327)","v":129},"Health129","OECD SME Policy Responses","OECD SME Policy ResponsesHealth"]
["Promise","Society of Critical Care Medicine","Health",{"$f":"COUNTIF($C$1:C328,C328)","v":130},"Health130","Society of Critical Care Medicine","Society of Critical Care MedicineHealth"]
[null,"Society of Critical Care Medicine","Education",{"$f":"COUNTIF($C$1:C329,C329)","v":22},"Education22","Society of Critical Care Medicine","Society of Critical Care MedicineEducation"]
["Irvine","Covid 19 Research Explorer","Health",{"$f":"COUNTIF($C$1:C330,C330)","v":131},"Health131","Covid 19 Research Explorer","Covid 19 Research ExplorerHealth"]
["Nkuli","Covid19 Behaviour Tracker\n","Culture and gender",{"$f":"COUNTIF($C$1:C331,C331)","v":11},"Culture and gender11","Covid19 Behaviour Tracker\n","Covid19 Behaviour Tracker\nCulture and gender"]
[null,"Covid19 Behaviour Tracker\n","Community and social services",{"$f":"COUNTIF($C$1:C332,C332)","v":13},"Community and social services13","Covid19 Behaviour Tracker\n","Covid19 Behaviour Tracker\nCommunity and social services"]
[null,"Covid19 Behaviour Tracker\n","Government services",{"$f":"COUNTIF($C$1:C333,C333)","v":20},"Government services20","Covid19 Behaviour Tracker\n","Covid19 Behaviour Tracker\nGovernment services"]
[null,"Covid19 Behaviour Tracker\n","Health",{"$f":"COUNTIF($C$1:C334,C334)","v":132},"Health132","Covid19 Behaviour Tracker\n","Covid19 Behaviour Tracker\nHealth"]
["Nkuli","Google Covid-19 Community Mobility Reports","Transportation",{"$f":"COUNTIF($C$1:C335,C335)","v":10},"Transportation10","Google Covid-19 Community Mobility Reports","Google Covid-19 Community Mobility ReportsTransportation"]
[null,"Google Covid-19 Community Mobility Reports","Community and social services",{"$f":"COUNTIF($C$1:C336,C336)","v":14},"Community and social services14","Google Covid-19 Community Mobility Reports","Google Covid-19 Community Mobility ReportsCommunity and social services"]
["Andile","Open COVID-19 policy dataset","Health",{"$f":"COUNTIF($C$1:C337,C337)","v":133},"Health133","Open COVID-19 policy dataset","Open COVID-19 policy datasetHealth"]
["Andile","Conflict and Covid-19 Resource Hub","Health",{"$f":"COUNTIF($C$1:C338,C338)","v":134},"Health134","Conflict and Covid-19 Resource Hub","Conflict and Covid-19 Resource HubHealth"]
[null,"Conflict and Covid-19 Resource Hub","Public safety and justice",{"$f":"COUNTIF($C$1:C339,C339)","v":19},"Public safety and justice19","Conflict and Covid-19 Resource Hub","Conflict and Covid-19 Resource HubPublic safety and justice"]
[null,"Conflict and Covid-19 Resource Hub","Culture and gender",{"$f":"COUNTIF($C$1:C340,C340)","v":12},"Culture and gender12","Conflict and Covid-19 Resource Hub","Conflict and Covid-19 Resource HubCulture and gender"]
["Nkuli","Civic Space Watch: Solidarity amid the COVID-19 crisis","Public safety and justice",{"$f":"COUNTIF($C$1:C341,C341)","v":20},"Public safety and justice20","Civic Space Watch: Solidarity amid the COVID-19 crisis","Civic Space Watch: Solidarity amid the COVID-19 crisisPublic safety and justice"]
[null,"Civic Space Watch: Solidarity amid the COVID-19 crisis","Community and social services",{"$f":"COUNTIF($C$1:C342,C342)","v":15},"Community and social services15","Civic Space Watch: Solidarity amid the COVID-19 crisis","Civic Space Watch: Solidarity amid the COVID-19 crisisCommunity and social services"]
["Promise","COVID-19 Disorder Tracker (CDT)","Public safety and justice",{"$f":"COUNTIF($C$1:C343,C343)","v":21},"Public safety and justice21","COVID-19 Disorder Tracker (CDT)","COVID-19 Disorder Tracker (CDT)Public safety and justice"]
["Nkuli","UCLA Law Covid-19 Behind Bars Data Project","Public safety and justice",{"$f":"COUNTIF($C$1:C344,C344)","v":22},"Public safety and justice22","UCLA Law Covid-19 Behind Bars Data Project","UCLA Law Covid-19 Behind Bars Data ProjectPublic safety and justice"]
["Andile","Coronavirus: prison fever","Health",{"$f":"COUNTIF($C$1:C345,C345)","v":135},"Health135","Coronavirus: prison fever","Coronavirus: prison feverHealth"]
[null,"Coronavirus: prison fever","Public safety and justice",{"$f":"COUNTIF($C$1:C346,C346)","v":23},"Public safety and justice23","Coronavirus: prison fever","Coronavirus: prison feverPublic safety and justice"]
["Nkuli","African Policy Monitor","Economic development and growth",{"$f":"COUNTIF($C$1:C347,C347)","v":37},"Economic development and growth37","African Policy Monitor","African Policy MonitorEconomic development and growth"]
[null,"African Policy Monitor","Government services",{"$f":"COUNTIF($C$1:C348,C348)","v":21},"Government services21","African Policy Monitor","African Policy MonitorGovernment services"]
[null,"African Policy Monitor","Education",{"$f":"COUNTIF($C$1:C349,C349)","v":23},"Education23","African Policy Monitor","African Policy MonitorEducation"]
[null,"African Policy Monitor","Community and social services",{"$f":"COUNTIF($C$1:C350,C350)","v":16},"Community and social services16","African Policy Monitor","African Policy MonitorCommunity and social services"]
["Nkuli","Global Policy Responses – Developed Markets ","Economic development and growth",{"$f":"COUNTIF($C$1:C351,C351)","v":38},"Economic development and growth38","Global Policy Responses – Developed Markets ","Global Policy Responses – Developed Markets Economic development and growth"]
[null,"Global Policy Responses – Developed Markets ","Government services",{"$f":"COUNTIF($C$1:C352,C352)","v":22},"Government services22","Global Policy Responses – Developed Markets ","Global Policy Responses – Developed Markets Government services"]
["Andile","Candid Philanthropic Funding Data","Food safety and security",{"$f":"COUNTIF($C$1:C353,C353)","v":11},"Food safety and security11","Candid Philanthropic Funding Data","Candid Philanthropic Funding DataFood safety and security"]
[null,"Candid Philanthropic Funding Data","Health",{"$f":"COUNTIF($C$1:C354,C354)","v":136},"Health136","Candid Philanthropic Funding Data","Candid Philanthropic Funding DataHealth"]
[null,"Candid Philanthropic Funding Data","Education",{"$f":"COUNTIF($C$1:C355,C355)","v":24},"Education24","Candid Philanthropic Funding Data","Candid Philanthropic Funding DataEducation"]
["Promise","John Hopkins Bloomberg School of Public Health","Health",{"$f":"COUNTIF($C$1:C356,C356)","v":137},"Health137","John Hopkins Bloomberg School of Public Health","John Hopkins Bloomberg School of Public HealthHealth"]
["Nkuli","Economic Relief Around the World","Economic development and growth",{"$f":"COUNTIF($C$1:C357,C357)","v":39},"Economic development and growth39","Economic Relief Around the World","Economic Relief Around the WorldEconomic development and growth"]
["Andile","Coronavirus Research Repository","Health",{"$f":"COUNTIF($C$1:C358,C358)","v":138},"Health138","Coronavirus Research Repository","Coronavirus Research RepositoryHealth"]
["Andile","BioRxiv & MedRxiv","Health",{"$f":"COUNTIF($C$1:C359,C359)","v":139},"Health139","BioRxiv & MedRxiv","BioRxiv & MedRxivHealth"]
["Promise","UNDP HDR Global Preparedness and Vulnerability Dashboard","Economic development and growth",{"$f":"COUNTIF($C$1:C360,C360)","v":40},"Economic development and growth40","UNDP HDR Global Preparedness and Vulnerability Dashboard","UNDP HDR Global Preparedness and Vulnerability DashboardEconomic development and growth"]
["Nkuli","EBSCO Medical","Health",{"$f":"COUNTIF($C$1:C361,C361)","v":140},"Health140","EBSCO Medical","EBSCO MedicalHealth"]
["Irvine","Impact Peace Resources on Covid","Health",{"$f":"COUNTIF($C$1:C362,C362)","v":141},"Health141","Impact Peace Resources on Covid","Impact Peace Resources on CovidHealth"]
[null,"Impact Peace Resources on Covid","Community and social services",{"$f":"COUNTIF($C$1:C363,C363)","v":17},"Community and social services17","Impact Peace Resources on Covid","Impact Peace Resources on CovidCommunity and social services"]
["Irvine","Springer Nature","Health",{"$f":"COUNTIF($C$1:C364,C364)","v":142},"Health142","Springer Nature","Springer NatureHealth"]
["Nkuli","Education Endowment Foundation","Education",{"$f":"COUNTIF($C$1:C365,C365)","v":25},"Education25","Education Endowment Foundation","Education Endowment FoundationEducation"]